maven-notifications mailing list archives

Site index · List index
Message view « Date » · « Thread »
Top « Date » · « Thread »
From Apache Jenkins Server <jenk...@builds.apache.org>
Subject Build unstable in Jenkins: Maven TLP » maven-wagon » master #23
Date Tue, 06 Aug 2019 21:02:52 GMT
See https://builds.apache.org/job/maven-box/job/maven-wagon/job/master/23/

Changes:

* Prevent Caused: java.io.NotSerializableException: hudson.model.User

26 tests failed.
FAILED:  org.apache.maven.wagon.providers.ftp.FtpWagonTest.windows-jdk12 / Build windows-jdk12
/ testPutDirectoryCreation

Error Message:
Failed to bind to address 0.0.0.0/0.0.0.0:10023, check configuration

Stack Trace:
org.apache.ftpserver.FtpServerConfigurationException: Failed to bind to address 0.0.0.0/0.0.0.0:10023,
check configuration
	at org.apache.maven.wagon.providers.ftp.FtpWagonTest.setupWagonTestingFixtures(FtpWagonTest.java:123)
	at org.apache.maven.wagon.providers.ftp.FtpWagonTest.testPutDirectoryCreation(FtpWagonTest.java:212)
Caused by: java.io.IOException: 
Error while binding on 0.0.0.0/0.0.0.0:10023
original message : Address already in use: bind


FAILED:  org.apache.maven.wagon.providers.ftp.FtpWagonTest.windows-jdk12 / Build windows-jdk12
/ testDefaultUserName

Error Message:
Cannot login to remote system

Stack Trace:
org.apache.maven.wagon.ConnectionException: Cannot login to remote system
	at org.apache.maven.wagon.providers.ftp.FtpWagonTest.testDefaultUserName(FtpWagonTest.java:195)
Caused by: org.apache.commons.net.ftp.FTPConnectionClosedException: Connection closed without
indication.
	at org.apache.maven.wagon.providers.ftp.FtpWagonTest.testDefaultUserName(FtpWagonTest.java:195)


FAILED:  org.apache.maven.wagon.providers.ftp.FtpWagonTest.windows-jdk12 / Build windows-jdk12
/ testFailedGetToStream

Error Message:
Could not connect to server.

Stack Trace:
org.apache.maven.wagon.authentication.AuthenticationException: Could not connect to server.
Caused by: java.net.ConnectException: Connection refused: connect


FAILED:  org.apache.maven.wagon.providers.ftp.FtpWagonTest.windows-jdk12 / Build windows-jdk12
/ testFailedGetIfNewerToStream

Error Message:
Could not connect to server.

Stack Trace:
org.apache.maven.wagon.authentication.AuthenticationException: Could not connect to server.
Caused by: java.net.ConnectException: Connection refused: connect


FAILED:  org.apache.maven.wagon.providers.ftp.FtpWagonTest.windows-jdk12 / Build windows-jdk12
/ testWagonGetIfNewerToStreamIsNewer

Error Message:

  Unexpected method call TransferListener.transferError(TransferEvent[PUT|ERROR|Repository[ftp://localhost:10023]|null|test-resource[len
= 18; mod = 1565122151657]]):
    TransferListener.transferStarted(TransferEvent[PUT|STARTED|Repository[ftp://localhost:10023]|F:\jenkins\jenkins-slave\workspace\maven-box_maven-wagon_master@2\m\wagon-providers\wagon-ftp\target\test-output\test-resource|test-resource[len
= 18; mod = 1565122151657]]): expected: 1, actual: 0
    TransferListener.transferCompleted(TransferEvent[PUT|COMPLETED|Repository[ftp://localhost:10023]|F:\jenkins\jenkins-slave\workspace\maven-box_maven-wagon_master@2\m\wagon-providers\wagon-ftp\target\test-output\test-resource|test-resource[len
= 18; mod = 1565122151657]]): expected: 1, actual: 0

Stack Trace:
java.lang.AssertionError: 

  Unexpected method call TransferListener.transferError(TransferEvent[PUT|ERROR|Repository[ftp://localhost:10023]|null|test-resource[len
= 18; mod = 1565122151657]]):
    TransferListener.transferStarted(TransferEvent[PUT|STARTED|Repository[ftp://localhost:10023]|F:\jenkins\jenkins-slave\workspace\maven-box_maven-wagon_master@2\m\wagon-providers\wagon-ftp\target\test-output\test-resource|test-resource[len
= 18; mod = 1565122151657]]): expected: 1, actual: 0
    TransferListener.transferCompleted(TransferEvent[PUT|COMPLETED|Repository[ftp://localhost:10023]|F:\jenkins\jenkins-slave\workspace\maven-box_maven-wagon_master@2\m\wagon-providers\wagon-ftp\target\test-output\test-resource|test-resource[len
= 18; mod = 1565122151657]]): expected: 1, actual: 0


FAILED:  org.apache.maven.wagon.providers.ftp.FtpWagonTest.windows-jdk12 / Build windows-jdk12
/ testWagonGetIfNewerToStreamIsOlder

Error Message:

  Unexpected method call TransferListener.transferError(TransferEvent[GET|ERROR|Repository[ftp://localhost:10023]|null|test-resource[len
= -1; mod = 0]]):
    TransferListener.transferStarted(TransferEvent[GET|STARTED|Repository[ftp://localhost:10023]|null|test-resource[len
= 18; mod = 0]]): expected: 1, actual: 0
    TransferListener.transferCompleted(TransferEvent[GET|COMPLETED|Repository[ftp://localhost:10023]|F:\jenkins\jenkins-slave\workspace\maven-box_maven-wagon_master@2\m\wagon-providers\wagon-ftp\target\test-output\testWagonGetIfNewerToStreamIsOlder\testWagonGetIfNewerToStreamIsOlder|test-resource[len
= 18; mod = 0]]): expected: 1, actual: 0

Stack Trace:
java.lang.AssertionError: 

  Unexpected method call TransferListener.transferError(TransferEvent[GET|ERROR|Repository[ftp://localhost:10023]|null|test-resource[len
= -1; mod = 0]]):
    TransferListener.transferStarted(TransferEvent[GET|STARTED|Repository[ftp://localhost:10023]|null|test-resource[len
= 18; mod = 0]]): expected: 1, actual: 0
    TransferListener.transferCompleted(TransferEvent[GET|COMPLETED|Repository[ftp://localhost:10023]|F:\jenkins\jenkins-slave\workspace\maven-box_maven-wagon_master@2\m\wagon-providers\wagon-ftp\target\test-output\testWagonGetIfNewerToStreamIsOlder\testWagonGetIfNewerToStreamIsOlder|test-resource[len
= 18; mod = 0]]): expected: 1, actual: 0


FAILED:  org.apache.maven.wagon.providers.ftp.FtpWagonTest.windows-jdk12 / Build windows-jdk12
/ testStreamingWagon

Error Message:

  Unexpected method call TransferListener.transferStarted(TransferEvent[GET|STARTED|Repository[ftp://localhost:10023]|null|test-resource[len
= 18; mod = 1565122140000]]):
    TransferListener.transferStarted(TransferEvent[GET|STARTED|Repository[ftp://localhost:10023]|null|test-resource[len
= 18; mod = 0]]): expected: 1, actual: 0
    TransferListener.transferCompleted(TransferEvent[GET|COMPLETED|Repository[ftp://localhost:10023]|F:\jenkins\jenkins-slave\workspace\maven-box_maven-wagon_master@2\m\wagon-providers\wagon-ftp\target\test-output\testStreamingWagon\testStreamingWagon|test-resource[len
= 18; mod = 0]]): expected: 1, actual: 0

Stack Trace:
java.lang.AssertionError: 

  Unexpected method call TransferListener.transferStarted(TransferEvent[GET|STARTED|Repository[ftp://localhost:10023]|null|test-resource[len
= 18; mod = 1565122140000]]):
    TransferListener.transferStarted(TransferEvent[GET|STARTED|Repository[ftp://localhost:10023]|null|test-resource[len
= 18; mod = 0]]): expected: 1, actual: 0
    TransferListener.transferCompleted(TransferEvent[GET|COMPLETED|Repository[ftp://localhost:10023]|F:\jenkins\jenkins-slave\workspace\maven-box_maven-wagon_master@2\m\wagon-providers\wagon-ftp\target\test-output\testStreamingWagon\testStreamingWagon|test-resource[len
= 18; mod = 0]]): expected: 1, actual: 0


FAILED:  org.apache.maven.wagon.providers.ftp.FtpWagonTest.windows-jdk12 / Build windows-jdk12
/ testWagonGetIfNewerToStreamIsSame

Error Message:

  Unexpected method call TransferListener.transferStarted(TransferEvent[GET|STARTED|Repository[ftp://localhost:10023]|null|test-resource[len
= 18; mod = 1565122140000]]):

Stack Trace:
java.lang.AssertionError: 

  Unexpected method call TransferListener.transferStarted(TransferEvent[GET|STARTED|Repository[ftp://localhost:10023]|null|test-resource[len
= 18; mod = 1565122140000]]):


FAILED:  org.apache.maven.wagon.providers.ftp.FtpWagonTest.windows-jdk12 / Build windows-jdk12
/ testWagonPutDirectoryDeepDestination

Error Message:
IOException caught while processing path at F:\jenkins\jenkins-slave\workspace\maven-box_maven-wagon_master@2\m\wagon-providers\wagon-ftp\target\test-output\deep0\deep1\deep2

Stack Trace:
org.apache.maven.wagon.TransferFailedException: IOException caught while processing path at
F:\jenkins\jenkins-slave\workspace\maven-box_maven-wagon_master@2\m\wagon-providers\wagon-ftp\target\test-output\deep0\deep1\deep2
Caused by: org.apache.commons.net.ftp.FTPConnectionClosedException: Connection closed without
indication.


FAILED:  org.apache.maven.wagon.providers.ftp.FtpWagonTest.windows-jdk12 / Build windows-jdk12
/ testWagonGetFileListWhenDirectoryDoesNotExist

Error Message:
Could not connect to server.

Stack Trace:
org.apache.maven.wagon.authentication.AuthenticationException: Could not connect to server.
Caused by: java.net.ConnectException: Connection refused: connect


FAILED:  org.apache.maven.wagon.providers.ftp.FtpWagonTest.windows-jdk12 / Build windows-jdk12
/ testWagon

Error Message:
Could not connect to server.

Stack Trace:
org.apache.maven.wagon.authentication.AuthenticationException: Could not connect to server.
Caused by: java.net.ConnectException: Connection refused: connect


FAILED:  org.apache.maven.wagon.providers.ftp.FtpWagonTest.windows-jdk12 / Build windows-jdk12
/ testWagonPutDirectoryForDot

Error Message:
Could not connect to server.

Stack Trace:
org.apache.maven.wagon.authentication.AuthenticationException: Could not connect to server.
Caused by: java.net.ConnectException: Connection refused: connect


FAILED:  org.apache.maven.wagon.providers.ftp.FtpWagonTest.windows-jdk12 / Build windows-jdk12
/ testWagonGetIfNewerIsNewer

Error Message:
Could not connect to server.

Stack Trace:
org.apache.maven.wagon.authentication.AuthenticationException: Could not connect to server.
Caused by: java.net.ConnectException: Connection refused: connect


FAILED:  org.apache.maven.wagon.providers.ftp.FtpWagonTest.windows-jdk12 / Build windows-jdk12
/ testWagonGetIfNewerIsOlder

Error Message:
Could not connect to server.

Stack Trace:
org.apache.maven.wagon.authentication.AuthenticationException: Could not connect to server.
Caused by: java.net.ConnectException: Connection refused: connect


FAILED:  org.apache.maven.wagon.providers.ftp.FtpWagonTest.windows-jdk12 / Build windows-jdk12
/ testWagonGetFileList

Error Message:
Could not connect to server.

Stack Trace:
org.apache.maven.wagon.authentication.AuthenticationException: Could not connect to server.
Caused by: java.net.ConnectException: Connection refused: connect


FAILED:  org.apache.maven.wagon.providers.ftp.FtpWagonTest.windows-jdk12 / Build windows-jdk12
/ testFailedGet

Error Message:
Could not connect to server.

Stack Trace:
org.apache.maven.wagon.authentication.AuthenticationException: Could not connect to server.
Caused by: java.net.ConnectException: Connection refused: connect


FAILED:  org.apache.maven.wagon.providers.ftp.FtpWagonTest.windows-jdk12 / Build windows-jdk12
/ testWagonPutDirectoryWhenDirectoryAlreadyExists

Error Message:
Could not connect to server.

Stack Trace:
org.apache.maven.wagon.authentication.AuthenticationException: Could not connect to server.
Caused by: java.net.ConnectException: Connection refused: connect


FAILED:  org.apache.maven.wagon.providers.ftp.FtpWagonTest.windows-jdk12 / Build windows-jdk12
/ testWagonResourceExists

Error Message:
Could not connect to server.

Stack Trace:
org.apache.maven.wagon.authentication.AuthenticationException: Could not connect to server.
Caused by: java.net.ConnectException: Connection refused: connect


FAILED:  org.apache.maven.wagon.providers.ftp.FtpWagonTest.windows-jdk12 / Build windows-jdk12
/ testFailedGetIfNewer

Error Message:
Could not connect to server.

Stack Trace:
org.apache.maven.wagon.authentication.AuthenticationException: Could not connect to server.
Caused by: java.net.ConnectException: Connection refused: connect


FAILED:  org.apache.maven.wagon.providers.ftp.FtpWagonTest.windows-jdk12 / Build windows-jdk12
/ testWagonResourceNotExists

Error Message:
Could not connect to server.

Stack Trace:
org.apache.maven.wagon.authentication.AuthenticationException: Could not connect to server.
Caused by: java.net.ConnectException: Connection refused: connect


FAILED:  org.apache.maven.wagon.providers.ftp.FtpWagonTest.windows-jdk12 / Build windows-jdk12
/ testWagonPutDirectory

Error Message:
Could not connect to server.

Stack Trace:
org.apache.maven.wagon.authentication.AuthenticationException: Could not connect to server.
Caused by: java.net.ConnectException: Connection refused: connect


FAILED:  org.apache.maven.wagon.providers.ftp.FtpWagonTest.windows-jdk12 / Build windows-jdk12
/ testWagonGetIfNewerIsSame

Error Message:
Could not connect to server.

Stack Trace:
org.apache.maven.wagon.authentication.AuthenticationException: Could not connect to server.
Caused by: java.net.ConnectException: Connection refused: connect


FAILED:  org.apache.maven.wagon.providers.http.HttpWagonTimeoutTest.windows-jdk8 / Build windows-jdk8
/ testResourceExits

Error Message:
Address already in use: bind

Stack Trace:
java.net.BindException: Address already in use: bind
	at org.apache.maven.wagon.providers.http.HttpWagonTimeoutTest.setUp(HttpWagonTimeoutTest.java:45)


FAILED:  org.apache.maven.wagon.providers.http.HttpWagonTimeoutTest.windows-jdk8 / Build windows-jdk8
/ testGetTimeout

Error Message:
Address already in use: bind

Stack Trace:
java.net.BindException: Address already in use: bind
	at org.apache.maven.wagon.providers.http.HttpWagonTimeoutTest.setUp(HttpWagonTimeoutTest.java:45)


FAILED:  org.apache.maven.wagon.providers.http.HttpWagonTimeoutTest.windows-jdk8 / Build windows-jdk8
/ testConnectionTimeout

Error Message:
Address already in use: bind

Stack Trace:
java.net.BindException: Address already in use: bind
	at org.apache.maven.wagon.providers.http.HttpWagonTimeoutTest.setUp(HttpWagonTimeoutTest.java:45)


FAILED:  org.apache.maven.wagon.providers.http.HttpWagonTimeoutTest.windows-jdk8 / Build windows-jdk8
/ testGetFileList

Error Message:
Address already in use: bind

Stack Trace:
java.net.BindException: Address already in use: bind
	at org.apache.maven.wagon.providers.http.HttpWagonTimeoutTest.setUp(HttpWagonTimeoutTest.java:45)




Build log:
[...truncated 27441 lines...]
[INFO] 
[INFO] --- maven-enforcer-plugin:3.0.0-M2:enforce (ban-known-bad-maven-versions) @ wagon-webdav-jackrabbit
---
[INFO] 
[INFO] --- maven-enforcer-plugin:3.0.0-M2:enforce (default) @ wagon-webdav-jackrabbit ---
[INFO] 
[INFO] --- apache-rat-plugin:0.12:check (rat-check) @ wagon-webdav-jackrabbit ---
[INFO] Enabled default license matchers.
[INFO] Will parse SCM ignores for exclusions...
[INFO] Finished adding exclusions from SCM ignore files.
[INFO] 61 implicit excludes (use -debug for more details).
[INFO] Exclude: .checkstyle
[INFO] Exclude: **/*.odg
[INFO] Exclude: src/test/resources/**
[INFO] Exclude: src/main/resources/default-server-root/**
[INFO] Exclude: src/main/resources/ssh-keys/**
[INFO] Exclude: src/test/ssh-keys/**
[INFO] Exclude: .repository/**
[INFO] Exclude: out/**
[INFO] Exclude: .repository/**
[INFO] Exclude: .maven/spy.log
[INFO] Exclude: dependency-reduced-pom.xml
[INFO] Exclude: .java-version
[INFO] 12 resources included (use -debug for more details)
[INFO] Rat check: Summary over all files. Unapproved: 0, unknown: 0, generated: 0, approved:
12 licenses.
[INFO] 
[INFO] --- maven-remote-resources-plugin:1.5:process (process-resource-bundles) @ wagon-webdav-jackrabbit
---
[INFO] 
[INFO] --- maven-resources-plugin:3.1.0:resources (default-resources) @ wagon-webdav-jackrabbit
---
[INFO] Using 'UTF-8' encoding to copy filtered resources.
[INFO] Copying 1 resource
[INFO] Copying 3 resources
[INFO] 
[INFO] --- maven-compiler-plugin:3.7.0:compile (default-compile) @ wagon-webdav-jackrabbit
---
[INFO] Changes detected - recompiling the module!
[INFO] Compiling 4 source files to /home/jenkins/jenkins-slave/workspace/maven-box_maven-wagon_master/m/wagon-providers/wagon-webdav-jackrabbit/target/classes
[INFO] /home/jenkins/jenkins-slave/workspace/maven-box_maven-wagon_master/m/wagon-providers/wagon-webdav-jackrabbit/src/main/java/org/apache/maven/wagon/providers/webdav/WebDavWagon.java:
/home/jenkins/jenkins-slave/workspace/maven-box_maven-wagon_master/m/wagon-providers/wagon-webdav-jackrabbit/src/main/java/org/apache/maven/wagon/providers/webdav/WebDavWagon.java
uses or overrides a deprecated API.
[INFO] /home/jenkins/jenkins-slave/workspace/maven-box_maven-wagon_master/m/wagon-providers/wagon-webdav-jackrabbit/src/main/java/org/apache/maven/wagon/providers/webdav/WebDavWagon.java:
Recompile with -Xlint:deprecation for details.
[INFO] 
[INFO] --- plexus-component-metadata:1.7.1:generate-metadata (generate) @ wagon-webdav-jackrabbit
---
[INFO] Discovered 1 component descriptors(s)
[INFO] 
[INFO] --- animal-sniffer-maven-plugin:1.15:check (check-java-1.7-compat) @ wagon-webdav-jackrabbit
---
[INFO] Checking unresolved references to org.codehaus.mojo.signature:java17:1.0
[INFO] 
[INFO] --- maven-resources-plugin:3.1.0:testResources (default-testResources) @ wagon-webdav-jackrabbit
---
[INFO] Using 'UTF-8' encoding to copy filtered resources.
[INFO] Copying 2 resources
[INFO] Copying 3 resources
[INFO] 
[INFO] --- maven-compiler-plugin:3.7.0:testCompile (default-testCompile) @ wagon-webdav-jackrabbit
---
[INFO] Changes detected - recompiling the module!
[INFO] Compiling 4 source files to /home/jenkins/jenkins-slave/workspace/maven-box_maven-wagon_master/m/wagon-providers/wagon-webdav-jackrabbit/target/test-classes
[INFO] /home/jenkins/jenkins-slave/workspace/maven-box_maven-wagon_master/m/wagon-providers/wagon-webdav-jackrabbit/src/test/java/org/apache/maven/wagon/providers/webdav/HttpClientWagonTest.java:
/home/jenkins/jenkins-slave/workspace/maven-box_maven-wagon_master/m/wagon-providers/wagon-webdav-jackrabbit/src/test/java/org/apache/maven/wagon/providers/webdav/HttpClientWagonTest.java
uses or overrides a deprecated API.
[INFO] /home/jenkins/jenkins-slave/workspace/maven-box_maven-wagon_master/m/wagon-providers/wagon-webdav-jackrabbit/src/test/java/org/apache/maven/wagon/providers/webdav/HttpClientWagonTest.java:
Recompile with -Xlint:deprecation for details.
[INFO] 
[INFO] --- maven-surefire-plugin:2.20:test (default-test) @ wagon-webdav-jackrabbit ---
[INFO] 
[INFO] -------------------------------------------------------
[INFO]  T E S T S
[INFO] -------------------------------------------------------
[INFO] Running org.apache.maven.wagon.providers.webdav.WebDavWagonTest
[INFO] Tests run: 69, Failures: 0, Errors: 0, Skipped: 0, Time elapsed: 25.378 s - in org.apache.maven.wagon.providers.webdav.WebDavWagonTest
[INFO] 
[INFO] Results:
[INFO] 
[INFO] Tests run: 145, Failures: 0, Errors: 0, Skipped: 0
[INFO] 
[INFO] 
[INFO] --- maven-jar-plugin:3.1.0:jar (default-jar) @ wagon-webdav-jackrabbit ---
[INFO] Building jar: /home/jenkins/jenkins-slave/workspace/maven-box_maven-wagon_master/m/wagon-providers/wagon-webdav-jackrabbit/target/wagon-webdav-jackrabbit-3.3.4-SNAPSHOT.jar
[INFO] 
[INFO] --- maven-site-plugin:3.7.1:attach-descriptor (attach-descriptor) @ wagon-webdav-jackrabbit
---
[INFO] Skipping because packaging 'jar' is not pom.
[INFO] 
[INFO] --- maven-checkstyle-plugin:3.0.0:check (checkstyle-check) @ wagon-webdav-jackrabbit
---
[INFO] ------------------------------------------------------------------------
[INFO] Reactor Summary for Apache Maven Wagon 3.3.4-SNAPSHOT:
[INFO] 
[INFO] Apache Maven Wagon ................................. SUCCESS [ 13.955 s]
[INFO] Apache Maven Wagon :: API .......................... SUCCESS [  6.927 s]
[INFO] Apache Maven Wagon :: Provider Test ................ SUCCESS [  2.364 s]
[INFO] Apache Maven Wagon :: Providers .................... SUCCESS [  0.731 s]
[INFO] Apache Maven Wagon :: Providers :: File Provider ... SUCCESS [  2.244 s]
[INFO] Apache Maven Wagon :: Providers :: FTP Provider .... SUCCESS [  7.036 s]
[INFO] Apache Maven Wagon :: Providers :: HTTP Shared Library SUCCESS [  3.045 s]
[INFO] Apache Maven Wagon :: Test Compatibility Kits ...... SUCCESS [  0.556 s]
[INFO] Apache Maven Wagon :: HTTP Test Compatibility Kit .. SUCCESS [  1.502 s]
[INFO] Apache Maven Wagon :: Providers :: HTTP Provider ... SUCCESS [05:07 min]
[INFO] Apache Maven Wagon :: Providers :: Lightweight HTTP Provider SUCCESS [02:04 min]
[INFO] Apache Maven Wagon :: Providers :: SCM Provider .... SUCCESS [ 14.058 s]
[INFO] Apache Maven Wagon :: Providers :: SSH Common Library SUCCESS [  1.687 s]
[INFO] Apache Maven Wagon :: Providers :: SSH Common Tests  SUCCESS [  1.442 s]
[INFO] Apache Maven Wagon :: Providers :: SSH External Provider SUCCESS [  0.966 s]
[INFO] Apache Maven Wagon :: Providers :: SSH Provider .... SUCCESS [  1.587 s]
[INFO] Apache Maven Wagon :: Providers :: WebDAV Provider . SUCCESS [ 57.708 s]
[INFO] ------------------------------------------------------------------------
[INFO] BUILD SUCCESS
[INFO] ------------------------------------------------------------------------
[INFO] Total time:  09:12 min
[INFO] Finished at: 2019-08-06T21:01:16Z
[INFO] ------------------------------------------------------------------------
[WARNING] The requested profile "run-its" could not be activated because it does not exist.
[INFO] [jenkins-event-spy] Generated /home/jenkins/jenkins-slave/workspace/maven-box_maven-wagon_master@tmp/withMaven5a103e37/maven-spy-20190806-205203-7533918934778540525675.log
[Pipeline] }
[Pipeline] // dir
[Pipeline] }
[withMaven] junitPublisher - Archive test results for Maven artifact org.apache.maven.wagon:wagon-provider-api:jar:3.3.4-SNAPSHOT
generated by maven-surefire-plugin:test (default-test): m/wagon-provider-api/target/surefire-reports/*.xml
[withMaven] junitPublisher - Archive test results for Maven artifact org.apache.maven.wagon:wagon-provider-test:jar:3.3.4-SNAPSHOT
generated by maven-surefire-plugin:test (default-test): m/wagon-provider-test/target/surefire-reports/*.xml
[withMaven] junitPublisher - Archive test results for Maven artifact org.apache.maven.wagon:wagon-file:jar:3.3.4-SNAPSHOT
generated by maven-surefire-plugin:test (default-test): m/wagon-providers/wagon-file/target/surefire-reports/*.xml
[withMaven] junitPublisher - Archive test results for Maven artifact org.apache.maven.wagon:wagon-ftp:jar:3.3.4-SNAPSHOT
generated by maven-surefire-plugin:test (default-test): m/wagon-providers/wagon-ftp/target/surefire-reports/*.xml
[withMaven] junitPublisher - Archive test results for Maven artifact org.apache.maven.wagon:wagon-http-shared:jar:3.3.4-SNAPSHOT
generated by maven-surefire-plugin:test (default-test): m/wagon-providers/wagon-http-shared/target/surefire-reports/*.xml
[withMaven] junitPublisher - Archive test results for Maven artifact org.apache.maven.wagon:wagon-tck-http:jar:3.3.4-SNAPSHOT
generated by maven-surefire-plugin:test (default-test): m/wagon-tcks/wagon-tck-http/target/surefire-reports/*.xml
[withMaven] junitPublisher - Archive test results for Maven artifact org.apache.maven.wagon:wagon-http:jar:3.3.4-SNAPSHOT
generated by maven-surefire-plugin:test (default-test): m/wagon-providers/wagon-http/target/surefire-reports/*.xml
[withMaven] junitPublisher - Archive test results for Maven artifact org.apache.maven.wagon:wagon-http-lightweight:jar:3.3.4-SNAPSHOT
generated by maven-surefire-plugin:test (default-test): m/wagon-providers/wagon-http-lightweight/target/surefire-reports/*.xml
[withMaven] junitPublisher - Archive test results for Maven artifact org.apache.maven.wagon:wagon-scm:jar:3.3.4-SNAPSHOT
generated by maven-surefire-plugin:test (default-test): m/wagon-providers/wagon-scm/target/surefire-reports/*.xml
[withMaven] junitPublisher - Archive test results for Maven artifact org.apache.maven.wagon:wagon-ssh-common:jar:3.3.4-SNAPSHOT
generated by maven-surefire-plugin:test (default-test): m/wagon-providers/wagon-ssh-common/target/surefire-reports/*.xml
[withMaven] junitPublisher - Archive test results for Maven artifact org.apache.maven.wagon:wagon-ssh-common-test:jar:3.3.4-SNAPSHOT
generated by maven-surefire-plugin:test (default-test): m/wagon-providers/wagon-ssh-common-test/target/surefire-reports/*.xml
[withMaven] junitPublisher - Archive test results for Maven artifact org.apache.maven.wagon:wagon-ssh-external:jar:3.3.4-SNAPSHOT
generated by maven-surefire-plugin:test (default-test): m/wagon-providers/wagon-ssh-external/target/surefire-reports/*.xml
[withMaven] junitPublisher - Archive test results for Maven artifact org.apache.maven.wagon:wagon-ssh:jar:3.3.4-SNAPSHOT
generated by maven-surefire-plugin:test (default-test): m/wagon-providers/wagon-ssh/target/surefire-reports/*.xml
[withMaven] junitPublisher - Archive test results for Maven artifact org.apache.maven.wagon:wagon-webdav-jackrabbit:jar:3.3.4-SNAPSHOT
generated by maven-surefire-plugin:test (default-test): m/wagon-providers/wagon-webdav-jackrabbit/target/surefire-reports/*.xml
Recording test results
[withMaven] Publishers: Pipeline Graph Publisher: 14 ms, Invoker Publisher: 2 ms, Junit Publisher:
25588 ms, Concordion Publisher: 1 ms, Dependencies Fingerprint Publisher: 6811 ms, JGiven
Publisher: 1 ms, Jacoco Publisher: 1 ms, SpotBugs Publisher: 1 ms
[Pipeline] // withMaven
[INFO] Tests run: 69, Failures: 0, Errors: 0, Skipped: 0, Time elapsed: 27.856 s - in org.apache.maven.wagon.providers.webdav.WebDavWagonTest
[INFO] Running org.apache.maven.wagon.providers.webdav.HttpClientWagonTest
[INFO] Tests run: 6, Failures: 0, Errors: 0, Skipped: 0, Time elapsed: 0.002 s - in org.apache.maven.wagon.providers.webdav.HttpClientWagonTest
[INFO] Running org.apache.maven.wagon.providers.webdav.PathNavigatorTest
[INFO] Tests run: 1, Failures: 0, Errors: 0, Skipped: 0, Time elapsed: 0.001 s - in org.apache.maven.wagon.providers.webdav.PathNavigatorTest
[INFO] Running org.apache.maven.wagon.providers.webdav.WebDavsWagonTest
[Pipeline] cleanWs
[WS-CLEANUP] Deleting project workspace...
[WS-CLEANUP] Deferred wipeout is used...
[WS-CLEANUP] done
[Pipeline] }
[Pipeline] // stage
[Pipeline] }
[Pipeline] // node
[Pipeline] }
[withMaven] Publishers: Pipeline Graph Publisher: 33 ms, Invoker Publisher: 2 ms, Junit Publisher:
24852 ms, Concordion Publisher: 2 ms, Dependencies Fingerprint Publisher: 6711 ms, JGiven
Publisher: 1 ms, Jacoco Publisher: 1 ms, SpotBugs Publisher: 1 ms
[Pipeline] // withMaven
[Pipeline] cleanWs
[WS-CLEANUP] Deleting project workspace...
[WS-CLEANUP] Deferred wipeout is used...
[WS-CLEANUP] done
[Pipeline] }
[Pipeline] // stage
[Pipeline] }
[Pipeline] // node
[Pipeline] }
[INFO] Tests run: 69, Failures: 0, Errors: 0, Skipped: 0, Time elapsed: 27.706 s - in org.apache.maven.wagon.providers.webdav.WebDavsWagonTest
[INFO] 
[INFO] Results:
[INFO] 
[INFO] Tests run: 145, Failures: 0, Errors: 0, Skipped: 0
[INFO] 
[INFO] 
[INFO] --- maven-jar-plugin:3.1.0:jar (default-jar) @ wagon-webdav-jackrabbit ---
[INFO] Building jar: /home/jenkins/jenkins-slave/workspace/maven-box_maven-wagon_master/m/wagon-providers/wagon-webdav-jackrabbit/target/wagon-webdav-jackrabbit-3.3.4-SNAPSHOT.jar
[INFO] 
[INFO] --- maven-site-plugin:3.7.1:attach-descriptor (attach-descriptor) @ wagon-webdav-jackrabbit
---
[INFO] Skipping because packaging 'jar' is not pom.
[INFO] 
[INFO] --- maven-checkstyle-plugin:3.0.0:check (checkstyle-check) @ wagon-webdav-jackrabbit
---
[INFO] 
[INFO] --- maven-install-plugin:2.5.2:install (default-install) @ wagon-webdav-jackrabbit
---
[INFO] Installing /home/jenkins/jenkins-slave/workspace/maven-box_maven-wagon_master/m/wagon-providers/wagon-webdav-jackrabbit/target/wagon-webdav-jackrabbit-3.3.4-SNAPSHOT.jar
to /home/jenkins/jenkins-slave/workspace/maven-box_maven-wagon_master/.repository/org/apache/maven/wagon/wagon-webdav-jackrabbit/3.3.4-SNAPSHOT/wagon-webdav-jackrabbit-3.3.4-SNAPSHOT.jar
[INFO] Installing /home/jenkins/jenkins-slave/workspace/maven-box_maven-wagon_master/m/wagon-providers/wagon-webdav-jackrabbit/pom.xml
to /home/jenkins/jenkins-slave/workspace/maven-box_maven-wagon_master/.repository/org/apache/maven/wagon/wagon-webdav-jackrabbit/3.3.4-SNAPSHOT/wagon-webdav-jackrabbit-3.3.4-SNAPSHOT.pom
[INFO] 
[INFO] --- maven-deploy-plugin:2.8.2:deploy (default-deploy) @ wagon-webdav-jackrabbit ---
[INFO] Downloading from apache.snapshots.https: https://repository.apache.org/content/repositories/snapshots/org/apache/maven/wagon/wagon-webdav-jackrabbit/3.3.4-SNAPSHOT/maven-metadata.xml
[INFO] Downloaded from apache.snapshots.https: https://repository.apache.org/content/repositories/snapshots/org/apache/maven/wagon/wagon-webdav-jackrabbit/3.3.4-SNAPSHOT/maven-metadata.xml
(795 B at 1.0 kB/s)
[INFO] Uploading to apache.snapshots.https: https://repository.apache.org/content/repositories/snapshots/org/apache/maven/wagon/wagon-webdav-jackrabbit/3.3.4-SNAPSHOT/wagon-webdav-jackrabbit-3.3.4-20190806.210208-4.jar
[INFO] Uploaded to apache.snapshots.https: https://repository.apache.org/content/repositories/snapshots/org/apache/maven/wagon/wagon-webdav-jackrabbit/3.3.4-SNAPSHOT/wagon-webdav-jackrabbit-3.3.4-20190806.210208-4.jar
(21 kB at 14 kB/s)
[INFO] Uploading to apache.snapshots.https: https://repository.apache.org/content/repositories/snapshots/org/apache/maven/wagon/wagon-webdav-jackrabbit/3.3.4-SNAPSHOT/wagon-webdav-jackrabbit-3.3.4-20190806.210208-4.pom
[INFO] Uploaded to apache.snapshots.https: https://repository.apache.org/content/repositories/snapshots/org/apache/maven/wagon/wagon-webdav-jackrabbit/3.3.4-SNAPSHOT/wagon-webdav-jackrabbit-3.3.4-20190806.210208-4.pom
(5.3 kB at 3.8 kB/s)
[INFO] Downloading from apache.snapshots.https: https://repository.apache.org/content/repositories/snapshots/org/apache/maven/wagon/wagon-webdav-jackrabbit/maven-metadata.xml
[INFO] Downloaded from apache.snapshots.https: https://repository.apache.org/content/repositories/snapshots/org/apache/maven/wagon/wagon-webdav-jackrabbit/maven-metadata.xml
(405 B at 559 B/s)
[INFO] Uploading to apache.snapshots.https: https://repository.apache.org/content/repositories/snapshots/org/apache/maven/wagon/wagon-webdav-jackrabbit/3.3.4-SNAPSHOT/maven-metadata.xml
[INFO] Uploaded to apache.snapshots.https: https://repository.apache.org/content/repositories/snapshots/org/apache/maven/wagon/wagon-webdav-jackrabbit/3.3.4-SNAPSHOT/maven-metadata.xml
(795 B at 597 B/s)
[INFO] Uploading to apache.snapshots.https: https://repository.apache.org/content/repositories/snapshots/org/apache/maven/wagon/wagon-webdav-jackrabbit/maven-metadata.xml
[INFO] Uploaded to apache.snapshots.https: https://repository.apache.org/content/repositories/snapshots/org/apache/maven/wagon/wagon-webdav-jackrabbit/maven-metadata.xml
(405 B at 276 B/s)
[INFO] ------------------------------------------------------------------------
[INFO] Reactor Summary for Apache Maven Wagon 3.3.4-SNAPSHOT:
[INFO] 
[INFO] Apache Maven Wagon ................................. SUCCESS [ 23.970 s]
[INFO] Apache Maven Wagon :: API .......................... SUCCESS [ 13.280 s]
[INFO] Apache Maven Wagon :: Provider Test ................ SUCCESS [  9.847 s]
[INFO] Apache Maven Wagon :: Providers .................... SUCCESS [  9.372 s]
[INFO] Apache Maven Wagon :: Providers :: File Provider ... SUCCESS [  9.284 s]
[INFO] Apache Maven Wagon :: Providers :: FTP Provider .... SUCCESS [ 13.889 s]
[INFO] Apache Maven Wagon :: Providers :: HTTP Shared Library SUCCESS [ 10.195 s]
[INFO] Apache Maven Wagon :: Test Compatibility Kits ...... SUCCESS [  9.144 s]
[INFO] Apache Maven Wagon :: HTTP Test Compatibility Kit .. SUCCESS [  8.623 s]
[INFO] Apache Maven Wagon :: Providers :: HTTP Provider ... SUCCESS [04:59 min]
[INFO] Apache Maven Wagon :: Providers :: Lightweight HTTP Provider SUCCESS [02:10 min]
[INFO] Apache Maven Wagon :: Providers :: SCM Provider .... SUCCESS [ 43.926 s]
[INFO] Apache Maven Wagon :: Providers :: SSH Common Library SUCCESS [  8.715 s]
[INFO] Apache Maven Wagon :: Providers :: SSH Common Tests  SUCCESS [  8.608 s]
[INFO] Apache Maven Wagon :: Providers :: SSH External Provider SUCCESS [  8.048 s]
[INFO] Apache Maven Wagon :: Providers :: SSH Provider .... SUCCESS [  9.128 s]
[INFO] Apache Maven Wagon :: Providers :: WebDAV Provider . SUCCESS [01:04 min]
[INFO] ------------------------------------------------------------------------
[INFO] BUILD SUCCESS
[INFO] ------------------------------------------------------------------------
[INFO] Total time:  11:22 min
[INFO] Finished at: 2019-08-06T21:02:14Z
[INFO] ------------------------------------------------------------------------
[WARNING] The requested profile "run-its" could not be activated because it does not exist.
[INFO] [jenkins-event-spy] Generated /home/jenkins/jenkins-slave/workspace/maven-box_maven-wagon_master@tmp/withMaveneb00dc9e/maven-spy-20190806-205052-6094414272333622791166.log
[Pipeline] }
[Pipeline] // dir
[Pipeline] }
[withMaven] junitPublisher - Archive test results for Maven artifact org.apache.maven.wagon:wagon-provider-api:jar:3.3.4-SNAPSHOT
generated by maven-surefire-plugin:test (default-test): m/wagon-provider-api/target/surefire-reports/*.xml
[withMaven] junitPublisher - Archive test results for Maven artifact org.apache.maven.wagon:wagon-provider-test:jar:3.3.4-SNAPSHOT
generated by maven-surefire-plugin:test (default-test): m/wagon-provider-test/target/surefire-reports/*.xml
[withMaven] junitPublisher - Archive test results for Maven artifact org.apache.maven.wagon:wagon-file:jar:3.3.4-SNAPSHOT
generated by maven-surefire-plugin:test (default-test): m/wagon-providers/wagon-file/target/surefire-reports/*.xml
[withMaven] junitPublisher - Archive test results for Maven artifact org.apache.maven.wagon:wagon-ftp:jar:3.3.4-SNAPSHOT
generated by maven-surefire-plugin:test (default-test): m/wagon-providers/wagon-ftp/target/surefire-reports/*.xml
[withMaven] junitPublisher - Archive test results for Maven artifact org.apache.maven.wagon:wagon-http-shared:jar:3.3.4-SNAPSHOT
generated by maven-surefire-plugin:test (default-test): m/wagon-providers/wagon-http-shared/target/surefire-reports/*.xml
[withMaven] junitPublisher - Archive test results for Maven artifact org.apache.maven.wagon:wagon-tck-http:jar:3.3.4-SNAPSHOT
generated by maven-surefire-plugin:test (default-test): m/wagon-tcks/wagon-tck-http/target/surefire-reports/*.xml
[withMaven] junitPublisher - Archive test results for Maven artifact org.apache.maven.wagon:wagon-http:jar:3.3.4-SNAPSHOT
generated by maven-surefire-plugin:test (default-test): m/wagon-providers/wagon-http/target/surefire-reports/*.xml
[withMaven] junitPublisher - Archive test results for Maven artifact org.apache.maven.wagon:wagon-http-lightweight:jar:3.3.4-SNAPSHOT
generated by maven-surefire-plugin:test (default-test): m/wagon-providers/wagon-http-lightweight/target/surefire-reports/*.xml
[withMaven] junitPublisher - Archive test results for Maven artifact org.apache.maven.wagon:wagon-scm:jar:3.3.4-SNAPSHOT
generated by maven-surefire-plugin:test (default-test): m/wagon-providers/wagon-scm/target/surefire-reports/*.xml
[withMaven] junitPublisher - Archive test results for Maven artifact org.apache.maven.wagon:wagon-ssh-common:jar:3.3.4-SNAPSHOT
generated by maven-surefire-plugin:test (default-test): m/wagon-providers/wagon-ssh-common/target/surefire-reports/*.xml
[withMaven] junitPublisher - Archive test results for Maven artifact org.apache.maven.wagon:wagon-ssh-common-test:jar:3.3.4-SNAPSHOT
generated by maven-surefire-plugin:test (default-test): m/wagon-providers/wagon-ssh-common-test/target/surefire-reports/*.xml
[withMaven] junitPublisher - Archive test results for Maven artifact org.apache.maven.wagon:wagon-ssh-external:jar:3.3.4-SNAPSHOT
generated by maven-surefire-plugin:test (default-test): m/wagon-providers/wagon-ssh-external/target/surefire-reports/*.xml
[withMaven] junitPublisher - Archive test results for Maven artifact org.apache.maven.wagon:wagon-ssh:jar:3.3.4-SNAPSHOT
generated by maven-surefire-plugin:test (default-test): m/wagon-providers/wagon-ssh/target/surefire-reports/*.xml
[withMaven] junitPublisher - Archive test results for Maven artifact org.apache.maven.wagon:wagon-webdav-jackrabbit:jar:3.3.4-SNAPSHOT
generated by maven-surefire-plugin:test (default-test): m/wagon-providers/wagon-webdav-jackrabbit/target/surefire-reports/*.xml
Recording test results
[withMaven] Publishers: Pipeline Graph Publisher: 14 ms, Invoker Publisher: 2 ms, Junit Publisher:
25823 ms, Concordion Publisher: 2 ms, Dependencies Fingerprint Publisher: 6821 ms, JGiven
Publisher: 1 ms, Jacoco Publisher: 1 ms, SpotBugs Publisher: 1 ms
[Pipeline] // withMaven
[Pipeline] cleanWs
[WS-CLEANUP] Deleting project workspace...
[WS-CLEANUP] Deferred wipeout is used...
[WS-CLEANUP] done
[Pipeline] }
[Pipeline] // stage
[Pipeline] }
[Pipeline] // node
[Pipeline] }
[Pipeline] // parallel
[Pipeline] stage
[Pipeline] { (Notifications)
[Pipeline] echo
Build result: UNSTABLE
[Pipeline] jiraIssueSelector
[Pipeline] echo
The authors of changes [rfscholte].
[Pipeline] echo
Sending email ...
[Pipeline] emailext
Mime
  • Unnamed multipart/mixed (inline, None, 0 bytes)
View raw message