maven-notifications mailing list archives

Site index · List index
Message view « Date » · « Thread »
Top « Date » · « Thread »
From Apache Jenkins Server <jenk...@builds.apache.org>
Subject Build failed in Jenkins: Maven TLP » maven-dependency-plugin » MDEP-655 #8
Date Thu, 08 Aug 2019 18:18:12 GMT
See https://builds.apache.org/job/maven-box/job/maven-dependency-plugin/job/MDEP-655/8/

No changes.

All tests passed

Build log:
[...truncated 10553 lines...]
[INFO] 
[INFO] --- maven-invoker-plugin:3.1.0:verify (integration-test) @ maven-dependency-plugin
---
[INFO] -------------------------------------------------
[INFO] Build Summary:
[INFO]   Passed: 59, Failed: 0, Errors: 0, Skipped: 1
[INFO] -------------------------------------------------
[INFO] ------------------------------------------------------------------------
[INFO] BUILD SUCCESS
[INFO] ------------------------------------------------------------------------
[INFO] Total time:  07:23 min
[INFO] Finished at: 2019-08-07T11:01:13-07:00
[INFO] ------------------------------------------------------------------------
[INFO] [jenkins-event-spy] Generated F:\jenkins\jenkins-slave\workspace\maven-dependency-plugin_MDEP-655@4@2@tmp\withMavenc0d42d6e\maven-spy-20190807-105349-72116533559341902829750.log
[Pipeline] }
[Pipeline] // dir
[Pipeline] }
[withMaven] artifactsPublisher - Archive artifact windows-jdk12-m3.6.x_build\pom.xml under
org\apache\maven\plugins\maven-dependency-plugin\3.1.2-SNAPSHOT\maven-dependency-plugin-3.1.2-SNAPSHOT.pom
[withMaven] artifactsPublisher - Archive artifact windows-jdk12-m3.6.x_build\target\maven-dependency-plugin-3.1.2-SNAPSHOT.jar
under org\apache\maven\plugins\maven-dependency-plugin\3.1.2-SNAPSHOT\maven-dependency-plugin-3.1.2-SNAPSHOT.jar
[withMaven] junitPublisher - Archive test results for Maven artifact org.apache.maven.plugins:maven-dependency-plugin:maven-plugin:3.1.2-SNAPSHOT
generated by maven-surefire-plugin:test (default-test): windows-jdk12-m3.6.x_build\target\surefire-reports\*.xml
Recording test results
[INFO] run post-build script verify.groovy
[INFO]           unpack-dependencies\pom.xml ...................... SUCCESS (9.6 s)
[INFO] Building: unpack-dependencies-with-filemappers\pom.xml
[withMaven] openTasksPublisher - Scan Tasks for Maven artifact org.apache.maven.plugins:maven-dependency-plugin:maven-plugin:3.1.2-SNAPSHOT
in source directory windows-jdk12-m3.6.x_build\src\main\java
[TASKS] Scanning folder 'f:\jenkins\jenkins-slave\workspace\maven-dependency-plugin_MDEP-655@4@2'
for files matching the pattern 'windows-jdk12-m3.6.x_build\src\main\java\**\*' - excludes:
null
[TASKS] Found 48 files to scan for tasks
[TASKS] Found 4 open tasks.
Skipping warnings blame since pipelines do not have an SCM link.%n
[TASKS] Computing warning deltas based on reference build #7
[withMaven] invokerPublisher - Archive invoker results for Maven artifact MavenArtifact{org.apache.maven.plugins:maven-dependency-plugin:maven-plugin:3.1.2-SNAPSHOT(version:
3.1.2-SNAPSHOT, snapshot:false) } generated by PluginInvocation{org.apache.maven.plugins:maven-invoker-plugin:3.1.0@integration-test
 integration-test}: windows-jdk12-m3.6.x_build\target\invoker-reports\*.xml
[INFO] run post-build script verify.groovy
[INFO]           unpack-dependencies-with-filemappers\pom.xml ..... SUCCESS (8.1 s)
[INFO] Building: unpack-from-remote-repository\pom.xml
[INFO] run pre-build script setup.bsh
[INFO] run post-build script verify.bsh
[INFO]           unpack-from-remote-repository\pom.xml ............ SUCCESS (6.5 s)
[INFO] Building: used-dependencies\pom.xml
[withMaven] Publishers: Generated Artifacts Publisher: 105 ms, Junit Publisher: 779 ms, Open
Task Scanner Publisher: 125 ms, Invoker Publisher: 16578 ms, Pipeline Graph Publisher: 1 ms
[Pipeline] // withMaven
[Pipeline] cleanWs
[WS-CLEANUP] Deleting project workspace...
[WS-CLEANUP] Deferred wipeout is used...
[WS-CLEANUP] done
[Pipeline] }
[Pipeline] // stage
[Pipeline] }
[Pipeline] // ws
[Pipeline] }
[Pipeline] // node
[Pipeline] }
[INFO]           used-dependencies\pom.xml ........................ SUCCESS (6.5 s)
[INFO] Building: purge-local-repository-without-pom
[INFO] run pre-build script setup.bsh
[INFO] run post-build script verify.groovy
[INFO]           purge-local-repository-without-pom ............... SUCCESS (4.5 s)
[INFO] 
[INFO] --- mrm-maven-plugin:1.2.0:stop (default) @ maven-dependency-plugin ---
[INFO] Stopping Mock Repository Manager on http://localhost:65281
[INFO] Stopped SocketConnector@0.0.0.0:65281
[INFO] Mock Repository Manager http://localhost:65281 is stopped.
[INFO] 
[INFO] --- maven-checkstyle-plugin:3.0.0:check (checkstyle-check) @ maven-dependency-plugin
---
[INFO] There is 1 error reported by Checkstyle 6.18 with config/maven_checks.xml ruleset.
[INFO] Ignored 1 error, 0 violation remaining.
[INFO] 
[INFO] --- maven-invoker-plugin:3.1.0:verify (integration-test) @ maven-dependency-plugin
---
[INFO] -------------------------------------------------
[INFO] Build Summary:
[INFO]   Passed: 59, Failed: 0, Errors: 0, Skipped: 1
[INFO] -------------------------------------------------
[INFO] ------------------------------------------------------------------------
[INFO] BUILD SUCCESS
[INFO] ------------------------------------------------------------------------
[INFO] Total time:  07:40 min
[INFO] Finished at: 2019-08-07T11:01:42-07:00
[INFO] ------------------------------------------------------------------------
[INFO] [jenkins-event-spy] Generated F:\jenkins\jenkins-slave\workspace\maven-dependency-plugin_MDEP-655@3@tmp\withMaven8acfffb8\maven-spy-20190807-105401-3165209454787769084453.log
[Pipeline] }
[Pipeline] // dir
[Pipeline] }
[withMaven] artifactsPublisher - Archive artifact windows-jdk13-m3.6.x_build\pom.xml under
org\apache\maven\plugins\maven-dependency-plugin\3.1.2-SNAPSHOT\maven-dependency-plugin-3.1.2-SNAPSHOT.pom
[withMaven] artifactsPublisher - Archive artifact windows-jdk13-m3.6.x_build\target\maven-dependency-plugin-3.1.2-SNAPSHOT.jar
under org\apache\maven\plugins\maven-dependency-plugin\3.1.2-SNAPSHOT\maven-dependency-plugin-3.1.2-SNAPSHOT.jar
[withMaven] junitPublisher - Archive test results for Maven artifact org.apache.maven.plugins:maven-dependency-plugin:maven-plugin:3.1.2-SNAPSHOT
generated by maven-surefire-plugin:test (default-test): windows-jdk13-m3.6.x_build\target\surefire-reports\*.xml
Recording test results
[withMaven] openTasksPublisher - Scan Tasks for Maven artifact org.apache.maven.plugins:maven-dependency-plugin:maven-plugin:3.1.2-SNAPSHOT
in source directory windows-jdk13-m3.6.x_build\src\main\java
[TASKS] Scanning folder 'f:\jenkins\jenkins-slave\workspace\maven-dependency-plugin_MDEP-655@3'
for files matching the pattern 'windows-jdk13-m3.6.x_build\src\main\java\**\*' - excludes:
null
[TASKS] Found 48 files to scan for tasks
[TASKS] Found 4 open tasks.
Skipping warnings blame since pipelines do not have an SCM link.%n
[TASKS] Computing warning deltas based on reference build #7
[withMaven] invokerPublisher - Archive invoker results for Maven artifact MavenArtifact{org.apache.maven.plugins:maven-dependency-plugin:maven-plugin:3.1.2-SNAPSHOT(version:
3.1.2-SNAPSHOT, snapshot:false) } generated by PluginInvocation{org.apache.maven.plugins:maven-invoker-plugin:3.1.0@integration-test
 integration-test}: windows-jdk13-m3.6.x_build\target\invoker-reports\*.xml
[withMaven] Publishers: Generated Artifacts Publisher: 106 ms, Junit Publisher: 631 ms, Open
Task Scanner Publisher: 118 ms, Dependencies Fingerprint Publisher: 1 ms, Invoker Publisher:
17136 ms
[Pipeline] // withMaven
[Pipeline] cleanWs
[WS-CLEANUP] Deleting project workspace...
[WS-CLEANUP] Deferred wipeout is used...
[WS-CLEANUP] done
[Pipeline] }
[Pipeline] // stage
[Pipeline] }
[Pipeline] // ws
[Pipeline] }
[Pipeline] // node
[Pipeline] }
[INFO] run post-build script verify.bsh
[INFO]           purge-local-repository-version-range\pom.xml ..... SUCCESS (905.1 s)
[INFO] Building: resolve\pom.xml
[INFO]           resolve\pom.xml .................................. SUCCESS (4.0 s)
[INFO] Building: resolve-plugins\pom.xml
[INFO]           resolve-plugins\pom.xml .......................... SUCCESS (4.8 s)
[INFO] Building: resolve-plugins-exclude-reactor\pom.xml
[INFO] run post-build script verify.groovy
[INFO]           resolve-plugins-exclude-reactor\pom.xml .......... SUCCESS (6.2 s)
[INFO] Building: resolve-plugins-with-exclude\pom.xml
[INFO] run post-build script verify.groovy
[INFO]           resolve-plugins-with-exclude\pom.xml ............. SUCCESS (4.1 s)
[INFO] Building: sources\pom.xml
[INFO]           sources\pom.xml .................................. SUCCESS (4.6 s)
[INFO] Building: tree\pom.xml
[INFO]           tree\pom.xml ..................................... SKIPPED due to Maven version
[INFO] Building: tree-includes\pom.xml
[INFO] run post-build script verify.bsh
[INFO]           tree-includes\pom.xml ............................ SUCCESS (4.1 s)
[INFO] Building: tree-multimodule\pom.xml
[INFO] run post-build script verify.bsh
[INFO]           tree-multimodule\pom.xml ......................... SUCCESS (4.5 s)
[INFO] Building: unpack\pom.xml
[INFO] run post-build script verify.bsh
[INFO]           unpack\pom.xml ................................... SUCCESS (5.5 s)
[INFO] Building: unpack-cli\pom.xml
[INFO] run post-build script verify.bsh
[INFO]           unpack-cli\pom.xml ............................... SUCCESS (4.6 s)
[INFO] Building: unpack-custom-ear\pom.xml
[INFO] run post-build script verify.groovy
[INFO]           unpack-custom-ear\pom.xml ........................ SUCCESS (4.3 s)
[INFO] Building: unpack-dependencies\pom.xml
[INFO] run post-build script verify.groovy
[INFO]           unpack-dependencies\pom.xml ...................... SUCCESS (7.4 s)
[INFO] Building: unpack-dependencies-with-filemappers\pom.xml
[INFO] run post-build script verify.groovy
[INFO]           unpack-dependencies-with-filemappers\pom.xml ..... SUCCESS (5.8 s)
[INFO] Building: unpack-from-remote-repository\pom.xml
[INFO] run pre-build script setup.bsh
[INFO] run post-build script verify.bsh
[INFO]           unpack-from-remote-repository\pom.xml ............ SUCCESS (4.8 s)
[INFO] Building: used-dependencies\pom.xml
[INFO]           used-dependencies\pom.xml ........................ SUCCESS (5.3 s)
[INFO] Building: purge-local-repository-without-pom
[INFO] run pre-build script setup.bsh
[INFO] run post-build script verify.groovy
[INFO]           purge-local-repository-without-pom ............... SUCCESS (3.8 s)
[INFO] 
[INFO] --- mrm-maven-plugin:1.2.0:stop (default) @ maven-dependency-plugin ---
[INFO] Stopping Mock Repository Manager on http://localhost:61644
[INFO] Stopped SocketConnector@0.0.0.0:61644
[INFO] Mock Repository Manager http://localhost:61644 is stopped.
[INFO] 
[INFO] --- maven-checkstyle-plugin:3.0.0:check (checkstyle-check) @ maven-dependency-plugin
---
[INFO] There is 1 error reported by Checkstyle 6.18 with config/maven_checks.xml ruleset.
[INFO] Ignored 1 error, 0 violation remaining.
[INFO] 
[INFO] --- maven-invoker-plugin:3.1.0:verify (integration-test) @ maven-dependency-plugin
---
[INFO] -------------------------------------------------
[INFO] Build Summary:
[INFO]   Passed: 54, Failed: 0, Errors: 0, Skipped: 6
[INFO] -------------------------------------------------
[INFO] ------------------------------------------------------------------------
[INFO] BUILD SUCCESS
[INFO] ------------------------------------------------------------------------
[INFO] Total time: 21:43 min
[INFO] Finished at: 2019-08-07T11:08:29-07:00
[INFO] Final Memory: 71M/1490M
[INFO] ------------------------------------------------------------------------
[INFO] [jenkins-event-spy] Generated F:\jenkins\jenkins-slave\workspace\maven-dependency-plugin_MDEP-655@3@tmp\withMaven63c6c27f\maven-spy-20190807-104645-3293348816577591996496.log
Picked up JAVA_TOOL_OPTIONS: -Dmaven.ext.class.path="f:\jenkins\jenkins-slave\workspace\maven-dependency-plugin_MDEP-655@3@tmp\withMaven63c6c27f\pipeline-maven-spy.jar"
-Dorg.jenkinsci.plugins.pipeline.maven.reportsFolder="f:\jenkins\jenkins-slave\workspace\maven-dependency-plugin_MDEP-655@3@tmp\withMaven63c6c27f"

[Pipeline] }
[Pipeline] // dir
[Pipeline] }
[withMaven] artifactsPublisher - Archive artifact windows-jdk7-m3.5.x_build\pom.xml under
org\apache\maven\plugins\maven-dependency-plugin\3.1.2-SNAPSHOT\maven-dependency-plugin-3.1.2-SNAPSHOT.pom
[withMaven] artifactsPublisher - Archive artifact windows-jdk7-m3.5.x_build\target\maven-dependency-plugin-3.1.2-SNAPSHOT.jar
under org\apache\maven\plugins\maven-dependency-plugin\3.1.2-SNAPSHOT\maven-dependency-plugin-3.1.2-SNAPSHOT.jar
[withMaven] junitPublisher - Archive test results for Maven artifact org.apache.maven.plugins:maven-dependency-plugin:maven-plugin:3.1.2-SNAPSHOT
generated by maven-surefire-plugin:test (default-test): windows-jdk7-m3.5.x_build\target\surefire-reports\*.xml
Recording test results
[withMaven] openTasksPublisher - Scan Tasks for Maven artifact org.apache.maven.plugins:maven-dependency-plugin:maven-plugin:3.1.2-SNAPSHOT
in source directory windows-jdk7-m3.5.x_build\src\main\java
[TASKS] Scanning folder 'f:\jenkins\jenkins-slave\workspace\maven-dependency-plugin_MDEP-655@3'
for files matching the pattern 'windows-jdk7-m3.5.x_build\src\main\java\**\*' - excludes:
null
[TASKS] Found 48 files to scan for tasks
[TASKS] Found 4 open tasks.
Skipping warnings blame since pipelines do not have an SCM link.%n
[TASKS] Computing warning deltas based on reference build #7
[withMaven] invokerPublisher - Archive invoker results for Maven artifact MavenArtifact{org.apache.maven.plugins:maven-dependency-plugin:maven-plugin:3.1.2-SNAPSHOT(version:
3.1.2-SNAPSHOT, snapshot:false) } generated by PluginInvocation{org.apache.maven.plugins:maven-invoker-plugin:3.1.0@integration-test
 integration-test}: windows-jdk7-m3.5.x_build\target\invoker-reports\*.xml
[withMaven] Publishers: Generated Artifacts Publisher: 109 ms, Junit Publisher: 723 ms, Open
Task Scanner Publisher: 127 ms, Dependencies Fingerprint Publisher: 1 ms, Invoker Publisher:
17086 ms, Pipeline Graph Publisher: 28 ms
[Pipeline] // withMaven
[Pipeline] cleanWs
[WS-CLEANUP] Deleting project workspace...
[WS-CLEANUP] Deferred wipeout is used...
[WS-CLEANUP] done
[Pipeline] }
[Pipeline] // stage
[Pipeline] }
[Pipeline] // ws
[Pipeline] }
[Pipeline] // node
[Pipeline] }
[INFO]           setup-custom-ear-lifecycle/pom.xml ............... FAILED (1802.4 s)
[INFO]   The build exited with code 1. See /home/jenkins/jenkins-slave/workspace/maven-dependency-plugin_MDEP-655@2/linux-jdk11-m3.6.x_build/target/it/setup-custom-ear-lifecycle/build.log
for details.
[INFO] Setup done.
[INFO] Building: purge-local-repository-version-range/pom.xml
[INFO] run post-build script verify.bsh
[INFO]           purge-local-repository-version-range/pom.xml ..... FAILED (82810.2 s)
[INFO]   The post-build script did not succeed. Direct dependency jar was not re-resolved:
/home/jenkins/jenkins-slave/workspace/maven-dependency-plugin_MDEP-655@2/linux-jdk11-m3.6.x_build/target/local-repo/org/apache/maven/its/dependency/purge-local-repository/1.0/purge-local-repository-1.0.jar
[INFO] Building: analyze-ignore-unused-declared-dependency/pom.xml
Aborted by khmarbaise
Sending interrupt signal to process
Sending interrupt signal to process
[INFO]           analyze-ignore-unused-declared-dependency/pom.xml  FAILED (3352.1 s)
[INFO]   The build exited with code 143. See /home/jenkins/jenkins-slave/workspace/maven-dependency-plugin_MDEP-655@2/linux-jdk11-m3.6.x_build/target/it/analyze-ignore-unused-declared-dependency/build.log
for details.
[INFO] Building: resolve-plugins-with-exclude/pom.xml
script returned exit code 143
[Pipeline] }
[Pipeline] // dir
[Pipeline] }
[withMaven] One or multiple Maven executions have been ignored by the Jenkins Pipeline Maven
Plugin because they have been interrupted before completion (1). See Pipeline Maven Plugin
FAQ for more details.
[Pipeline] // withMaven
[Pipeline] cleanWs
[WS-CLEANUP] Deleting project workspace...
[WS-CLEANUP] Deferred wipeout is used...
[WS-CLEANUP] done
[Pipeline] cleanWs
[WS-CLEANUP] Deleting project workspace...
[WS-CLEANUP] Deferred wipeout is used...
[WS-CLEANUP] done
[Pipeline] }
[Pipeline] // stage
[Pipeline] }
[Pipeline] // ws
[Pipeline] }
[Pipeline] // node
[Pipeline] }
Failed in branch linux-jdk11-m3.6.x_build
[Pipeline] // parallel
[Pipeline] stage
[Pipeline] { (Notifications)
[Pipeline] echo
Build result: FAILURE
[Pipeline] jiraIssueSelector
[Pipeline] echo
The authors of changes [].
[Pipeline] echo
Sending email ...
[Pipeline] emailext
Mime
  • Unnamed multipart/mixed (inline, None, 0 bytes)
View raw message