maven-notifications mailing list archives

Site index · List index
Message view « Date » · « Thread »
Top « Date » · « Thread »
From Apache Jenkins Server <jenk...@builds.apache.org>
Subject Build failed in Jenkins: Maven TLP » maven-archetype » master #44
Date Mon, 12 Aug 2019 17:53:23 GMT
See https://builds.apache.org/job/maven-box/job/maven-archetype/job/master/44/

Changes:

* NotSerializableException: hudson.plugins.git.GitChangeSetList
* investigating permissions to the call 'ChangeSetList.author'
* NotSerializableException: hudson.plugins.git.GitChangeSetList
* [INFRA-18734] Jenkins builds fail on email notifications due to unknown
* Prevent Caused: java.io.NotSerializableException: hudson.model.User

All tests passed

Build log:
[...truncated 21243 lines...]
[INFO] snapshot com.company.proficio:proficio-archetype:1.0-SNAPSHOT: checking for updates
from apache-snapshots
[INFO] snapshot com.company.proficio:proficio-archetype:1.0-SNAPSHOT: checking for updates
from Nexus
[INFO] artifact com.company.proficio.proficio-archetype:1.0-SNAPSHOT: checking for updates
from central
[INFO] run post-build script verify.groovy
[INFO]           roundtrip-multi\pom.xml .......................... SUCCESS (23.3 s)
[INFO] 
[INFO] --- mrm-maven-plugin:1.2.0:stop (mirror) @ maven-archetype-plugin ---
[INFO] Stopping Mock Repository Manager on http://localhost:50270
[INFO] Stopped SocketConnector@0.0.0.0:50270
[INFO] Mock Repository Manager http://localhost:50270 is stopped.
[INFO] 
[INFO] --- mrm-maven-plugin:1.2.0:stop (archetype-repository) @ maven-archetype-plugin ---
[INFO] Stopping Mock Repository Manager on http://localhost:50273
[INFO] Stopped SocketConnector@0.0.0.0:50273
[INFO] Mock Repository Manager http://localhost:50273 is stopped.
[INFO] 
[INFO] --- maven-checkstyle-plugin:3.0.0:check (checkstyle-check) @ maven-archetype-plugin
---
[INFO] There are 46 errors reported by Checkstyle 6.18 with config/maven_checks.xml ruleset.
[INFO] Ignored 46 errors, 0 violation remaining.
[INFO] 
[INFO] --- maven-invoker-plugin:3.2.0:verify (invoker-verify) @ maven-archetype-plugin ---
[INFO] -------------------------------------------------
[INFO] Build Summary:
[INFO]   Passed: 25, Failed: 0, Errors: 0, Skipped: 0
[INFO] -------------------------------------------------
[INFO] ------------------------------------------------------------------------
[INFO] Reactor Summary for Maven Archetype 3.1.2-SNAPSHOT:
[INFO] 
[INFO] Maven Archetype .................................... SUCCESS [ 43.666 s]
[INFO] Maven Archetype Models ............................. SUCCESS [  0.927 s]
[INFO] Maven Archetype Catalog Model ...................... SUCCESS [ 12.623 s]
[INFO] Maven Archetype Descriptor Model ................... SUCCESS [  1.901 s]
[INFO] Maven Archetype Common ............................. SUCCESS [ 40.167 s]
[INFO] Maven Archetype Packaging .......................... SUCCESS [  0.546 s]
[INFO] Maven Archetype Plugin ............................. SUCCESS [06:37 min]
[INFO] ------------------------------------------------------------------------
[INFO] BUILD SUCCESS
[INFO] ------------------------------------------------------------------------
[INFO] Total time:  08:17 min
[INFO] Finished at: 2019-08-12T10:53:01-07:00
[INFO] ------------------------------------------------------------------------
[INFO] [jenkins-event-spy] Generated F:\short\jenkins-maven-box-maven-archetype-master-44@3@tmp\withMavenf2a2e739\maven-spy-20190812-104443-40712410173108411184084.log
[Pipeline] }
[Pipeline] // dir
[Pipeline] }
[INFO] There are 46 errors reported by Checkstyle 6.18 with config/maven_checks.xml ruleset.
[INFO] Ignored 46 errors, 0 violation remaining.
[INFO] 
[INFO] --- maven-invoker-plugin:3.2.0:verify (invoker-verify) @ maven-archetype-plugin ---
[INFO] -------------------------------------------------
[INFO] Build Summary:
[INFO]   Passed: 25, Failed: 0, Errors: 0, Skipped: 0
[INFO] -------------------------------------------------
[INFO] ------------------------------------------------------------------------
[INFO] Reactor Summary for Maven Archetype 3.1.2-SNAPSHOT:
[INFO] 
[INFO] Maven Archetype .................................... SUCCESS [ 42.837 s]
[INFO] Maven Archetype Models ............................. SUCCESS [  1.158 s]
[INFO] Maven Archetype Catalog Model ...................... SUCCESS [ 12.920 s]
[INFO] Maven Archetype Descriptor Model ................... SUCCESS [  1.707 s]
[INFO] Maven Archetype Common ............................. SUCCESS [ 40.531 s]
[INFO] Maven Archetype Packaging .......................... SUCCESS [  0.436 s]
[INFO] Maven Archetype Plugin ............................. SUCCESS [06:37 min]
[INFO] ------------------------------------------------------------------------
[INFO] BUILD SUCCESS
[INFO] ------------------------------------------------------------------------
[INFO] Total time:  08:18 min
[INFO] Finished at: 2019-08-12T10:53:01-07:00
[INFO] ------------------------------------------------------------------------
[INFO] [jenkins-event-spy] Generated F:\short\jenkins-maven-box-maven-archetype-master-44@2@tmp\withMavene4735258\maven-spy-20190812-104443-37512338946298199998729.log
[Pipeline] }
[withMaven] artifactsPublisher - Archive artifact j13m3.6.xb\pom.xml under org\apache\maven\archetype\maven-archetype\3.1.2-SNAPSHOT\maven-archetype-3.1.2-SNAPSHOT.pom
[withMaven] artifactsPublisher - Archive artifact j13m3.6.xb\target\maven-archetype-3.1.2-SNAPSHOT-site.xml
under org\apache\maven\archetype\maven-archetype\3.1.2-SNAPSHOT\maven-archetype-3.1.2-SNAPSHOT-site.xml
[Pipeline] // dir
[withMaven] artifactsPublisher - Archive artifact j13m3.6.xb\archetype-models\pom.xml under
org\apache\maven\archetype\archetype-models\3.1.2-SNAPSHOT\archetype-models-3.1.2-SNAPSHOT.pom
[Pipeline] }
[withMaven] artifactsPublisher - Archive artifact j13m3.6.xb\archetype-models\target\archetype-models-3.1.2-SNAPSHOT-site.xml
under org\apache\maven\archetype\archetype-models\3.1.2-SNAPSHOT\archetype-models-3.1.2-SNAPSHOT-site.xml
[withMaven] artifactsPublisher - Archive artifact j13m3.6.xb\archetype-models\archetype-catalog\pom.xml
under org\apache\maven\archetype\archetype-catalog\3.1.2-SNAPSHOT\archetype-catalog-3.1.2-SNAPSHOT.pom
[withMaven] artifactsPublisher - Archive artifact j13m3.6.xb\archetype-models\archetype-catalog\target\archetype-catalog-3.1.2-SNAPSHOT.jar
under org\apache\maven\archetype\archetype-catalog\3.1.2-SNAPSHOT\archetype-catalog-3.1.2-SNAPSHOT.jar
[withMaven] artifactsPublisher - Archive artifact j11m3.6.xb\pom.xml under org\apache\maven\archetype\maven-archetype\3.1.2-SNAPSHOT\maven-archetype-3.1.2-SNAPSHOT.pom
[withMaven] artifactsPublisher - Archive artifact j13m3.6.xb\archetype-models\archetype-descriptor\pom.xml
under org\apache\maven\archetype\archetype-descriptor\3.1.2-SNAPSHOT\archetype-descriptor-3.1.2-SNAPSHOT.pom
[withMaven] artifactsPublisher - Archive artifact j11m3.6.xb\target\maven-archetype-3.1.2-SNAPSHOT-site.xml
under org\apache\maven\archetype\maven-archetype\3.1.2-SNAPSHOT\maven-archetype-3.1.2-SNAPSHOT-site.xml
[withMaven] artifactsPublisher - Archive artifact j13m3.6.xb\archetype-models\archetype-descriptor\target\archetype-descriptor-3.1.2-SNAPSHOT.jar
under org\apache\maven\archetype\archetype-descriptor\3.1.2-SNAPSHOT\archetype-descriptor-3.1.2-SNAPSHOT.jar
[withMaven] artifactsPublisher - Archive artifact j11m3.6.xb\archetype-models\pom.xml under
org\apache\maven\archetype\archetype-models\3.1.2-SNAPSHOT\archetype-models-3.1.2-SNAPSHOT.pom
[withMaven] artifactsPublisher - Archive artifact j13m3.6.xb\archetype-common\pom.xml under
org\apache\maven\archetype\archetype-common\3.1.2-SNAPSHOT\archetype-common-3.1.2-SNAPSHOT.pom
[withMaven] artifactsPublisher - Archive artifact j11m3.6.xb\archetype-models\target\archetype-models-3.1.2-SNAPSHOT-site.xml
under org\apache\maven\archetype\archetype-models\3.1.2-SNAPSHOT\archetype-models-3.1.2-SNAPSHOT-site.xml
[withMaven] artifactsPublisher - Archive artifact j13m3.6.xb\archetype-common\target\archetype-common-3.1.2-SNAPSHOT.jar
under org\apache\maven\archetype\archetype-common\3.1.2-SNAPSHOT\archetype-common-3.1.2-SNAPSHOT.jar
[withMaven] artifactsPublisher - Archive artifact j11m3.6.xb\archetype-models\archetype-catalog\pom.xml
under org\apache\maven\archetype\archetype-catalog\3.1.2-SNAPSHOT\archetype-catalog-3.1.2-SNAPSHOT.pom
[withMaven] artifactsPublisher - Archive artifact j13m3.6.xb\archetype-packaging\pom.xml under
org\apache\maven\archetype\archetype-packaging\3.1.2-SNAPSHOT\archetype-packaging-3.1.2-SNAPSHOT.pom
[withMaven] artifactsPublisher - Archive artifact j11m3.6.xb\archetype-models\archetype-catalog\target\archetype-catalog-3.1.2-SNAPSHOT.jar
under org\apache\maven\archetype\archetype-catalog\3.1.2-SNAPSHOT\archetype-catalog-3.1.2-SNAPSHOT.jar
[withMaven] artifactsPublisher - Archive artifact j13m3.6.xb\archetype-packaging\target\archetype-packaging-3.1.2-SNAPSHOT.jar
under org\apache\maven\archetype\archetype-packaging\3.1.2-SNAPSHOT\archetype-packaging-3.1.2-SNAPSHOT.jar
[withMaven] artifactsPublisher - Archive artifact j11m3.6.xb\archetype-models\archetype-descriptor\pom.xml
under org\apache\maven\archetype\archetype-descriptor\3.1.2-SNAPSHOT\archetype-descriptor-3.1.2-SNAPSHOT.pom
[withMaven] artifactsPublisher - Archive artifact j13m3.6.xb\maven-archetype-plugin\pom.xml
under org\apache\maven\plugins\maven-archetype-plugin\3.1.2-SNAPSHOT\maven-archetype-plugin-3.1.2-SNAPSHOT.pom
[withMaven] artifactsPublisher - Archive artifact j11m3.6.xb\archetype-models\archetype-descriptor\target\archetype-descriptor-3.1.2-SNAPSHOT.jar
under org\apache\maven\archetype\archetype-descriptor\3.1.2-SNAPSHOT\archetype-descriptor-3.1.2-SNAPSHOT.jar
[withMaven] artifactsPublisher - Archive artifact j13m3.6.xb\maven-archetype-plugin\target\maven-archetype-plugin-3.1.2-SNAPSHOT.jar
under org\apache\maven\plugins\maven-archetype-plugin\3.1.2-SNAPSHOT\maven-archetype-plugin-3.1.2-SNAPSHOT.jar
[withMaven] artifactsPublisher - Archive artifact j11m3.6.xb\archetype-common\pom.xml under
org\apache\maven\archetype\archetype-common\3.1.2-SNAPSHOT\archetype-common-3.1.2-SNAPSHOT.pom
[withMaven] artifactsPublisher - Archive artifact j11m3.6.xb\archetype-common\target\archetype-common-3.1.2-SNAPSHOT.jar
under org\apache\maven\archetype\archetype-common\3.1.2-SNAPSHOT\archetype-common-3.1.2-SNAPSHOT.jar
[withMaven] artifactsPublisher - Archive artifact j11m3.6.xb\archetype-packaging\pom.xml under
org\apache\maven\archetype\archetype-packaging\3.1.2-SNAPSHOT\archetype-packaging-3.1.2-SNAPSHOT.pom
[withMaven] artifactsPublisher - Archive artifact j11m3.6.xb\archetype-packaging\target\archetype-packaging-3.1.2-SNAPSHOT.jar
under org\apache\maven\archetype\archetype-packaging\3.1.2-SNAPSHOT\archetype-packaging-3.1.2-SNAPSHOT.jar
[withMaven] artifactsPublisher - Archive artifact j11m3.6.xb\maven-archetype-plugin\pom.xml
under org\apache\maven\plugins\maven-archetype-plugin\3.1.2-SNAPSHOT\maven-archetype-plugin-3.1.2-SNAPSHOT.pom
[withMaven] artifactsPublisher - Archive artifact j11m3.6.xb\maven-archetype-plugin\target\maven-archetype-plugin-3.1.2-SNAPSHOT.jar
under org\apache\maven\plugins\maven-archetype-plugin\3.1.2-SNAPSHOT\maven-archetype-plugin-3.1.2-SNAPSHOT.jar
[withMaven] junitPublisher - Archive test results for Maven artifact org.apache.maven.archetype:archetype-catalog:jar:3.1.2-SNAPSHOT
generated by maven-surefire-plugin:test (default-test): j13m3.6.xb\archetype-models\archetype-catalog\target\surefire-reports\*.xml
[withMaven] junitPublisher - Archive test results for Maven artifact org.apache.maven.archetype:archetype-descriptor:jar:3.1.2-SNAPSHOT
generated by maven-surefire-plugin:test (default-test): j13m3.6.xb\archetype-models\archetype-descriptor\target\surefire-reports\*.xml
[withMaven] junitPublisher - Archive test results for Maven artifact org.apache.maven.archetype:archetype-common:jar:3.1.2-SNAPSHOT
generated by maven-surefire-plugin:test (default-test): j13m3.6.xb\archetype-common\target\surefire-reports\*.xml
[withMaven] junitPublisher - Archive test results for Maven artifact org.apache.maven.archetype:archetype-packaging:jar:3.1.2-SNAPSHOT
generated by maven-surefire-plugin:test (default-test): j13m3.6.xb\archetype-packaging\target\surefire-reports\*.xml
[withMaven] junitPublisher - Archive test results for Maven artifact org.apache.maven.plugins:maven-archetype-plugin:maven-plugin:3.1.2-SNAPSHOT
generated by maven-surefire-plugin:test (default-test): j13m3.6.xb\maven-archetype-plugin\target\surefire-reports\*.xml
Recording test results
[withMaven] junitPublisher - Archive test results for Maven artifact org.apache.maven.archetype:archetype-catalog:jar:3.1.2-SNAPSHOT
generated by maven-surefire-plugin:test (default-test): j11m3.6.xb\archetype-models\archetype-catalog\target\surefire-reports\*.xml
[withMaven] junitPublisher - Archive test results for Maven artifact org.apache.maven.archetype:archetype-descriptor:jar:3.1.2-SNAPSHOT
generated by maven-surefire-plugin:test (default-test): j11m3.6.xb\archetype-models\archetype-descriptor\target\surefire-reports\*.xml
[withMaven] junitPublisher - Archive test results for Maven artifact org.apache.maven.archetype:archetype-common:jar:3.1.2-SNAPSHOT
generated by maven-surefire-plugin:test (default-test): j11m3.6.xb\archetype-common\target\surefire-reports\*.xml
[withMaven] junitPublisher - Archive test results for Maven artifact org.apache.maven.archetype:archetype-packaging:jar:3.1.2-SNAPSHOT
generated by maven-surefire-plugin:test (default-test): j11m3.6.xb\archetype-packaging\target\surefire-reports\*.xml
[withMaven] junitPublisher - Archive test results for Maven artifact org.apache.maven.plugins:maven-archetype-plugin:maven-plugin:3.1.2-SNAPSHOT
generated by maven-surefire-plugin:test (default-test): j11m3.6.xb\maven-archetype-plugin\target\surefire-reports\*.xml
Recording test results
[withMaven] openTasksPublisher - Scan Tasks for Maven artifact org.apache.maven.archetype:archetype-common:jar:3.1.2-SNAPSHOT
in source directory j13m3.6.xb\archetype-common\src\main\java
[withMaven] openTasksPublisher - Scan Tasks for Maven artifact org.apache.maven.plugins:maven-archetype-plugin:maven-plugin:3.1.2-SNAPSHOT
in source directory j13m3.6.xb\maven-archetype-plugin\src\main\java
[TASKS] Scanning folder 'F:\short\jenkins-maven-box-maven-archetype-master-44@3' for files
matching the pattern 'j13m3.6.xb\archetype-common\src\main\java\**\*,j13m3.6.xb\maven-archetype-plugin\src\main\java\**\*'
- excludes: null
[TASKS] Found 89 files to scan for tasks
[TASKS] Found 26 open tasks.
Skipping warnings blame since pipelines do not have an SCM link.%n
[TASKS] Computing warning deltas based on reference build #43
[withMaven] openTasksPublisher - Scan Tasks for Maven artifact org.apache.maven.archetype:archetype-common:jar:3.1.2-SNAPSHOT
in source directory j11m3.6.xb\archetype-common\src\main\java
[withMaven] openTasksPublisher - Scan Tasks for Maven artifact org.apache.maven.plugins:maven-archetype-plugin:maven-plugin:3.1.2-SNAPSHOT
in source directory j11m3.6.xb\maven-archetype-plugin\src\main\java
[withMaven] invokerPublisher - Archive invoker results for Maven artifact MavenArtifact{org.apache.maven.plugins:maven-archetype-plugin:maven-plugin:3.1.2-SNAPSHOT(version:
3.1.2-SNAPSHOT, snapshot:false) } generated by PluginInvocation{org.apache.maven.plugins:maven-invoker-plugin:3.2.0@integration-test
 invoker-it}: j13m3.6.xb\maven-archetype-plugin\target\invoker-reports\*.xml
[TASKS] Scanning folder 'F:\short\jenkins-maven-box-maven-archetype-master-44@2' for files
matching the pattern 'j11m3.6.xb\archetype-common\src\main\java\**\*,j11m3.6.xb\maven-archetype-plugin\src\main\java\**\*'
- excludes: null
[TASKS] Found 89 files to scan for tasks
[TASKS] Found 26 open tasks.
Skipping warnings blame since pipelines do not have an SCM link.%n
[TASKS] Computing warning deltas based on reference build #43
[withMaven] invokerPublisher - Archive invoker results for Maven artifact MavenArtifact{org.apache.maven.plugins:maven-archetype-plugin:maven-plugin:3.1.2-SNAPSHOT(version:
3.1.2-SNAPSHOT, snapshot:false) } generated by PluginInvocation{org.apache.maven.plugins:maven-invoker-plugin:3.2.0@integration-test
 invoker-it}: j11m3.6.xb\maven-archetype-plugin\target\invoker-reports\*.xml
[INFO] run post-build script verify.groovy
[INFO]           roundtrip-multi\pom.xml .......................... SUCCESS (23.4 s)
[INFO] 
[INFO] --- mrm-maven-plugin:1.2.0:stop (mirror) @ maven-archetype-plugin ---
[INFO] Stopping Mock Repository Manager on http://localhost:50272
[INFO] Stopped SocketConnector@0.0.0.0:50272
[INFO] Mock Repository Manager http://localhost:50272 is stopped.
[INFO] 
[INFO] --- mrm-maven-plugin:1.2.0:stop (archetype-repository) @ maven-archetype-plugin ---
[INFO] Stopping Mock Repository Manager on http://localhost:50275
[INFO] Stopped SocketConnector@0.0.0.0:50275
[INFO] Mock Repository Manager http://localhost:50275 is stopped.
[INFO] 
[INFO] --- maven-checkstyle-plugin:3.0.0:check (checkstyle-check) @ maven-archetype-plugin
---
[INFO] There are 46 errors reported by Checkstyle 6.18 with config/maven_checks.xml ruleset.
[INFO] Ignored 46 errors, 0 violation remaining.
[INFO] 
[INFO] --- maven-invoker-plugin:3.2.0:verify (invoker-verify) @ maven-archetype-plugin ---
[INFO] -------------------------------------------------
[INFO] Build Summary:
[INFO]   Passed: 25, Failed: 0, Errors: 0, Skipped: 0
[INFO] -------------------------------------------------
[INFO] ------------------------------------------------------------------------
[INFO] Reactor Summary for Maven Archetype 3.1.2-SNAPSHOT:
[INFO] 
[INFO] Maven Archetype .................................... SUCCESS [ 44.062 s]
[INFO] Maven Archetype Models ............................. SUCCESS [  0.513 s]
[INFO] Maven Archetype Catalog Model ...................... SUCCESS [ 12.505 s]
[INFO] Maven Archetype Descriptor Model ................... SUCCESS [  1.911 s]
[INFO] Maven Archetype Common ............................. SUCCESS [ 40.117 s]
[INFO] Maven Archetype Packaging .......................... SUCCESS [  0.645 s]
[INFO] Maven Archetype Plugin ............................. SUCCESS [06:39 min]
[INFO] ------------------------------------------------------------------------
[INFO] BUILD SUCCESS
[INFO] ------------------------------------------------------------------------
[INFO] Total time:  08:20 min
[INFO] Finished at: 2019-08-12T10:53:03-07:00
[INFO] ------------------------------------------------------------------------
[INFO] [jenkins-event-spy] Generated F:\short\jenkins-maven-box-maven-archetype-master-44@tmp\withMavend31c5e2a\maven-spy-20190812-104443-4117556769699965451554.log
[Pipeline] }
[Pipeline] // dir
[Pipeline] }
[withMaven] artifactsPublisher - Archive artifact j12m3.6.xb\pom.xml under org\apache\maven\archetype\maven-archetype\3.1.2-SNAPSHOT\maven-archetype-3.1.2-SNAPSHOT.pom
[withMaven] artifactsPublisher - Archive artifact j12m3.6.xb\target\maven-archetype-3.1.2-SNAPSHOT-site.xml
under org\apache\maven\archetype\maven-archetype\3.1.2-SNAPSHOT\maven-archetype-3.1.2-SNAPSHOT-site.xml
[withMaven] artifactsPublisher - Archive artifact j12m3.6.xb\archetype-models\pom.xml under
org\apache\maven\archetype\archetype-models\3.1.2-SNAPSHOT\archetype-models-3.1.2-SNAPSHOT.pom
[withMaven] artifactsPublisher - Archive artifact j12m3.6.xb\archetype-models\target\archetype-models-3.1.2-SNAPSHOT-site.xml
under org\apache\maven\archetype\archetype-models\3.1.2-SNAPSHOT\archetype-models-3.1.2-SNAPSHOT-site.xml
[withMaven] artifactsPublisher - Archive artifact j12m3.6.xb\archetype-models\archetype-catalog\pom.xml
under org\apache\maven\archetype\archetype-catalog\3.1.2-SNAPSHOT\archetype-catalog-3.1.2-SNAPSHOT.pom
[withMaven] artifactsPublisher - Archive artifact j12m3.6.xb\archetype-models\archetype-catalog\target\archetype-catalog-3.1.2-SNAPSHOT.jar
under org\apache\maven\archetype\archetype-catalog\3.1.2-SNAPSHOT\archetype-catalog-3.1.2-SNAPSHOT.jar
[withMaven] artifactsPublisher - Archive artifact j12m3.6.xb\archetype-models\archetype-descriptor\pom.xml
under org\apache\maven\archetype\archetype-descriptor\3.1.2-SNAPSHOT\archetype-descriptor-3.1.2-SNAPSHOT.pom
[withMaven] artifactsPublisher - Archive artifact j12m3.6.xb\archetype-models\archetype-descriptor\target\archetype-descriptor-3.1.2-SNAPSHOT.jar
under org\apache\maven\archetype\archetype-descriptor\3.1.2-SNAPSHOT\archetype-descriptor-3.1.2-SNAPSHOT.jar
[withMaven] artifactsPublisher - Archive artifact j12m3.6.xb\archetype-common\pom.xml under
org\apache\maven\archetype\archetype-common\3.1.2-SNAPSHOT\archetype-common-3.1.2-SNAPSHOT.pom
[withMaven] artifactsPublisher - Archive artifact j12m3.6.xb\archetype-common\target\archetype-common-3.1.2-SNAPSHOT.jar
under org\apache\maven\archetype\archetype-common\3.1.2-SNAPSHOT\archetype-common-3.1.2-SNAPSHOT.jar
[withMaven] artifactsPublisher - Archive artifact j12m3.6.xb\archetype-packaging\pom.xml under
org\apache\maven\archetype\archetype-packaging\3.1.2-SNAPSHOT\archetype-packaging-3.1.2-SNAPSHOT.pom
[withMaven] artifactsPublisher - Archive artifact j12m3.6.xb\archetype-packaging\target\archetype-packaging-3.1.2-SNAPSHOT.jar
under org\apache\maven\archetype\archetype-packaging\3.1.2-SNAPSHOT\archetype-packaging-3.1.2-SNAPSHOT.jar
[withMaven] artifactsPublisher - Archive artifact j12m3.6.xb\maven-archetype-plugin\pom.xml
under org\apache\maven\plugins\maven-archetype-plugin\3.1.2-SNAPSHOT\maven-archetype-plugin-3.1.2-SNAPSHOT.pom
[withMaven] artifactsPublisher - Archive artifact j12m3.6.xb\maven-archetype-plugin\target\maven-archetype-plugin-3.1.2-SNAPSHOT.jar
under org\apache\maven\plugins\maven-archetype-plugin\3.1.2-SNAPSHOT\maven-archetype-plugin-3.1.2-SNAPSHOT.jar
[withMaven] junitPublisher - Archive test results for Maven artifact org.apache.maven.archetype:archetype-catalog:jar:3.1.2-SNAPSHOT
generated by maven-surefire-plugin:test (default-test): j12m3.6.xb\archetype-models\archetype-catalog\target\surefire-reports\*.xml
[withMaven] junitPublisher - Archive test results for Maven artifact org.apache.maven.archetype:archetype-descriptor:jar:3.1.2-SNAPSHOT
generated by maven-surefire-plugin:test (default-test): j12m3.6.xb\archetype-models\archetype-descriptor\target\surefire-reports\*.xml
[withMaven] junitPublisher - Archive test results for Maven artifact org.apache.maven.archetype:archetype-common:jar:3.1.2-SNAPSHOT
generated by maven-surefire-plugin:test (default-test): j12m3.6.xb\archetype-common\target\surefire-reports\*.xml
[withMaven] junitPublisher - Archive test results for Maven artifact org.apache.maven.archetype:archetype-packaging:jar:3.1.2-SNAPSHOT
generated by maven-surefire-plugin:test (default-test): j12m3.6.xb\archetype-packaging\target\surefire-reports\*.xml
[withMaven] junitPublisher - Archive test results for Maven artifact org.apache.maven.plugins:maven-archetype-plugin:maven-plugin:3.1.2-SNAPSHOT
generated by maven-surefire-plugin:test (default-test): j12m3.6.xb\maven-archetype-plugin\target\surefire-reports\*.xml
Recording test results
[withMaven] openTasksPublisher - Scan Tasks for Maven artifact org.apache.maven.archetype:archetype-common:jar:3.1.2-SNAPSHOT
in source directory j12m3.6.xb\archetype-common\src\main\java
[withMaven] openTasksPublisher - Scan Tasks for Maven artifact org.apache.maven.plugins:maven-archetype-plugin:maven-plugin:3.1.2-SNAPSHOT
in source directory j12m3.6.xb\maven-archetype-plugin\src\main\java
[TASKS] Scanning folder 'F:\short\jenkins-maven-box-maven-archetype-master-44' for files matching
the pattern 'j12m3.6.xb\archetype-common\src\main\java\**\*,j12m3.6.xb\maven-archetype-plugin\src\main\java\**\*'
- excludes: null
[TASKS] Found 89 files to scan for tasks
[TASKS] Found 26 open tasks.
Skipping warnings blame since pipelines do not have an SCM link.%n
[TASKS] Computing warning deltas based on reference build #43
[withMaven] invokerPublisher - Archive invoker results for Maven artifact MavenArtifact{org.apache.maven.plugins:maven-archetype-plugin:maven-plugin:3.1.2-SNAPSHOT(version:
3.1.2-SNAPSHOT, snapshot:false) } generated by PluginInvocation{org.apache.maven.plugins:maven-invoker-plugin:3.2.0@integration-test
 invoker-it}: j12m3.6.xb\maven-archetype-plugin\target\invoker-reports\*.xml
[withMaven] Publishers: Generated Artifacts Publisher: 385 ms, Junit Publisher: 714 ms, Open
Task Scanner Publisher: 338 ms, Dependencies Fingerprint Publisher: 68 ms, Invoker Publisher:
16173 ms, Pipeline Graph Publisher: 7 ms
[Pipeline] // withMaven
[withMaven] Publishers: Generated Artifacts Publisher: 400 ms, Junit Publisher: 430 ms, Open
Task Scanner Publisher: 320 ms, Dependencies Fingerprint Publisher: 67 ms, Invoker Publisher:
16567 ms, Pipeline Graph Publisher: 5 ms
[Pipeline] cleanWs
[Pipeline] // withMaven
[WS-CLEANUP] Deleting project workspace...
[WS-CLEANUP] Deferred wipeout is used...
[Pipeline] cleanWs
[WS-CLEANUP] done
[WS-CLEANUP] Deleting project workspace...
[WS-CLEANUP] Deferred wipeout is used...
[Pipeline] }
[WS-CLEANUP] done
[Pipeline] // stage
[Pipeline] }
[Pipeline] }
[Pipeline] // ws
[Pipeline] // stage
[Pipeline] }
[Pipeline] }
[Pipeline] // node
[Pipeline] // ws
[Pipeline] }
[Pipeline] }
[Pipeline] // node
[Pipeline] }
[withMaven] Publishers: Generated Artifacts Publisher: 374 ms, Junit Publisher: 379 ms, Open
Task Scanner Publisher: 287 ms, Dependencies Fingerprint Publisher: 65 ms, Invoker Publisher:
16856 ms, Pipeline Graph Publisher: 5 ms
[Pipeline] // withMaven
[Pipeline] cleanWs
[WS-CLEANUP] Deleting project workspace...
[WS-CLEANUP] Deferred wipeout is used...
[WS-CLEANUP] done
[Pipeline] }
[Pipeline] // stage
[Pipeline] }
[Pipeline] // ws
[Pipeline] }
[Pipeline] // node
[Pipeline] }
[Pipeline] // parallel
[Pipeline] stage
[Pipeline] { (Notifications)
[Pipeline] echo
Build result: FAILURE
[Pipeline] jiraIssueSelector
[Pipeline] echo
The authors of changes [tibordigana, rfscholte].
[Pipeline] echo
Sending email ...
[Pipeline] emailext
Mime
  • Unnamed multipart/mixed (inline, None, 0 bytes)
View raw message