maven-notifications mailing list archives

Site index · List index
Message view « Date » · « Thread »
Top « Date » · « Thread »
From Apache Jenkins Server <jenk...@builds.apache.org>
Subject Build failed in Jenkins: Maven TLP » maven-archetype » buildfix #30
Date Fri, 02 Aug 2019 06:49:01 GMT
See https://builds.apache.org/job/maven-box/job/maven-archetype/job/buildfix/30/

No changes.

All tests passed

Build log:
[...truncated 21242 lines...]
Writing zip file of F:\short\jenkins-maven-box-maven-archetype-buildfix-30@3\j12m3.6.xb\maven-archetype-plugin\target\it\projects
to F:\short\jenkins-maven-box-maven-archetype-buildfix-30@3\j12m3.6.xb\archetype-plugin-its-j12m3.6.xb.zip
Zipped 483 entries.
Archiving F:\short\jenkins-maven-box-maven-archetype-buildfix-30@3\j12m3.6.xb\archetype-plugin-its-j12m3.6.xb.zip
[Pipeline] zip
Writing zip file of F:\short\jenkins-maven-box-maven-archetype-buildfix-30@3\j12m3.6.xb\maven-archetype-plugin\target\local-repo
to F:\short\jenkins-maven-box-maven-archetype-buildfix-30@3\j12m3.6.xb\local-repo-j12m3.6.xb.zip
[INFO] run post-build script verify.bsh
[INFO]           generate-basic ................................... SUCCESS (4.6 s)
[INFO] Building: include-file-with-no-extension\pom.xml
Zipped 320 entries.
Archiving F:\short\jenkins-maven-box-maven-archetype-buildfix-30@3\j12m3.6.xb\local-repo-j12m3.6.xb.zip
[Pipeline] zip
Writing zip file of F:\short\jenkins-maven-box-maven-archetype-buildfix-30@3\j12m3.6.xb\maven-archetype-plugin\target\mock-repo
to F:\short\jenkins-maven-box-maven-archetype-buildfix-30@3\j12m3.6.xb\mock-repo-j12m3.6.xb.zip
Zipped 5 entries.
Archiving F:\short\jenkins-maven-box-maven-archetype-buildfix-30@3\j12m3.6.xb\mock-repo-j12m3.6.xb.zip
[Pipeline] zip
Writing zip file of F:\short\jenkins-maven-box-maven-archetype-buildfix-30@3\j12m3.6.xb\maven-archetype-plugin\target\archetype-repo
to F:\short\jenkins-maven-box-maven-archetype-buildfix-30@3\j12m3.6.xb\archetype-repo-j12m3.6.xb.zip
Zipped 5 entries.
Archiving F:\short\jenkins-maven-box-maven-archetype-buildfix-30@3\j12m3.6.xb\archetype-repo-j12m3.6.xb.zip
[Pipeline] }
[Pipeline] // dir
[Pipeline] cleanWs
[WS-CLEANUP] Deleting project workspace...
[WS-CLEANUP] Deferred wipeout is used...
[WS-CLEANUP] done
[Pipeline] cleanWs
[WS-CLEANUP] Deleting project workspace...
[WS-CLEANUP] Deferred wipeout is used...
[WS-CLEANUP] done
[Pipeline] }
[Pipeline] // stage
[Pipeline] }
[Pipeline] // ws
[Pipeline] }
[Pipeline] // node
[Pipeline] }
Failed in branch windows-jdk12-m3.6.x_build
[INFO] run post-build script verify.groovy
[INFO]   The build exited with code 1. See F:\short\jenkins-maven-box-maven-archetype-buildfix-30\j13m3.6.xb\maven-archetype-plugin\target\it\projects\include-file-with-no-extension\build.log
for details.
[INFO]           include-file-with-no-extension\pom.xml ........... FAILED (7.7 s)
[INFO] Building: included-system-properties\pom.xml
[INFO] run post-build script verify.groovy
[INFO]   The build exited with code 1. See F:\short\jenkins-maven-box-maven-archetype-buildfix-30\j13m3.6.xb\maven-archetype-plugin\target\it\projects\included-system-properties\build.log
for details.
[INFO]           included-system-properties\pom.xml ............... FAILED (8.2 s)
[INFO] Building: property-setting-cli\pom.xml
[INFO]   The build exited with code 1. See F:\short\jenkins-maven-box-maven-archetype-buildfix-30\j13m3.6.xb\maven-archetype-plugin\target\it\projects\property-setting-cli\build.log
for details.
[INFO]           property-setting-cli\pom.xml ..................... FAILED (3.4 s)
[INFO] Building: roundtrip-1-project
[INFO] run post-build script verify.groovy
[INFO]   The post-build script did not succeed. F:\short\jenkins-maven-box-maven-archetype-buildfix-30\j13m3.6.xb\maven-archetype-plugin\target\it\projects\roundtrip-1-project\out\myapp\src\main\java\com\mycompany\myapp\App.java
(The system cannot find the path specified)
[INFO]           roundtrip-1-project .............................. FAILED (8.2 s)
[INFO] Building: roundtrip-multi\pom.xml
[INFO] run post-build script verify.groovy
[INFO]   The post-build script did not succeed. assert new File(myapp,'myapp-api/.classpath').exists()
       |        |                             |
       |        |                             false
       |        F:\short\jenkins-maven-box-maven-archetype-buildfix-30\j13m3.6.xb\maven-archetype-plugin\target\it\projects\roundtrip-multi\out\myapp
       F:\short\jenkins-maven-box-maven-archetype-buildfix-30\j13m3.6.xb\maven-archetype-plugin\target\it\projects\roundtrip-multi\out\myapp\myapp-api\.classpath
[INFO]           roundtrip-multi\pom.xml .......................... FAILED (8.5 s)
[INFO] 
[INFO] --- mrm-maven-plugin:1.2.0:stop (mirror) @ maven-archetype-plugin ---
[INFO] Stopping Mock Repository Manager on http://localhost:63516
[INFO] Stopped SocketConnector@0.0.0.0:63516
[INFO] Mock Repository Manager http://localhost:63516 is stopped.
[INFO] 
[INFO] --- mrm-maven-plugin:1.2.0:stop (archetype-repository) @ maven-archetype-plugin ---
[INFO] Stopping Mock Repository Manager on http://localhost:63518
[INFO] Stopped SocketConnector@0.0.0.0:63518
[INFO] Mock Repository Manager http://localhost:63518 is stopped.
[INFO] 
[INFO] --- maven-checkstyle-plugin:3.0.0:check (checkstyle-check) @ maven-archetype-plugin
---
[INFO] There are 46 errors reported by Checkstyle 6.18 with config/maven_checks.xml ruleset.
[INFO] Ignored 46 errors, 0 violation remaining.
[INFO] 
[INFO] --- maven-invoker-plugin:3.2.0:verify (invoker-verify) @ maven-archetype-plugin ---
[INFO] -------------------------------------------------
[INFO] Build Summary:
[INFO]   Passed: 4, Failed: 21, Errors: 0, Skipped: 0
[INFO] -------------------------------------------------
[ERROR] The following builds failed:
[ERROR] *  ARCHETYPE-241_filter-directory\pom.xml
[ERROR] *  ARCHETYPE-536_groovy-grape\pom.xml
[ERROR] *  build-and-run-its\pom.xml
[ERROR] *  build-archetype\pom.xml
[ERROR] *  build-ignore-eol\pom.xml
[ERROR] *  change-file-with-property\pom.xml
[ERROR] *  create-1\pom.xml
[ERROR] *  create-2\pom.xml
[ERROR] *  create-3\pom.xml
[ERROR] *  create-4\pom.xml
[ERROR] *  create-5\pom.xml
[ERROR] *  create-6\pom.xml
[ERROR] *  create-from-project-exclude-patterns\pom.xml
[ERROR] *  create-from-project\pom.xml
[ERROR] *  exclude-patterns-2\pom.xml
[ERROR] *  exclude-patterns\pom.xml
[ERROR] *  include-file-with-no-extension\pom.xml
[ERROR] *  included-system-properties\pom.xml
[ERROR] *  property-setting-cli\pom.xml
[ERROR] *  roundtrip-1-project
[ERROR] *  roundtrip-multi\pom.xml
[INFO] -------------------------------------------------
[INFO] ------------------------------------------------------------------------
[INFO] Reactor Summary for Maven Archetype 3.1.2-SNAPSHOT:
[INFO] 
[INFO] Maven Archetype .................................... SUCCESS [  5.101 s]
[INFO] Maven Archetype Models ............................. SUCCESS [  0.615 s]
[INFO] Maven Archetype Catalog Model ...................... SUCCESS [  3.372 s]
[INFO] Maven Archetype Descriptor Model ................... SUCCESS [  1.066 s]
[INFO] Maven Archetype Common ............................. SUCCESS [ 24.572 s]
[INFO] Maven Archetype Packaging .......................... SUCCESS [  0.435 s]
[INFO] Maven Archetype Plugin ............................. FAILURE [03:37 min]
[INFO] ------------------------------------------------------------------------
[INFO] BUILD FAILURE
[INFO] ------------------------------------------------------------------------
[INFO] Total time:  04:13 min
[INFO] Finished at: 2019-08-01T23:48:40-07:00
[INFO] ------------------------------------------------------------------------
[INFO] [jenkins-event-spy] Generated F:\short\jenkins-maven-box-maven-archetype-buildfix-30@tmp\withMavenf45b4f15\maven-spy-20190801-234426-93917228728567677443075.log
[ERROR] Failed to execute goal org.apache.maven.plugins:maven-invoker-plugin:3.2.0:verify
(invoker-verify) on project maven-archetype-plugin: 21 builds failed. See console output above
for details. -> [Help 1]
org.apache.maven.lifecycle.LifecycleExecutionException: Failed to execute goal org.apache.maven.plugins:maven-invoker-plugin:3.2.0:verify
(invoker-verify) on project maven-archetype-plugin: 21 builds failed. See console output above
for details.
    at org.apache.maven.lifecycle.internal.MojoExecutor.execute (MojoExecutor.java:215)
    at org.apache.maven.lifecycle.internal.MojoExecutor.execute (MojoExecutor.java:156)
    at org.apache.maven.lifecycle.internal.MojoExecutor.execute (MojoExecutor.java:148)
    at org.apache.maven.lifecycle.internal.LifecycleModuleBuilder.buildProject (LifecycleModuleBuilder.java:117)
    at org.apache.maven.lifecycle.internal.LifecycleModuleBuilder.buildProject (LifecycleModuleBuilder.java:81)
    at org.apache.maven.lifecycle.internal.builder.singlethreaded.SingleThreadedBuilder.build
(SingleThreadedBuilder.java:56)
    at org.apache.maven.lifecycle.internal.LifecycleStarter.execute (LifecycleStarter.java:128)
    at org.apache.maven.DefaultMaven.doExecute (DefaultMaven.java:305)
    at org.apache.maven.DefaultMaven.doExecute (DefaultMaven.java:192)
    at org.apache.maven.DefaultMaven.execute (DefaultMaven.java:105)
    at org.apache.maven.cli.MavenCli.execute (MavenCli.java:956)
    at org.apache.maven.cli.MavenCli.doMain (MavenCli.java:288)
    at org.apache.maven.cli.MavenCli.main (MavenCli.java:192)
    at jdk.internal.reflect.NativeMethodAccessorImpl.invoke0 (Native Method)
    at jdk.internal.reflect.NativeMethodAccessorImpl.invoke (NativeMethodAccessorImpl.java:62)
    at jdk.internal.reflect.DelegatingMethodAccessorImpl.invoke (DelegatingMethodAccessorImpl.java:43)
    at java.lang.reflect.Method.invoke (Method.java:567)
    at org.codehaus.plexus.classworlds.launcher.Launcher.launchEnhanced (Launcher.java:289)
    at org.codehaus.plexus.classworlds.launcher.Launcher.launch (Launcher.java:229)
    at org.codehaus.plexus.classworlds.launcher.Launcher.mainWithExitCode (Launcher.java:415)
    at org.codehaus.plexus.classworlds.launcher.Launcher.main (Launcher.java:356)
Caused by: org.apache.maven.plugin.MojoFailureException: 21 builds failed. See console output
above for details.
    at org.apache.maven.plugins.invoker.InvokerSession.handleFailures (InvokerSession.java:260)
    at org.apache.maven.plugins.invoker.VerifyMojo.execute (VerifyMojo.java:140)
    at org.apache.maven.plugin.DefaultBuildPluginManager.executeMojo (DefaultBuildPluginManager.java:137)
    at org.apache.maven.lifecycle.internal.MojoExecutor.execute (MojoExecutor.java:210)
    at org.apache.maven.lifecycle.internal.MojoExecutor.execute (MojoExecutor.java:156)
    at org.apache.maven.lifecycle.internal.MojoExecutor.execute (MojoExecutor.java:148)
    at org.apache.maven.lifecycle.internal.LifecycleModuleBuilder.buildProject (LifecycleModuleBuilder.java:117)
    at org.apache.maven.lifecycle.internal.LifecycleModuleBuilder.buildProject (LifecycleModuleBuilder.java:81)
    at org.apache.maven.lifecycle.internal.builder.singlethreaded.SingleThreadedBuilder.build
(SingleThreadedBuilder.java:56)
    at org.apache.maven.lifecycle.internal.LifecycleStarter.execute (LifecycleStarter.java:128)
    at org.apache.maven.DefaultMaven.doExecute (DefaultMaven.java:305)
    at org.apache.maven.DefaultMaven.doExecute (DefaultMaven.java:192)
    at org.apache.maven.DefaultMaven.execute (DefaultMaven.java:105)
    at org.apache.maven.cli.MavenCli.execute (MavenCli.java:956)
    at org.apache.maven.cli.MavenCli.doMain (MavenCli.java:288)
    at org.apache.maven.cli.MavenCli.main (MavenCli.java:192)
    at jdk.internal.reflect.NativeMethodAccessorImpl.invoke0 (Native Method)
    at jdk.internal.reflect.NativeMethodAccessorImpl.invoke (NativeMethodAccessorImpl.java:62)
    at jdk.internal.reflect.DelegatingMethodAccessorImpl.invoke (DelegatingMethodAccessorImpl.java:43)
    at java.lang.reflect.Method.invoke (Method.java:567)
    at org.codehaus.plexus.classworlds.launcher.Launcher.launchEnhanced (Launcher.java:289)
    at org.codehaus.plexus.classworlds.launcher.Launcher.launch (Launcher.java:229)
    at org.codehaus.plexus.classworlds.launcher.Launcher.mainWithExitCode (Launcher.java:415)
    at org.codehaus.plexus.classworlds.launcher.Launcher.main (Launcher.java:356)
[ERROR] 
[ERROR] Re-run Maven using the -X switch to enable full debug logging.
[ERROR] 
[ERROR] For more information about the errors and possible solutions, please read the following
articles:
[ERROR] [Help 1] http://cwiki.apache.org/confluence/display/MAVEN/MojoFailureException
[ERROR] 
[ERROR] After correcting the problems, you can resume the build with the command
[ERROR]   mvn <goals> -rf :maven-archetype-plugin
[Pipeline] }
[Pipeline] // dir
[Pipeline] }
[withMaven] artifactsPublisher - Archive artifact j13m3.6.xb\pom.xml under org\apache\maven\archetype\maven-archetype\3.1.2-SNAPSHOT\maven-archetype-3.1.2-SNAPSHOT.pom
[withMaven] artifactsPublisher - Archive artifact j13m3.6.xb\target\maven-archetype-3.1.2-SNAPSHOT-site.xml
under org\apache\maven\archetype\maven-archetype\3.1.2-SNAPSHOT\maven-archetype-3.1.2-SNAPSHOT-site.xml
[withMaven] artifactsPublisher - Archive artifact j13m3.6.xb\archetype-models\pom.xml under
org\apache\maven\archetype\archetype-models\3.1.2-SNAPSHOT\archetype-models-3.1.2-SNAPSHOT.pom
[withMaven] artifactsPublisher - Archive artifact j13m3.6.xb\archetype-models\target\archetype-models-3.1.2-SNAPSHOT-site.xml
under org\apache\maven\archetype\archetype-models\3.1.2-SNAPSHOT\archetype-models-3.1.2-SNAPSHOT-site.xml
[withMaven] artifactsPublisher - Archive artifact j13m3.6.xb\archetype-models\archetype-catalog\pom.xml
under org\apache\maven\archetype\archetype-catalog\3.1.2-SNAPSHOT\archetype-catalog-3.1.2-SNAPSHOT.pom
[withMaven] artifactsPublisher - Archive artifact j13m3.6.xb\archetype-models\archetype-catalog\target\archetype-catalog-3.1.2-SNAPSHOT.jar
under org\apache\maven\archetype\archetype-catalog\3.1.2-SNAPSHOT\archetype-catalog-3.1.2-SNAPSHOT.jar
[withMaven] artifactsPublisher - Archive artifact j13m3.6.xb\archetype-models\archetype-descriptor\pom.xml
under org\apache\maven\archetype\archetype-descriptor\3.1.2-SNAPSHOT\archetype-descriptor-3.1.2-SNAPSHOT.pom
[withMaven] artifactsPublisher - Archive artifact j13m3.6.xb\archetype-models\archetype-descriptor\target\archetype-descriptor-3.1.2-SNAPSHOT.jar
under org\apache\maven\archetype\archetype-descriptor\3.1.2-SNAPSHOT\archetype-descriptor-3.1.2-SNAPSHOT.jar
[withMaven] artifactsPublisher - Archive artifact j13m3.6.xb\archetype-common\pom.xml under
org\apache\maven\archetype\archetype-common\3.1.2-SNAPSHOT\archetype-common-3.1.2-SNAPSHOT.pom
[withMaven] artifactsPublisher - Archive artifact j13m3.6.xb\archetype-common\target\archetype-common-3.1.2-SNAPSHOT.jar
under org\apache\maven\archetype\archetype-common\3.1.2-SNAPSHOT\archetype-common-3.1.2-SNAPSHOT.jar
[withMaven] artifactsPublisher - Archive artifact j13m3.6.xb\archetype-packaging\pom.xml under
org\apache\maven\archetype\archetype-packaging\3.1.2-SNAPSHOT\archetype-packaging-3.1.2-SNAPSHOT.pom
[withMaven] artifactsPublisher - Archive artifact j13m3.6.xb\archetype-packaging\target\archetype-packaging-3.1.2-SNAPSHOT.jar
under org\apache\maven\archetype\archetype-packaging\3.1.2-SNAPSHOT\archetype-packaging-3.1.2-SNAPSHOT.jar
[withMaven] junitPublisher - Archive test results for Maven artifact org.apache.maven.archetype:archetype-catalog:jar:3.1.2-SNAPSHOT
generated by maven-surefire-plugin:test (default-test): j13m3.6.xb\archetype-models\archetype-catalog\target\surefire-reports\*.xml
[withMaven] junitPublisher - Archive test results for Maven artifact org.apache.maven.archetype:archetype-descriptor:jar:3.1.2-SNAPSHOT
generated by maven-surefire-plugin:test (default-test): j13m3.6.xb\archetype-models\archetype-descriptor\target\surefire-reports\*.xml
[withMaven] junitPublisher - Archive test results for Maven artifact org.apache.maven.archetype:archetype-common:jar:3.1.2-SNAPSHOT
generated by maven-surefire-plugin:test (default-test): j13m3.6.xb\archetype-common\target\surefire-reports\*.xml
[withMaven] junitPublisher - Archive test results for Maven artifact org.apache.maven.archetype:archetype-packaging:jar:3.1.2-SNAPSHOT
generated by maven-surefire-plugin:test (default-test): j13m3.6.xb\archetype-packaging\target\surefire-reports\*.xml
[withMaven] junitPublisher - Archive test results for Maven artifact org.apache.maven.plugins:maven-archetype-plugin:maven-plugin:3.1.2-SNAPSHOT
generated by maven-surefire-plugin:test (default-test): j13m3.6.xb\maven-archetype-plugin\target\surefire-reports\*.xml
Recording test results
[withMaven] openTasksPublisher - Scan Tasks for Maven artifact org.apache.maven.archetype:archetype-common:jar:3.1.2-SNAPSHOT
in source directory j13m3.6.xb\archetype-common\src\main\java
[withMaven] openTasksPublisher - Scan Tasks for Maven artifact org.apache.maven.plugins:maven-archetype-plugin:maven-plugin:3.1.2-SNAPSHOT
in source directory j13m3.6.xb\maven-archetype-plugin\src\main\java
[TASKS] Scanning folder 'F:\short\jenkins-maven-box-maven-archetype-buildfix-30' for files
matching the pattern 'j13m3.6.xb\archetype-common\src\main\java\**\*,j13m3.6.xb\maven-archetype-plugin\src\main\java\**\*'
- excludes: null
[TASKS] Found 89 files to scan for tasks
[TASKS] Found 26 open tasks.
Skipping warnings blame since pipelines do not have an SCM link.%n
[TASKS] Computing warning deltas based on reference build #29
[withMaven] invokerPublisher - Archive invoker results for Maven artifact MavenArtifact{org.apache.maven.plugins:maven-archetype-plugin:maven-plugin:3.1.2-SNAPSHOT(version:
3.1.2-SNAPSHOT, snapshot:false) } generated by PluginInvocation{org.apache.maven.plugins:maven-invoker-plugin:3.2.0@integration-test
 invoker-it}: j13m3.6.xb\maven-archetype-plugin\target\invoker-reports\*.xml
[withMaven] Publishers: Generated Artifacts Publisher: 301 ms, Junit Publisher: 382 ms, Open
Task Scanner Publisher: 322 ms, Dependencies Fingerprint Publisher: 66 ms, Invoker Publisher:
11364 ms, Pipeline Graph Publisher: 6 ms
[Pipeline] // withMaven
[Pipeline] dir
Running in F:\short\jenkins-maven-box-maven-archetype-buildfix-30\j13m3.6.xb
[Pipeline] {
[Pipeline] zip
Writing zip file of F:\short\jenkins-maven-box-maven-archetype-buildfix-30\j13m3.6.xb\maven-archetype-plugin\target\it\projects
to F:\short\jenkins-maven-box-maven-archetype-buildfix-30\j13m3.6.xb\archetype-plugin-its-j13m3.6.xb.zip
Zipped 483 entries.
Archiving F:\short\jenkins-maven-box-maven-archetype-buildfix-30\j13m3.6.xb\archetype-plugin-its-j13m3.6.xb.zip
[Pipeline] zip
Writing zip file of F:\short\jenkins-maven-box-maven-archetype-buildfix-30\j13m3.6.xb\maven-archetype-plugin\target\local-repo
to F:\short\jenkins-maven-box-maven-archetype-buildfix-30\j13m3.6.xb\local-repo-j13m3.6.xb.zip
Zipped 320 entries.
Archiving F:\short\jenkins-maven-box-maven-archetype-buildfix-30\j13m3.6.xb\local-repo-j13m3.6.xb.zip
[Pipeline] zip
Writing zip file of F:\short\jenkins-maven-box-maven-archetype-buildfix-30\j13m3.6.xb\maven-archetype-plugin\target\mock-repo
to F:\short\jenkins-maven-box-maven-archetype-buildfix-30\j13m3.6.xb\mock-repo-j13m3.6.xb.zip
Zipped 5 entries.
Archiving F:\short\jenkins-maven-box-maven-archetype-buildfix-30\j13m3.6.xb\mock-repo-j13m3.6.xb.zip
[Pipeline] zip
Writing zip file of F:\short\jenkins-maven-box-maven-archetype-buildfix-30\j13m3.6.xb\maven-archetype-plugin\target\archetype-repo
to F:\short\jenkins-maven-box-maven-archetype-buildfix-30\j13m3.6.xb\archetype-repo-j13m3.6.xb.zip
Zipped 5 entries.
Archiving F:\short\jenkins-maven-box-maven-archetype-buildfix-30\j13m3.6.xb\archetype-repo-j13m3.6.xb.zip
[Pipeline] }
[Pipeline] // dir
[Pipeline] cleanWs
[WS-CLEANUP] Deleting project workspace...
[WS-CLEANUP] Deferred wipeout is used...
[WS-CLEANUP] done
[Pipeline] cleanWs
[WS-CLEANUP] Deleting project workspace...
[WS-CLEANUP] Deferred wipeout is used...
[WS-CLEANUP] done
[Pipeline] }
[Pipeline] // stage
[Pipeline] }
[Pipeline] // ws
[Pipeline] }
[Pipeline] // node
[Pipeline] }
Failed in branch windows-jdk13-m3.6.x_build
[Pipeline] // parallel
[Pipeline] stage
[Pipeline] { (Notifications)
[Pipeline] echo
Build result: FAILURE
[Pipeline] jiraIssueSelector
[Pipeline] emailext
Mime
  • Unnamed multipart/mixed (inline, None, 0 bytes)
View raw message