maven-notifications mailing list archives

Site index · List index
Message view « Date » · « Thread »
Top « Date » · « Thread »
From Apache Jenkins Server <jenk...@builds.apache.org>
Subject Build failed in Jenkins: Maven TLP » maven-archetype » buildfix #34
Date Mon, 12 Aug 2019 20:44:32 GMT
See https://builds.apache.org/job/maven-box/job/maven-archetype/job/buildfix/34/

Changes:

* try only one maven version
* try only one maven version

All tests passed

Build log:
[...truncated 2512 lines...]
[ERROR] *  create-from-project\pom.xml
[ERROR] *  exclude-patterns-2\pom.xml
[ERROR] *  exclude-patterns\pom.xml
[ERROR] *  include-file-with-no-extension\pom.xml
[ERROR] *  included-system-properties\pom.xml
[ERROR] *  property-setting-cli\pom.xml
[ERROR] *  roundtrip-1-project
[ERROR] *  roundtrip-multi\pom.xml
[INFO] -------------------------------------------------
[INFO] ------------------------------------------------------------------------
[INFO] Reactor Summary:
[INFO] 
[INFO] Maven Archetype .................................... SUCCESS [  4.113 s]
[INFO] Maven Archetype Models ............................. SUCCESS [  0.591 s]
[INFO] Maven Archetype Catalog Model ...................... SUCCESS [  2.784 s]
[INFO] Maven Archetype Descriptor Model ................... SUCCESS [  1.599 s]
[INFO] Maven Archetype Common ............................. SUCCESS [ 24.100 s]
[INFO] Maven Archetype Packaging .......................... SUCCESS [  0.711 s]
[INFO] Maven Archetype Plugin ............................. FAILURE [02:56 min]
[INFO] ------------------------------------------------------------------------
[INFO] BUILD FAILURE
[INFO] ------------------------------------------------------------------------
[INFO] Total time: 03:30 min
[INFO] Finished at: 2019-08-12T13:42:34-07:00
[INFO] Final Memory: 72M/1386M
[INFO] ------------------------------------------------------------------------
[INFO] [jenkins-event-spy] Generated F:\short\jenkins-maven-box-maven-archetype-buildfix-34@tmp\withMaven49c6b7a7\maven-spy-20190812-133902-7816246274189500370729.log
[ERROR] Failed to execute goal org.apache.maven.plugins:maven-invoker-plugin:3.2.0:verify
(invoker-verify) on project maven-archetype-plugin: 21 builds failed. See console output above
for details. -> [Help 1]
org.apache.maven.lifecycle.LifecycleExecutionException: Failed to execute goal org.apache.maven.plugins:maven-invoker-plugin:3.2.0:verify
(invoker-verify) on project maven-archetype-plugin: 21 builds failed. See console output above
for details.
	at org.apache.maven.lifecycle.internal.MojoExecutor.execute(MojoExecutor.java:212)
	at org.apache.maven.lifecycle.internal.MojoExecutor.execute(MojoExecutor.java:153)
	at org.apache.maven.lifecycle.internal.MojoExecutor.execute(MojoExecutor.java:145)
	at org.apache.maven.lifecycle.internal.LifecycleModuleBuilder.buildProject(LifecycleModuleBuilder.java:116)
	at org.apache.maven.lifecycle.internal.LifecycleModuleBuilder.buildProject(LifecycleModuleBuilder.java:80)
	at org.apache.maven.lifecycle.internal.builder.singlethreaded.SingleThreadedBuilder.build(SingleThreadedBuilder.java:51)
	at org.apache.maven.lifecycle.internal.LifecycleStarter.execute(LifecycleStarter.java:120)
	at org.apache.maven.DefaultMaven.doExecute(DefaultMaven.java:355)
	at org.apache.maven.DefaultMaven.execute(DefaultMaven.java:155)
	at org.apache.maven.cli.MavenCli.execute(MavenCli.java:584)
	at org.apache.maven.cli.MavenCli.doMain(MavenCli.java:216)
	at org.apache.maven.cli.MavenCli.main(MavenCli.java:160)
	at sun.reflect.NativeMethodAccessorImpl.invoke0(Native Method)
	at sun.reflect.NativeMethodAccessorImpl.invoke(NativeMethodAccessorImpl.java:57)
	at sun.reflect.DelegatingMethodAccessorImpl.invoke(DelegatingMethodAccessorImpl.java:43)
	at java.lang.reflect.Method.invoke(Method.java:606)
	at org.codehaus.plexus.classworlds.launcher.Launcher.launchEnhanced(Launcher.java:289)
	at org.codehaus.plexus.classworlds.launcher.Launcher.launch(Launcher.java:229)
	at org.codehaus.plexus.classworlds.launcher.Launcher.mainWithExitCode(Launcher.java:415)
	at org.codehaus.plexus.classworlds.launcher.Launcher.main(Launcher.java:356)
Caused by: org.apache.maven.plugin.MojoFailureException: 21 builds failed. See console output
above for details.
	at org.apache.maven.plugins.invoker.InvokerSession.handleFailures(InvokerSession.java:260)
	at org.apache.maven.plugins.invoker.VerifyMojo.execute(VerifyMojo.java:140)
	at org.apache.maven.plugin.DefaultBuildPluginManager.executeMojo(DefaultBuildPluginManager.java:132)
	at org.apache.maven.lifecycle.internal.MojoExecutor.execute(MojoExecutor.java:208)
	... 19 more
[ERROR] 
[ERROR] Re-run Maven using the -X switch to enable full debug logging.
[ERROR] 
[ERROR] For more information about the errors and possible solutions, please read the following
articles:
[ERROR] [Help 1] http://cwiki.apache.org/confluence/display/MAVEN/MojoFailureException
[ERROR] 
[ERROR] After correcting the problems, you can resume the build with the command
[ERROR]   mvn <goals> -rf :maven-archetype-plugin
Picked up JAVA_TOOL_OPTIONS: -Dmaven.ext.class.path="F:\short\jenkins-maven-box-maven-archetype-buildfix-34@tmp\withMaven49c6b7a7\pipeline-maven-spy.jar"
-Dorg.jenkinsci.plugins.pipeline.maven.reportsFolder="F:\short\jenkins-maven-box-maven-archetype-buildfix-34@tmp\withMaven49c6b7a7"

[Pipeline] }
[Pipeline] // dir
[Pipeline] }
[withMaven] artifactsPublisher - Archive artifact j7m3.2.xb\pom.xml under org\apache\maven\archetype\maven-archetype\3.1.2-SNAPSHOT\maven-archetype-3.1.2-SNAPSHOT.pom
[withMaven] artifactsPublisher - Archive artifact j7m3.2.xb\target\maven-archetype-3.1.2-SNAPSHOT-site.xml
under org\apache\maven\archetype\maven-archetype\3.1.2-SNAPSHOT\maven-archetype-3.1.2-SNAPSHOT-site.xml
[withMaven] artifactsPublisher - Archive artifact j7m3.2.xb\archetype-models\pom.xml under
org\apache\maven\archetype\archetype-models\3.1.2-SNAPSHOT\archetype-models-3.1.2-SNAPSHOT.pom
[withMaven] artifactsPublisher - Archive artifact j7m3.2.xb\archetype-models\target\archetype-models-3.1.2-SNAPSHOT-site.xml
under org\apache\maven\archetype\archetype-models\3.1.2-SNAPSHOT\archetype-models-3.1.2-SNAPSHOT-site.xml
[withMaven] artifactsPublisher - Archive artifact j7m3.2.xb\archetype-models\archetype-catalog\pom.xml
under org\apache\maven\archetype\archetype-catalog\3.1.2-SNAPSHOT\archetype-catalog-3.1.2-SNAPSHOT.pom
[withMaven] artifactsPublisher - Archive artifact j7m3.2.xb\archetype-models\archetype-catalog\target\archetype-catalog-3.1.2-SNAPSHOT.jar
under org\apache\maven\archetype\archetype-catalog\3.1.2-SNAPSHOT\archetype-catalog-3.1.2-SNAPSHOT.jar
[withMaven] artifactsPublisher - Archive artifact j7m3.2.xb\archetype-models\archetype-descriptor\pom.xml
under org\apache\maven\archetype\archetype-descriptor\3.1.2-SNAPSHOT\archetype-descriptor-3.1.2-SNAPSHOT.pom
[withMaven] artifactsPublisher - Archive artifact j7m3.2.xb\archetype-models\archetype-descriptor\target\archetype-descriptor-3.1.2-SNAPSHOT.jar
under org\apache\maven\archetype\archetype-descriptor\3.1.2-SNAPSHOT\archetype-descriptor-3.1.2-SNAPSHOT.jar
[withMaven] artifactsPublisher - Archive artifact j7m3.2.xb\archetype-common\pom.xml under
org\apache\maven\archetype\archetype-common\3.1.2-SNAPSHOT\archetype-common-3.1.2-SNAPSHOT.pom
[withMaven] artifactsPublisher - Archive artifact j7m3.2.xb\archetype-common\target\archetype-common-3.1.2-SNAPSHOT.jar
under org\apache\maven\archetype\archetype-common\3.1.2-SNAPSHOT\archetype-common-3.1.2-SNAPSHOT.jar
[withMaven] artifactsPublisher - Archive artifact j7m3.2.xb\archetype-packaging\pom.xml under
org\apache\maven\archetype\archetype-packaging\3.1.2-SNAPSHOT\archetype-packaging-3.1.2-SNAPSHOT.pom
[withMaven] artifactsPublisher - Archive artifact j7m3.2.xb\archetype-packaging\target\archetype-packaging-3.1.2-SNAPSHOT.jar
under org\apache\maven\archetype\archetype-packaging\3.1.2-SNAPSHOT\archetype-packaging-3.1.2-SNAPSHOT.jar
[withMaven] junitPublisher - Archive test results for Maven artifact org.apache.maven.archetype:archetype-catalog:jar:3.1.2-SNAPSHOT
generated by maven-surefire-plugin:test (default-test): j7m3.2.xb\archetype-models\archetype-catalog\target\surefire-reports\*.xml
[withMaven] junitPublisher - Archive test results for Maven artifact org.apache.maven.archetype:archetype-descriptor:jar:3.1.2-SNAPSHOT
generated by maven-surefire-plugin:test (default-test): j7m3.2.xb\archetype-models\archetype-descriptor\target\surefire-reports\*.xml
[withMaven] junitPublisher - Archive test results for Maven artifact org.apache.maven.archetype:archetype-common:jar:3.1.2-SNAPSHOT
generated by maven-surefire-plugin:test (default-test): j7m3.2.xb\archetype-common\target\surefire-reports\*.xml
[withMaven] junitPublisher - Archive test results for Maven artifact org.apache.maven.archetype:archetype-packaging:jar:3.1.2-SNAPSHOT
generated by maven-surefire-plugin:test (default-test): j7m3.2.xb\archetype-packaging\target\surefire-reports\*.xml
[withMaven] junitPublisher - Archive test results for Maven artifact org.apache.maven.plugins:maven-archetype-plugin:maven-plugin:3.1.2-SNAPSHOT
generated by maven-surefire-plugin:test (default-test): j7m3.2.xb\maven-archetype-plugin\target\surefire-reports\*.xml
Recording test results
[withMaven] openTasksPublisher - Scan Tasks for Maven artifact org.apache.maven.archetype:archetype-common:jar:3.1.2-SNAPSHOT
in source directory j7m3.2.xb\archetype-common\src\main\java
[withMaven] openTasksPublisher - Scan Tasks for Maven artifact org.apache.maven.plugins:maven-archetype-plugin:maven-plugin:3.1.2-SNAPSHOT
in source directory j7m3.2.xb\maven-archetype-plugin\src\main\java
[TASKS] Scanning folder 'F:\short\jenkins-maven-box-maven-archetype-buildfix-34' for files
matching the pattern 'j7m3.2.xb\archetype-common\src\main\java\**\*,j7m3.2.xb\maven-archetype-plugin\src\main\java\**\*'
- excludes: null
[TASKS] Found 89 files to scan for tasks
[TASKS] Found 26 open tasks.
Skipping warnings blame since pipelines do not have an SCM link.%n
[TASKS] Computing warning deltas based on reference build #29
[withMaven] invokerPublisher - Archive invoker results for Maven artifact MavenArtifact{org.apache.maven.plugins:maven-archetype-plugin:maven-plugin:3.1.2-SNAPSHOT(version:
3.1.2-SNAPSHOT, snapshot:false) } generated by PluginInvocation{org.apache.maven.plugins:maven-invoker-plugin:3.2.0@integration-test
 invoker-it}: j7m3.2.xb\maven-archetype-plugin\target\invoker-reports\*.xml
[INFO] run post-build script verify.groovy
[INFO]           included-system-properties/pom.xml ............... SUCCESS (8.2 s)
[INFO] Building: create-1/pom.xml
[withMaven] Publishers: Generated Artifacts Publisher: 283 ms, Junit Publisher: 306 ms, Open
Task Scanner Publisher: 515 ms, Dependencies Fingerprint Publisher: 118 ms, Invoker Publisher:
13445 ms, Pipeline Graph Publisher: 5 ms
[Pipeline] // withMaven
[Pipeline] dir
Running in F:\short\jenkins-maven-box-maven-archetype-buildfix-34\j7m3.2.xb
[Pipeline] {
[Pipeline] zip
Writing zip file of F:\short\jenkins-maven-box-maven-archetype-buildfix-34\j7m3.2.xb\maven-archetype-plugin\target\it\projects
to F:\short\jenkins-maven-box-maven-archetype-buildfix-34\j7m3.2.xb\archetype-plugin-its-j7m3.2.xb.zip
[INFO] run post-build script verify.groovy
[INFO]           create-1/pom.xml ................................. SUCCESS (7.6 s)
[INFO] Building: exclude-patterns/pom.xml
Zipped 483 entries.
Archiving F:\short\jenkins-maven-box-maven-archetype-buildfix-34\j7m3.2.xb\archetype-plugin-its-j7m3.2.xb.zip
[Pipeline] zip
Writing zip file of F:\short\jenkins-maven-box-maven-archetype-buildfix-34\j7m3.2.xb\maven-archetype-plugin\target\local-repo
to F:\short\jenkins-maven-box-maven-archetype-buildfix-34\j7m3.2.xb\local-repo-j7m3.2.xb.zip
Zipped 297 entries.
Archiving F:\short\jenkins-maven-box-maven-archetype-buildfix-34\j7m3.2.xb\local-repo-j7m3.2.xb.zip
[INFO] run post-build script verify.groovy
[INFO]           exclude-patterns/pom.xml ......................... SUCCESS (7.1 s)
[INFO] Building: ARCHETYPE-520_mirror
[Pipeline] zip
Writing zip file of F:\short\jenkins-maven-box-maven-archetype-buildfix-34\j7m3.2.xb\maven-archetype-plugin\target\mock-repo
to F:\short\jenkins-maven-box-maven-archetype-buildfix-34\j7m3.2.xb\mock-repo-j7m3.2.xb.zip
Zipped 5 entries.
Archiving F:\short\jenkins-maven-box-maven-archetype-buildfix-34\j7m3.2.xb\mock-repo-j7m3.2.xb.zip
[Pipeline] zip
Writing zip file of F:\short\jenkins-maven-box-maven-archetype-buildfix-34\j7m3.2.xb\maven-archetype-plugin\target\archetype-repo
to F:\short\jenkins-maven-box-maven-archetype-buildfix-34\j7m3.2.xb\archetype-repo-j7m3.2.xb.zip
Zipped 5 entries.
Archiving F:\short\jenkins-maven-box-maven-archetype-buildfix-34\j7m3.2.xb\archetype-repo-j7m3.2.xb.zip
[Pipeline] }
[Pipeline] // dir
[Pipeline] cleanWs
[WS-CLEANUP] Deleting project workspace...
[WS-CLEANUP] Deferred wipeout is used...
[WS-CLEANUP] done
[Pipeline] cleanWs
[WS-CLEANUP] Deleting project workspace...
[WS-CLEANUP] Deferred wipeout is used...
[WS-CLEANUP] done
[Pipeline] }
[Pipeline] // stage
[Pipeline] }
[Pipeline] // ws
[Pipeline] }
[Pipeline] // node
[Pipeline] }
Failed in branch windows-jdk7-m3.2.x_build
[INFO] run post-build script verify.groovy
[INFO]           ARCHETYPE-520_mirror ............................. SUCCESS (3.6 s)
[INFO] Building: exclude-patterns-2/pom.xml
[INFO] run post-build script verify.groovy
[INFO]           exclude-patterns-2/pom.xml ....................... SUCCESS (7.3 s)
[INFO] Building: build-ignore-eol/pom.xml
[INFO] run pre-build script setup.bsh
[INFO] run post-build script verify.bsh
[INFO]           build-ignore-eol/pom.xml ......................... SUCCESS (15.4 s)
[INFO] Building: build-and-run-its/pom.xml
[INFO] run post-build script verify.bsh
[INFO]           build-and-run-its/pom.xml ........................ SUCCESS (12.3 s)
[INFO] Building: change-file-with-property/pom.xml
[INFO] run post-build script verify.groovy
[INFO]           change-file-with-property/pom.xml ................ SUCCESS (7.1 s)
[INFO] 
[INFO] --- mrm-maven-plugin:1.2.0:stop (mirror) @ maven-archetype-plugin ---
[INFO] Stopping Mock Repository Manager on http://localhost:37645
[INFO] Stopped SocketConnector@0.0.0.0:37645
[INFO] Mock Repository Manager http://localhost:37645 is stopped.
[INFO] 
[INFO] --- mrm-maven-plugin:1.2.0:stop (archetype-repository) @ maven-archetype-plugin ---
[INFO] Stopping Mock Repository Manager on http://localhost:45709
[INFO] Stopped SocketConnector@0.0.0.0:45709
[INFO] Mock Repository Manager http://localhost:45709 is stopped.
[INFO] 
[INFO] --- maven-checkstyle-plugin:3.0.0:check (checkstyle-check) @ maven-archetype-plugin
---
[INFO] There are 46 errors reported by Checkstyle 6.18 with config/maven_checks.xml ruleset.
[INFO] Ignored 46 errors, 0 violation remaining.
[INFO] 
[INFO] --- maven-invoker-plugin:3.2.0:verify (invoker-verify) @ maven-archetype-plugin ---
[INFO] -------------------------------------------------
[INFO] Build Summary:
[INFO]   Passed: 25, Failed: 0, Errors: 0, Skipped: 0
[INFO] -------------------------------------------------
[INFO] ------------------------------------------------------------------------
[INFO] Reactor Summary:
[INFO] 
[INFO] Maven Archetype .................................... SUCCESS [  4.574 s]
[INFO] Maven Archetype Models ............................. SUCCESS [  0.449 s]
[INFO] Maven Archetype Catalog Model ...................... SUCCESS [  2.527 s]
[INFO] Maven Archetype Descriptor Model ................... SUCCESS [  1.136 s]
[INFO] Maven Archetype Common ............................. SUCCESS [ 16.984 s]
[INFO] Maven Archetype Packaging .......................... SUCCESS [  0.488 s]
[INFO] Maven Archetype Plugin ............................. SUCCESS [04:14 min]
[INFO] ------------------------------------------------------------------------
[INFO] BUILD SUCCESS
[INFO] ------------------------------------------------------------------------
[INFO] Total time: 04:40 min
[INFO] Finished at: 2019-08-12T20:43:43+00:00
[INFO] Final Memory: 97M/4118M
[INFO] ------------------------------------------------------------------------
[INFO] [jenkins-event-spy] Generated /home/jenkins/jenkins-slave/workspace/ven-box_maven-archetype_buildfix@2@tmp/withMavence7c772e/maven-spy-20190812-203902-1784237332594953495119.log
[Pipeline] }
[Pipeline] // dir
[Pipeline] }
[withMaven] artifactsPublisher - Archive artifact linux-jdk7-m3.2.x_build/pom.xml under org/apache/maven/archetype/maven-archetype/3.1.2-SNAPSHOT/maven-archetype-3.1.2-SNAPSHOT.pom
[withMaven] artifactsPublisher - Archive artifact linux-jdk7-m3.2.x_build/target/maven-archetype-3.1.2-SNAPSHOT-site.xml
under org/apache/maven/archetype/maven-archetype/3.1.2-SNAPSHOT/maven-archetype-3.1.2-SNAPSHOT-site.xml
[withMaven] artifactsPublisher - Archive artifact linux-jdk7-m3.2.x_build/archetype-models/pom.xml
under org/apache/maven/archetype/archetype-models/3.1.2-SNAPSHOT/archetype-models-3.1.2-SNAPSHOT.pom
[withMaven] artifactsPublisher - Archive artifact linux-jdk7-m3.2.x_build/archetype-models/target/archetype-models-3.1.2-SNAPSHOT-site.xml
under org/apache/maven/archetype/archetype-models/3.1.2-SNAPSHOT/archetype-models-3.1.2-SNAPSHOT-site.xml
[withMaven] artifactsPublisher - Archive artifact linux-jdk7-m3.2.x_build/archetype-models/archetype-catalog/pom.xml
under org/apache/maven/archetype/archetype-catalog/3.1.2-SNAPSHOT/archetype-catalog-3.1.2-SNAPSHOT.pom
[withMaven] artifactsPublisher - Archive artifact linux-jdk7-m3.2.x_build/archetype-models/archetype-catalog/target/archetype-catalog-3.1.2-SNAPSHOT.jar
under org/apache/maven/archetype/archetype-catalog/3.1.2-SNAPSHOT/archetype-catalog-3.1.2-SNAPSHOT.jar
[withMaven] artifactsPublisher - Archive artifact linux-jdk7-m3.2.x_build/archetype-models/archetype-descriptor/pom.xml
under org/apache/maven/archetype/archetype-descriptor/3.1.2-SNAPSHOT/archetype-descriptor-3.1.2-SNAPSHOT.pom
[withMaven] artifactsPublisher - Archive artifact linux-jdk7-m3.2.x_build/archetype-models/archetype-descriptor/target/archetype-descriptor-3.1.2-SNAPSHOT.jar
under org/apache/maven/archetype/archetype-descriptor/3.1.2-SNAPSHOT/archetype-descriptor-3.1.2-SNAPSHOT.jar
[withMaven] artifactsPublisher - Archive artifact linux-jdk7-m3.2.x_build/archetype-common/pom.xml
under org/apache/maven/archetype/archetype-common/3.1.2-SNAPSHOT/archetype-common-3.1.2-SNAPSHOT.pom
[withMaven] artifactsPublisher - Archive artifact linux-jdk7-m3.2.x_build/archetype-common/target/archetype-common-3.1.2-SNAPSHOT.jar
under org/apache/maven/archetype/archetype-common/3.1.2-SNAPSHOT/archetype-common-3.1.2-SNAPSHOT.jar
[withMaven] artifactsPublisher - Archive artifact linux-jdk7-m3.2.x_build/archetype-packaging/pom.xml
under org/apache/maven/archetype/archetype-packaging/3.1.2-SNAPSHOT/archetype-packaging-3.1.2-SNAPSHOT.pom
[withMaven] artifactsPublisher - Archive artifact linux-jdk7-m3.2.x_build/archetype-packaging/target/archetype-packaging-3.1.2-SNAPSHOT.jar
under org/apache/maven/archetype/archetype-packaging/3.1.2-SNAPSHOT/archetype-packaging-3.1.2-SNAPSHOT.jar
[withMaven] artifactsPublisher - Archive artifact linux-jdk7-m3.2.x_build/maven-archetype-plugin/pom.xml
under org/apache/maven/plugins/maven-archetype-plugin/3.1.2-SNAPSHOT/maven-archetype-plugin-3.1.2-SNAPSHOT.pom
[withMaven] artifactsPublisher - Archive artifact linux-jdk7-m3.2.x_build/maven-archetype-plugin/target/maven-archetype-plugin-3.1.2-SNAPSHOT.jar
under org/apache/maven/plugins/maven-archetype-plugin/3.1.2-SNAPSHOT/maven-archetype-plugin-3.1.2-SNAPSHOT.jar
[withMaven] junitPublisher - Archive test results for Maven artifact org.apache.maven.archetype:archetype-catalog:jar:3.1.2-SNAPSHOT
generated by maven-surefire-plugin:test (default-test): linux-jdk7-m3.2.x_build/archetype-models/archetype-catalog/target/surefire-reports/*.xml
[withMaven] junitPublisher - Archive test results for Maven artifact org.apache.maven.archetype:archetype-descriptor:jar:3.1.2-SNAPSHOT
generated by maven-surefire-plugin:test (default-test): linux-jdk7-m3.2.x_build/archetype-models/archetype-descriptor/target/surefire-reports/*.xml
[withMaven] junitPublisher - Archive test results for Maven artifact org.apache.maven.archetype:archetype-common:jar:3.1.2-SNAPSHOT
generated by maven-surefire-plugin:test (default-test): linux-jdk7-m3.2.x_build/archetype-common/target/surefire-reports/*.xml
[withMaven] junitPublisher - Archive test results for Maven artifact org.apache.maven.archetype:archetype-packaging:jar:3.1.2-SNAPSHOT
generated by maven-surefire-plugin:test (default-test): linux-jdk7-m3.2.x_build/archetype-packaging/target/surefire-reports/*.xml
[withMaven] junitPublisher - Archive test results for Maven artifact org.apache.maven.plugins:maven-archetype-plugin:maven-plugin:3.1.2-SNAPSHOT
generated by maven-surefire-plugin:test (default-test): linux-jdk7-m3.2.x_build/maven-archetype-plugin/target/surefire-reports/*.xml
Recording test results
[withMaven] openTasksPublisher - Scan Tasks for Maven artifact org.apache.maven.archetype:archetype-common:jar:3.1.2-SNAPSHOT
in source directory linux-jdk7-m3.2.x_build/archetype-common/src/main/java
[withMaven] openTasksPublisher - Scan Tasks for Maven artifact org.apache.maven.plugins:maven-archetype-plugin:maven-plugin:3.1.2-SNAPSHOT
in source directory linux-jdk7-m3.2.x_build/maven-archetype-plugin/src/main/java
[TASKS] Scanning folder '/home/jenkins/jenkins-slave/workspace/ven-box_maven-archetype_buildfix@2'
for files matching the pattern 'linux-jdk7-m3.2.x_build/archetype-common/src/main/java/**/*,linux-jdk7-m3.2.x_build/maven-archetype-plugin/src/main/java/**/*'
- excludes: null
[TASKS] Found 89 files to scan for tasks
[TASKS] Found 26 open tasks.
Skipping warnings blame since pipelines do not have an SCM link.%n
[TASKS] Computing warning deltas based on reference build #29
[withMaven] invokerPublisher - Archive invoker results for Maven artifact MavenArtifact{org.apache.maven.plugins:maven-archetype-plugin:maven-plugin:3.1.2-SNAPSHOT(version:
3.1.2-SNAPSHOT, snapshot:false) } generated by PluginInvocation{org.apache.maven.plugins:maven-invoker-plugin:3.2.0@integration-test
 invoker-it}: linux-jdk7-m3.2.x_build/maven-archetype-plugin/target/invoker-reports/*.xml
[withMaven] Publishers: Generated Artifacts Publisher: 5917 ms, Junit Publisher: 8159 ms,
Open Task Scanner Publisher: 3636 ms, Dependencies Fingerprint Publisher: 1561 ms, Invoker
Publisher: 25174 ms, Pipeline Graph Publisher: 5 ms
[Pipeline] // withMaven
[Pipeline] cleanWs
[WS-CLEANUP] Deleting project workspace...
[WS-CLEANUP] Deferred wipeout is used...
[WS-CLEANUP] done
[Pipeline] }
[Pipeline] // stage
[Pipeline] }
[Pipeline] // ws
[Pipeline] }
[Pipeline] // node
[Pipeline] }
[Pipeline] // parallel
[Pipeline] stage
[Pipeline] { (Notifications)
[Pipeline] echo
Build result: FAILURE
[Pipeline] jiraIssueSelector
[Pipeline] echo
The authors of changes [tibordigana].
[Pipeline] echo
Sending email ...
[Pipeline] emailext
Mime
  • Unnamed multipart/mixed (inline, None, 0 bytes)
View raw message