maven-notifications mailing list archives

Site index · List index
Message view « Date » · « Thread »
Top « Date » · « Thread »
From Apache Jenkins Server <jenk...@builds.apache.org>
Subject Build failed in Jenkins: Maven TLP » maven-wagon » master #25
Date Tue, 20 Aug 2019 20:59:40 GMT
See https://builds.apache.org/job/maven-box/job/maven-wagon/job/master/25/

Changes:

* ${env.EXECUTOR_NUMBER} returns null
* inline env.BRANCH_NAME directly in IF statement
* used env.EXECUTOR_NUMBER
* moved "def localRepo ..." to the stage execution block

No tests ran.

Build log:
Started by user rfscholte
Obtained Jenkinsfile from 184cdad07a78cedcfdce68b6d8b05040593f4176
Running in Durability level: MAX_SURVIVABILITY
Loading library jenkins-env@master
Attempting to resolve master from remote references...
 > git --version # timeout=10
 > git ls-remote -h https://gitbox.apache.org/repos/asf/maven-jenkins-env.git # timeout=10
Found match: refs/heads/master revision c85d339c36fa2140d7f0048ffd1a4370ce69b502
No credentials specified
 > git rev-parse --is-inside-work-tree # timeout=10
Fetching changes from the remote Git repository
 > git config remote.origin.url https://gitbox.apache.org/repos/asf/maven-jenkins-env.git
# timeout=10
Fetching without tags
Fetching upstream changes from https://gitbox.apache.org/repos/asf/maven-jenkins-env.git
 > git --version # timeout=10
 > git fetch --no-tags --progress https://gitbox.apache.org/repos/asf/maven-jenkins-env.git
+refs/heads/*:refs/remotes/origin/*
Checking out Revision c85d339c36fa2140d7f0048ffd1a4370ce69b502 (master)
 > git config core.sparsecheckout # timeout=10
 > git checkout -f c85d339c36fa2140d7f0048ffd1a4370ce69b502
Commit message: "Prevent Caused: java.io.NotSerializableException: hudson.model.User"
 > git rev-list --no-walk c85d339c36fa2140d7f0048ffd1a4370ce69b502 # timeout=10
Loading library jenkins-lib@master
Attempting to resolve master from remote references...
 > git --version # timeout=10
 > git ls-remote -h https://gitbox.apache.org/repos/asf/maven-jenkins-lib.git # timeout=10
Found match: refs/heads/master revision aee445426dac012af4326c0b80c93422200c2a56
No credentials specified
 > git rev-parse --is-inside-work-tree # timeout=10
Fetching changes from the remote Git repository
 > git config remote.origin.url https://gitbox.apache.org/repos/asf/maven-jenkins-lib.git
# timeout=10
Fetching without tags
Fetching upstream changes from https://gitbox.apache.org/repos/asf/maven-jenkins-lib.git
 > git --version # timeout=10
 > git fetch --no-tags --progress https://gitbox.apache.org/repos/asf/maven-jenkins-lib.git
+refs/heads/*:refs/remotes/origin/*
Checking out Revision aee445426dac012af4326c0b80c93422200c2a56 (master)
 > git config core.sparsecheckout # timeout=10
 > git checkout -f aee445426dac012af4326c0b80c93422200c2a56
Commit message: "moved "def localRepo ..." to the stage execution block"
 > git rev-list --no-walk 0a8878dba156b6bd5fe800d268299faa9d91ca54 # timeout=10
[Pipeline] Start of Pipeline
[Pipeline] properties
[Pipeline] echo
OS: linux JDK: 7 Maven: 3.x.x => Label: ubuntu JDK: JDK 1.7 (latest) Maven: Maven 3.6.0
[Pipeline] echo
OS: linux JDK: 8 Maven: 3.x.x => Label: ubuntu JDK: JDK 1.8 (latest) Maven: Maven 3.6.0
[Pipeline] echo
OS: linux JDK: 11 Maven: 3.x.x => Label: ubuntu JDK: JDK 11 (latest) Maven: Maven 3.6.0
[Pipeline] echo
OS: linux JDK: 12 Maven: 3.x.x => Label: ubuntu JDK: JDK 12 (latest) Maven: Maven 3.6.0
[Pipeline] echo
OS: windows JDK: 7 Maven: 3.x.x => Label: Windows JDK: JDK 1.7 (latest) Maven: Maven 3.6.0
(Windows)
[Pipeline] echo
OS: windows JDK: 8 Maven: 3.x.x => Label: Windows JDK: JDK 1.8 (latest) Maven: Maven 3.6.0
(Windows)
[Pipeline] echo
OS: windows JDK: 11 Maven: 3.x.x => Label: Windows JDK: JDK 11 (latest) Maven: Maven 3.6.0
(Windows)
[Pipeline] echo
OS: windows JDK: 12 Maven: 3.x.x => Label: Windows JDK: JDK 12 (latest) Maven: Maven 3.6.0
(Windows)
[Pipeline] parallel
[Pipeline] { (Branch: linux-jdk7)
[Pipeline] { (Branch: linux-jdk8)
[Pipeline] { (Branch: linux-jdk11)
[Pipeline] { (Branch: linux-jdk12)
[Pipeline] { (Branch: windows-jdk7)
[Pipeline] { (Branch: windows-jdk8)
[Pipeline] { (Branch: windows-jdk11)
[Pipeline] { (Branch: windows-jdk12)
[Pipeline] node
[Pipeline] node
[Pipeline] node
[Pipeline] node
[Pipeline] node
[Pipeline] node
[Pipeline] node
[Pipeline] node
Running on jenkins-win-he-de-4 in f:\jenkins\jenkins-slave\workspace\maven-box_maven-wagon_master
[Pipeline] {
Running on jenkins-win-he-de-4 in f:\jenkins\jenkins-slave\workspace\maven-box_maven-wagon_master@2
[Pipeline] stage
[Pipeline] { (Checkout windows-jdk8)
Running on jenkins-win-he-de-6 in f:\jenkins\jenkins-slave\workspace\maven-box_maven-wagon_master
Running on jenkins-win-he-de-4 in f:\jenkins\jenkins-slave\workspace\maven-box_maven-wagon_master@3
[Pipeline] {
[Pipeline] {
[Pipeline] {
[Pipeline] dir
Running in f:\jenkins\jenkins-slave\workspace\maven-box_maven-wagon_master\m
[Pipeline] {
[Pipeline] stage
[Pipeline] { (Checkout windows-jdk7)
[Pipeline] stage
[Pipeline] { (Checkout windows-jdk12)
[Pipeline] stage
[Pipeline] { (Checkout windows-jdk11)
[Pipeline] checkout
[Pipeline] dir
Running in f:\jenkins\jenkins-slave\workspace\maven-box_maven-wagon_master@2\m
[Pipeline] {
[Pipeline] dir
Running in f:\jenkins\jenkins-slave\workspace\maven-box_maven-wagon_master\m
[Pipeline] {
[Pipeline] dir
Running in f:\jenkins\jenkins-slave\workspace\maven-box_maven-wagon_master@3\m
[Pipeline] {
[Pipeline] checkout
[Pipeline] checkout
[Pipeline] checkout
No credentials specified
Cloning the remote Git repository
Cloning with configured refspecs honoured and without tags
Cloning repository https://gitbox.apache.org/repos/asf/maven-wagon.git
 > git init f:\jenkins\jenkins-slave\workspace\maven-box_maven-wagon_master\m # timeout=10
Fetching upstream changes from https://gitbox.apache.org/repos/asf/maven-wagon.git
 > git --version # timeout=10
 > git fetch --no-tags --progress https://gitbox.apache.org/repos/asf/maven-wagon.git +refs/heads/*:refs/remotes/origin/*
Aborted by rfscholte
[Pipeline] // node
[Pipeline] // node
[Pipeline] // node
[Pipeline] // node
[Pipeline] }
Failed in branch linux-jdk7
[Pipeline] }
Failed in branch linux-jdk8
[Pipeline] }
Failed in branch linux-jdk11
[Pipeline] }
Failed in branch linux-jdk12
[Pipeline] }
[Pipeline] }
[Pipeline] }
[Pipeline] }
[Pipeline] // dir
[Pipeline] // dir
[Pipeline] // dir
[Pipeline] // dir
[Pipeline] cleanWs
[Pipeline] cleanWs
[WS-CLEANUP] Deleting project workspace...
[WS-CLEANUP] Deferred wipeout is used...
[Pipeline] cleanWs
[WS-CLEANUP] Deleting project workspace...
[WS-CLEANUP] Deferred wipeout is used...
[WS-CLEANUP] done
[Pipeline] cleanWs
[WS-CLEANUP] Deleting project workspace...
[WS-CLEANUP] Deferred wipeout is used...
[WS-CLEANUP] done
[WS-CLEANUP] Deleting project workspace...[WS-CLEANUP] done

[WS-CLEANUP] Deferred wipeout is used...
[Pipeline] }
[Pipeline] }
[WS-CLEANUP] done
[Pipeline] }
[Pipeline] // stage
[Pipeline] // stage
[Pipeline] // stage
[Pipeline] }
[Pipeline] }
[Pipeline] }
[Pipeline] }
[Pipeline] // node
[Pipeline] // node
[Pipeline] // node
[Pipeline] // stage
[Pipeline] }
Failed in branch windows-jdk7
[Pipeline] }
Failed in branch windows-jdk8
[Pipeline] }
Failed in branch windows-jdk12
[Pipeline] }
[Pipeline] // node
[Pipeline] }
Failed in branch windows-jdk11
[Pipeline] // parallel
[Pipeline] echo
[FAILURE-002] FlowInterruptedException org.jenkinsci.plugins.workflow.steps.FlowInterruptedException
[Pipeline] stage
[Pipeline] { (Notifications)
[Pipeline] echo
Build result: FAILURE
[Pipeline] jiraIssueSelector
[Pipeline] echo
The authors of changes [tibordigana].
[Pipeline] echo
Sending email ...
[Pipeline] emailext
Mime
  • Unnamed multipart/mixed (inline, None, 0 bytes)
View raw message