maven-notifications mailing list archives

Site index · List index
Message view « Date » · « Thread »
Top « Date » · « Thread »
From Apache Jenkins Server <jenk...@builds.apache.org>
Subject Build unstable in Jenkins: Maven TLP » maven » master #264
Date Sun, 04 Aug 2019 17:37:54 GMT
See https://builds.apache.org/job/maven-box/job/maven/job/master/264/

No changes.

16 tests failed.
FAILED:  org.apache.maven.it.MavenITmng3183LoggingToFileTest.linux-jdk12 / Run ITs Linux Java 12 / testit

Error Message:
expected:<[]> but was:<[Picked up JAVA_TOOL_OPTIONS: , WARNING: An illegal reflective access operation has occurred, WARNING: Illegal reflective access by org.apache.maven.model.interpolation.StringSearchModelInterpolator$InterpolateObjectAction$CacheField (file:/home/jenkins/jenkins-slave/workspace/maven-box_maven_master/test/core-it-suite/target/apache-maven/lib/maven-model-builder-3.6.2-SNAPSHOT.jar) to field java.io.File.fs, WARNING: Please consider reporting this to the maintainers of org.apache.maven.model.interpolation.StringSearchModelInterpolator$InterpolateObjectAction$CacheField, WARNING: Use --illegal-access=warn to enable warnings of further illegal reflective access operations, WARNING: All illegal access operations will be denied in a future release]>

Stack Trace:
junit.framework.AssertionFailedError: expected:<[]> but was:<[Picked up JAVA_TOOL_OPTIONS: , WARNING: An illegal reflective access operation has occurred, WARNING: Illegal reflective access by org.apache.maven.model.interpolation.StringSearchModelInterpolator$InterpolateObjectAction$CacheField (file:/home/jenkins/jenkins-slave/workspace/maven-box_maven_master/test/core-it-suite/target/apache-maven/lib/maven-model-builder-3.6.2-SNAPSHOT.jar) to field java.io.File.fs, WARNING: Please consider reporting this to the maintainers of org.apache.maven.model.interpolation.StringSearchModelInterpolator$InterpolateObjectAction$CacheField, WARNING: Use --illegal-access=warn to enable warnings of further illegal reflective access operations, WARNING: All illegal access operations will be denied in a future release]>
	at org.apache.maven.it.MavenITmng3183LoggingToFileTest.testit(MavenITmng3183LoggingToFileTest.java:74)


FAILED:  org.apache.maven.it.MavenITmng3183LoggingToFileTest.linux-jdk11 / Run ITs Linux Java 11 / testit

Error Message:
expected:<[]> but was:<[Picked up JAVA_TOOL_OPTIONS: , WARNING: An illegal reflective access operation has occurred, WARNING: Illegal reflective access by org.apache.maven.model.interpolation.StringSearchModelInterpolator$InterpolateObjectAction$CacheField (file:/home/jenkins/jenkins-slave/workspace/maven-box_maven_master/test/core-it-suite/target/apache-maven/lib/maven-model-builder-3.6.2-SNAPSHOT.jar) to field java.io.File.fs, WARNING: Please consider reporting this to the maintainers of org.apache.maven.model.interpolation.StringSearchModelInterpolator$InterpolateObjectAction$CacheField, WARNING: Use --illegal-access=warn to enable warnings of further illegal reflective access operations, WARNING: All illegal access operations will be denied in a future release]>

Stack Trace:
junit.framework.AssertionFailedError: expected:<[]> but was:<[Picked up JAVA_TOOL_OPTIONS: , WARNING: An illegal reflective access operation has occurred, WARNING: Illegal reflective access by org.apache.maven.model.interpolation.StringSearchModelInterpolator$InterpolateObjectAction$CacheField (file:/home/jenkins/jenkins-slave/workspace/maven-box_maven_master/test/core-it-suite/target/apache-maven/lib/maven-model-builder-3.6.2-SNAPSHOT.jar) to field java.io.File.fs, WARNING: Please consider reporting this to the maintainers of org.apache.maven.model.interpolation.StringSearchModelInterpolator$InterpolateObjectAction$CacheField, WARNING: Use --illegal-access=warn to enable warnings of further illegal reflective access operations, WARNING: All illegal access operations will be denied in a future release]>
	at org.apache.maven.it.MavenITmng3183LoggingToFileTest.testit(MavenITmng3183LoggingToFileTest.java:74)


FAILED:  org.apache.maven.it.MavenITmng3183LoggingToFileTest.linux-jdk8 / Run ITs Linux Java 8 / testit

Error Message:
expected:<[]> but was:<[Picked up JAVA_TOOL_OPTIONS: ]>

Stack Trace:
junit.framework.AssertionFailedError: expected:<[]> but was:<[Picked up JAVA_TOOL_OPTIONS: ]>
	at org.apache.maven.it.MavenITmng3183LoggingToFileTest.testit(MavenITmng3183LoggingToFileTest.java:74)


FAILED:  org.apache.maven.it.MavenITmng3183LoggingToFileTest.windows-jdk12 / Run ITs Windows Java 12 / testit

Error Message:
expected:<[]> but was:<[Picked up JAVA_TOOL_OPTIONS: , WARNING: An illegal reflective access operation has occurred, WARNING: Illegal reflective access by org.apache.maven.model.interpolation.StringSearchModelInterpolator$InterpolateObjectAction$CacheField (file:/C:/mvn-it-2.tmp/core-it-suite/target/apache-maven/bin/../lib/maven-model-builder-3.6.2-SNAPSHOT.jar) to field java.io.File.fs, WARNING: Please consider reporting this to the maintainers of org.apache.maven.model.interpolation.StringSearchModelInterpolator$InterpolateObjectAction$CacheField, WARNING: Use --illegal-access=warn to enable warnings of further illegal reflective access operations, WARNING: All illegal access operations will be denied in a future release]>

Stack Trace:
junit.framework.AssertionFailedError: expected:<[]> but was:<[Picked up JAVA_TOOL_OPTIONS: , WARNING: An illegal reflective access operation has occurred, WARNING: Illegal reflective access by org.apache.maven.model.interpolation.StringSearchModelInterpolator$InterpolateObjectAction$CacheField (file:/C:/mvn-it-2.tmp/core-it-suite/target/apache-maven/bin/../lib/maven-model-builder-3.6.2-SNAPSHOT.jar) to field java.io.File.fs, WARNING: Please consider reporting this to the maintainers of org.apache.maven.model.interpolation.StringSearchModelInterpolator$InterpolateObjectAction$CacheField, WARNING: Use --illegal-access=warn to enable warnings of further illegal reflective access operations, WARNING: All illegal access operations will be denied in a future release]>
	at org.apache.maven.it.MavenITmng3183LoggingToFileTest.testit(MavenITmng3183LoggingToFileTest.java:74)


FAILED:  org.apache.maven.it.MavenITmng3183LoggingToFileTest.windows-jdk11 / Run ITs Windows Java 11 / testit

Error Message:
expected:<[]> but was:<[Picked up JAVA_TOOL_OPTIONS: , WARNING: An illegal reflective access operation has occurred, WARNING: Illegal reflective access by org.apache.maven.model.interpolation.StringSearchModelInterpolator$InterpolateObjectAction$CacheField (file:/C:/mvn-it-0.tmp/core-it-suite/target/apache-maven/bin/../lib/maven-model-builder-3.6.2-SNAPSHOT.jar) to field java.io.File.fs, WARNING: Please consider reporting this to the maintainers of org.apache.maven.model.interpolation.StringSearchModelInterpolator$InterpolateObjectAction$CacheField, WARNING: Use --illegal-access=warn to enable warnings of further illegal reflective access operations, WARNING: All illegal access operations will be denied in a future release]>

Stack Trace:
junit.framework.AssertionFailedError: expected:<[]> but was:<[Picked up JAVA_TOOL_OPTIONS: , WARNING: An illegal reflective access operation has occurred, WARNING: Illegal reflective access by org.apache.maven.model.interpolation.StringSearchModelInterpolator$InterpolateObjectAction$CacheField (file:/C:/mvn-it-0.tmp/core-it-suite/target/apache-maven/bin/../lib/maven-model-builder-3.6.2-SNAPSHOT.jar) to field java.io.File.fs, WARNING: Please consider reporting this to the maintainers of org.apache.maven.model.interpolation.StringSearchModelInterpolator$InterpolateObjectAction$CacheField, WARNING: Use --illegal-access=warn to enable warnings of further illegal reflective access operations, WARNING: All illegal access operations will be denied in a future release]>
	at org.apache.maven.it.MavenITmng3183LoggingToFileTest.testit(MavenITmng3183LoggingToFileTest.java:74)


FAILED:  org.apache.maven.it.MavenITmng3183LoggingToFileTest.linux-jdk7 / Run ITs Linux Java 7 / testit

Error Message:
expected:<[]> but was:<[Picked up JAVA_TOOL_OPTIONS: ]>

Stack Trace:
junit.framework.AssertionFailedError: expected:<[]> but was:<[Picked up JAVA_TOOL_OPTIONS: ]>
	at org.apache.maven.it.MavenITmng3183LoggingToFileTest.testit(MavenITmng3183LoggingToFileTest.java:74)


FAILED:  org.apache.maven.it.MavenITmng4387QuietLoggingTest.linux-jdk12 / Run ITs Linux Java 12 / testit

Error Message:
expected:<[]> but was:<[Picked up JAVA_TOOL_OPTIONS: , WARNING: An illegal reflective access operation has occurred, WARNING: Illegal reflective access by org.apache.maven.model.interpolation.StringSearchModelInterpolator$InterpolateObjectAction$CacheField (file:/home/jenkins/jenkins-slave/workspace/maven-box_maven_master/test/core-it-suite/target/apache-maven/lib/maven-model-builder-3.6.2-SNAPSHOT.jar) to field java.io.File.fs, WARNING: Please consider reporting this to the maintainers of org.apache.maven.model.interpolation.StringSearchModelInterpolator$InterpolateObjectAction$CacheField, WARNING: Use --illegal-access=warn to enable warnings of further illegal reflective access operations, WARNING: All illegal access operations will be denied in a future release]>

Stack Trace:
junit.framework.AssertionFailedError: expected:<[]> but was:<[Picked up JAVA_TOOL_OPTIONS: , WARNING: An illegal reflective access operation has occurred, WARNING: Illegal reflective access by org.apache.maven.model.interpolation.StringSearchModelInterpolator$InterpolateObjectAction$CacheField (file:/home/jenkins/jenkins-slave/workspace/maven-box_maven_master/test/core-it-suite/target/apache-maven/lib/maven-model-builder-3.6.2-SNAPSHOT.jar) to field java.io.File.fs, WARNING: Please consider reporting this to the maintainers of org.apache.maven.model.interpolation.StringSearchModelInterpolator$InterpolateObjectAction$CacheField, WARNING: Use --illegal-access=warn to enable warnings of further illegal reflective access operations, WARNING: All illegal access operations will be denied in a future release]>
	at org.apache.maven.it.MavenITmng4387QuietLoggingTest.testit(MavenITmng4387QuietLoggingTest.java:71)


FAILED:  org.apache.maven.it.MavenITmng4387QuietLoggingTest.linux-jdk11 / Run ITs Linux Java 11 / testit

Error Message:
expected:<[]> but was:<[Picked up JAVA_TOOL_OPTIONS: , WARNING: An illegal reflective access operation has occurred, WARNING: Illegal reflective access by org.apache.maven.model.interpolation.StringSearchModelInterpolator$InterpolateObjectAction$CacheField (file:/home/jenkins/jenkins-slave/workspace/maven-box_maven_master/test/core-it-suite/target/apache-maven/lib/maven-model-builder-3.6.2-SNAPSHOT.jar) to field java.io.File.fs, WARNING: Please consider reporting this to the maintainers of org.apache.maven.model.interpolation.StringSearchModelInterpolator$InterpolateObjectAction$CacheField, WARNING: Use --illegal-access=warn to enable warnings of further illegal reflective access operations, WARNING: All illegal access operations will be denied in a future release]>

Stack Trace:
junit.framework.AssertionFailedError: expected:<[]> but was:<[Picked up JAVA_TOOL_OPTIONS: , WARNING: An illegal reflective access operation has occurred, WARNING: Illegal reflective access by org.apache.maven.model.interpolation.StringSearchModelInterpolator$InterpolateObjectAction$CacheField (file:/home/jenkins/jenkins-slave/workspace/maven-box_maven_master/test/core-it-suite/target/apache-maven/lib/maven-model-builder-3.6.2-SNAPSHOT.jar) to field java.io.File.fs, WARNING: Please consider reporting this to the maintainers of org.apache.maven.model.interpolation.StringSearchModelInterpolator$InterpolateObjectAction$CacheField, WARNING: Use --illegal-access=warn to enable warnings of further illegal reflective access operations, WARNING: All illegal access operations will be denied in a future release]>
	at org.apache.maven.it.MavenITmng4387QuietLoggingTest.testit(MavenITmng4387QuietLoggingTest.java:71)


FAILED:  org.apache.maven.it.MavenITmng4387QuietLoggingTest.linux-jdk8 / Run ITs Linux Java 8 / testit

Error Message:
expected:<[]> but was:<[Picked up JAVA_TOOL_OPTIONS: ]>

Stack Trace:
junit.framework.AssertionFailedError: expected:<[]> but was:<[Picked up JAVA_TOOL_OPTIONS: ]>
	at org.apache.maven.it.MavenITmng4387QuietLoggingTest.testit(MavenITmng4387QuietLoggingTest.java:71)


FAILED:  org.apache.maven.it.MavenITmng4387QuietLoggingTest.windows-jdk12 / Run ITs Windows Java 12 / testit

Error Message:
expected:<[]> but was:<[Picked up JAVA_TOOL_OPTIONS: , WARNING: An illegal reflective access operation has occurred, WARNING: Illegal reflective access by org.apache.maven.model.interpolation.StringSearchModelInterpolator$InterpolateObjectAction$CacheField (file:/C:/mvn-it-2.tmp/core-it-suite/target/apache-maven/bin/../lib/maven-model-builder-3.6.2-SNAPSHOT.jar) to field java.io.File.fs, WARNING: Please consider reporting this to the maintainers of org.apache.maven.model.interpolation.StringSearchModelInterpolator$InterpolateObjectAction$CacheField, WARNING: Use --illegal-access=warn to enable warnings of further illegal reflective access operations, WARNING: All illegal access operations will be denied in a future release]>

Stack Trace:
junit.framework.AssertionFailedError: expected:<[]> but was:<[Picked up JAVA_TOOL_OPTIONS: , WARNING: An illegal reflective access operation has occurred, WARNING: Illegal reflective access by org.apache.maven.model.interpolation.StringSearchModelInterpolator$InterpolateObjectAction$CacheField (file:/C:/mvn-it-2.tmp/core-it-suite/target/apache-maven/bin/../lib/maven-model-builder-3.6.2-SNAPSHOT.jar) to field java.io.File.fs, WARNING: Please consider reporting this to the maintainers of org.apache.maven.model.interpolation.StringSearchModelInterpolator$InterpolateObjectAction$CacheField, WARNING: Use --illegal-access=warn to enable warnings of further illegal reflective access operations, WARNING: All illegal access operations will be denied in a future release]>
	at org.apache.maven.it.MavenITmng4387QuietLoggingTest.testit(MavenITmng4387QuietLoggingTest.java:71)


FAILED:  org.apache.maven.it.MavenITmng4387QuietLoggingTest.windows-jdk11 / Run ITs Windows Java 11 / testit

Error Message:
expected:<[]> but was:<[Picked up JAVA_TOOL_OPTIONS: , WARNING: An illegal reflective access operation has occurred, WARNING: Illegal reflective access by org.apache.maven.model.interpolation.StringSearchModelInterpolator$InterpolateObjectAction$CacheField (file:/C:/mvn-it-0.tmp/core-it-suite/target/apache-maven/bin/../lib/maven-model-builder-3.6.2-SNAPSHOT.jar) to field java.io.File.fs, WARNING: Please consider reporting this to the maintainers of org.apache.maven.model.interpolation.StringSearchModelInterpolator$InterpolateObjectAction$CacheField, WARNING: Use --illegal-access=warn to enable warnings of further illegal reflective access operations, WARNING: All illegal access operations will be denied in a future release]>

Stack Trace:
junit.framework.AssertionFailedError: expected:<[]> but was:<[Picked up JAVA_TOOL_OPTIONS: , WARNING: An illegal reflective access operation has occurred, WARNING: Illegal reflective access by org.apache.maven.model.interpolation.StringSearchModelInterpolator$InterpolateObjectAction$CacheField (file:/C:/mvn-it-0.tmp/core-it-suite/target/apache-maven/bin/../lib/maven-model-builder-3.6.2-SNAPSHOT.jar) to field java.io.File.fs, WARNING: Please consider reporting this to the maintainers of org.apache.maven.model.interpolation.StringSearchModelInterpolator$InterpolateObjectAction$CacheField, WARNING: Use --illegal-access=warn to enable warnings of further illegal reflective access operations, WARNING: All illegal access operations will be denied in a future release]>
	at org.apache.maven.it.MavenITmng4387QuietLoggingTest.testit(MavenITmng4387QuietLoggingTest.java:71)


FAILED:  org.apache.maven.it.MavenITmng4387QuietLoggingTest.linux-jdk7 / Run ITs Linux Java 7 / testit

Error Message:
expected:<[]> but was:<[Picked up JAVA_TOOL_OPTIONS: ]>

Stack Trace:
junit.framework.AssertionFailedError: expected:<[]> but was:<[Picked up JAVA_TOOL_OPTIONS: ]>
	at org.apache.maven.it.MavenITmng4387QuietLoggingTest.testit(MavenITmng4387QuietLoggingTest.java:71)


FAILED:  org.apache.maven.it.MavenITmng5576CdFriendlyVersions.linux-jdk12 / Run ITs Linux Java 12 / testContinuousDeliveryFriendlyVersionsAreWarningFree

Error Message:
WARNING: An illegal reflective access operation has occurred

Stack Trace:
junit.framework.AssertionFailedError: WARNING: An illegal reflective access operation has occurred
	at org.apache.maven.it.MavenITmng5576CdFriendlyVersions.testContinuousDeliveryFriendlyVersionsAreWarningFree(MavenITmng5576CdFriendlyVersions.java:65)


FAILED:  org.apache.maven.it.MavenITmng5576CdFriendlyVersions.linux-jdk11 / Run ITs Linux Java 11 / testContinuousDeliveryFriendlyVersionsAreWarningFree

Error Message:
WARNING: An illegal reflective access operation has occurred

Stack Trace:
junit.framework.AssertionFailedError: WARNING: An illegal reflective access operation has occurred
	at org.apache.maven.it.MavenITmng5576CdFriendlyVersions.testContinuousDeliveryFriendlyVersionsAreWarningFree(MavenITmng5576CdFriendlyVersions.java:65)


FAILED:  org.apache.maven.it.MavenITmng5576CdFriendlyVersions.windows-jdk12 / Run ITs Windows Java 12 / testContinuousDeliveryFriendlyVersionsAreWarningFree

Error Message:
WARNING: An illegal reflective access operation has occurred

Stack Trace:
junit.framework.AssertionFailedError: WARNING: An illegal reflective access operation has occurred
	at org.apache.maven.it.MavenITmng5576CdFriendlyVersions.testContinuousDeliveryFriendlyVersionsAreWarningFree(MavenITmng5576CdFriendlyVersions.java:65)


FAILED:  org.apache.maven.it.MavenITmng5576CdFriendlyVersions.windows-jdk11 / Run ITs Windows Java 11 / testContinuousDeliveryFriendlyVersionsAreWarningFree

Error Message:
WARNING: An illegal reflective access operation has occurred

Stack Trace:
junit.framework.AssertionFailedError: WARNING: An illegal reflective access operation has occurred
	at org.apache.maven.it.MavenITmng5576CdFriendlyVersions.testContinuousDeliveryFriendlyVersionsAreWarningFree(MavenITmng5576CdFriendlyVersions.java:65)




Build log:
[...truncated 77133 lines...]
[withMaven] junitPublisher - Archive test results for Maven artifact org.apache.maven.its.plugins:maven-it-plugin-context-passing:maven-plugin:2.1-SNAPSHOT generated by maven-surefire-plugin:test (default-test): core-it-support\core-it-plugins\maven-it-plugin-context-passing\target\surefire-reports\*.xml
[withMaven] junitPublisher - Archive test results for Maven artifact org.apache.maven.plugins:maven-clean-plugin:maven-plugin:0.1-stub-SNAPSHOT generated by maven-surefire-plugin:test (default-test): core-it-support\core-it-plugins\maven-it-plugin-core-stubs\maven-clean-plugin\target\surefire-reports\*.xml
[withMaven] junitPublisher - Archive test results for Maven artifact org.apache.maven.plugins:maven-compiler-plugin:maven-plugin:0.1-stub-SNAPSHOT generated by maven-surefire-plugin:test (default-test): core-it-support\core-it-plugins\maven-it-plugin-core-stubs\maven-compiler-plugin\target\surefire-reports\*.xml
[withMaven] junitPublisher - Archive test results for Maven artifact org.apache.maven.plugins:maven-deploy-plugin:maven-plugin:0.1-stub-SNAPSHOT generated by maven-surefire-plugin:test (default-test): core-it-support\core-it-plugins\maven-it-plugin-core-stubs\maven-deploy-plugin\target\surefire-reports\*.xml
[withMaven] junitPublisher - Archive test results for Maven artifact org.apache.maven.plugins:maven-ear-plugin:maven-plugin:0.1-stub-SNAPSHOT generated by maven-surefire-plugin:test (default-test): core-it-support\core-it-plugins\maven-it-plugin-core-stubs\maven-ear-plugin\target\surefire-reports\*.xml
[withMaven] junitPublisher - Archive test results for Maven artifact org.apache.maven.plugins:maven-ejb-plugin:maven-plugin:0.1-stub-SNAPSHOT generated by maven-surefire-plugin:test (default-test): core-it-support\core-it-plugins\maven-it-plugin-core-stubs\maven-ejb-plugin\target\surefire-reports\*.xml
[withMaven] junitPublisher - Archive test results for Maven artifact org.apache.maven.plugins:maven-install-plugin:maven-plugin:0.1-stub-SNAPSHOT generated by maven-surefire-plugin:test (default-test): core-it-support\core-it-plugins\maven-it-plugin-core-stubs\maven-install-plugin\target\surefire-reports\*.xml
[withMaven] junitPublisher - Archive test results for Maven artifact org.apache.maven.plugins:maven-jar-plugin:maven-plugin:0.1-stub-SNAPSHOT generated by maven-surefire-plugin:test (default-test): core-it-support\core-it-plugins\maven-it-plugin-core-stubs\maven-jar-plugin\target\surefire-reports\*.xml
[withMaven] junitPublisher - Archive test results for Maven artifact org.apache.maven.plugins:maven-javadoc-plugin:maven-plugin:0.1-stub-SNAPSHOT generated by maven-surefire-plugin:test (default-test): core-it-support\core-it-plugins\maven-it-plugin-core-stubs\maven-javadoc-plugin\target\surefire-reports\*.xml
[withMaven] junitPublisher - Archive test results for Maven artifact org.apache.maven.plugins:maven-plugin-plugin:maven-plugin:0.1-stub-SNAPSHOT generated by maven-surefire-plugin:test (default-test): core-it-support\core-it-plugins\maven-it-plugin-core-stubs\maven-plugin-plugin\target\surefire-reports\*.xml
[withMaven] junitPublisher - Archive test results for Maven artifact org.apache.maven.plugins:maven-rar-plugin:maven-plugin:0.1-stub-SNAPSHOT generated by maven-surefire-plugin:test (default-test): core-it-support\core-it-plugins\maven-it-plugin-core-stubs\maven-rar-plugin\target\surefire-reports\*.xml
[withMaven] junitPublisher - Archive test results for Maven artifact org.apache.maven.plugins:maven-resources-plugin:maven-plugin:0.1-stub-SNAPSHOT generated by maven-surefire-plugin:test (default-test): core-it-support\core-it-plugins\maven-it-plugin-core-stubs\maven-resources-plugin\target\surefire-reports\*.xml
[withMaven] junitPublisher - Archive test results for Maven artifact org.apache.maven.plugins:maven-site-plugin:maven-plugin:0.1-stub-SNAPSHOT generated by maven-surefire-plugin:test (default-test): core-it-support\core-it-plugins\maven-it-plugin-core-stubs\maven-site-plugin\target\surefire-reports\*.xml
[withMaven] junitPublisher - Archive test results for Maven artifact org.apache.maven.plugins:maven-source-plugin:maven-plugin:0.1-stub-SNAPSHOT generated by maven-surefire-plugin:test (default-test): core-it-support\core-it-plugins\maven-it-plugin-core-stubs\maven-source-plugin\target\surefire-reports\*.xml
[withMaven] junitPublisher - Archive test results for Maven artifact org.apache.maven.plugins:maven-surefire-plugin:maven-plugin:0.1-stub-SNAPSHOT generated by maven-surefire-plugin:test (default-test): core-it-support\core-it-plugins\maven-it-plugin-core-stubs\maven-surefire-plugin\target\surefire-reports\*.xml
[withMaven] junitPublisher - Archive test results for Maven artifact org.apache.maven.plugins:maven-war-plugin:maven-plugin:0.1-stub-SNAPSHOT generated by maven-surefire-plugin:test (default-test): core-it-support\core-it-plugins\maven-it-plugin-core-stubs\maven-war-plugin\target\surefire-reports\*.xml
[withMaven] junitPublisher - Archive test results for Maven artifact org.apache.maven.its.plugins:maven-it-plugin-dependency-collection:maven-plugin:2.1-SNAPSHOT generated by maven-surefire-plugin:test (default-test): core-it-support\core-it-plugins\maven-it-plugin-dependency-collection\target\surefire-reports\*.xml
[withMaven] junitPublisher - Archive test results for Maven artifact org.apache.maven.its.plugins:maven-it-plugin-dependency-resolution:maven-plugin:2.1-SNAPSHOT generated by maven-surefire-plugin:test (default-test): core-it-support\core-it-plugins\maven-it-plugin-dependency-resolution\target\surefire-reports\*.xml
[withMaven] junitPublisher - Archive test results for Maven artifact org.apache.maven.its.plugins:maven-it-plugin-expression:maven-plugin:2.1-SNAPSHOT generated by maven-surefire-plugin:test (default-test): core-it-support\core-it-plugins\maven-it-plugin-expression\target\surefire-reports\*.xml
[withMaven] junitPublisher - Archive test results for Maven artifact org.apache.maven.its.plugins:maven-it-plugin-error:maven-plugin:2.1-SNAPSHOT generated by maven-surefire-plugin:test (default-test): core-it-support\core-it-plugins\maven-it-plugin-error\target\surefire-reports\*.xml
[withMaven] junitPublisher - Archive test results for Maven artifact org.apache.maven.its:core-it-component:jar:2.1-SNAPSHOT generated by maven-surefire-plugin:test (default-test): core-it-support\core-it-component\target\surefire-reports\*.xml
[withMaven] junitPublisher - Archive test results for Maven artifact org.apache.maven.its.plugins:maven-it-plugin-extension-consumer:maven-plugin:2.1-SNAPSHOT generated by maven-surefire-plugin:test (default-test): core-it-support\core-it-plugins\maven-it-plugin-extension-consumer\target\surefire-reports\*.xml
[withMaven] junitPublisher - Archive test results for Maven artifact org.apache.maven.its.plugins:maven-it-plugin-extension-provider:maven-plugin:2.1-SNAPSHOT generated by maven-surefire-plugin:test (default-test): core-it-support\core-it-plugins\maven-it-plugin-extension-provider\target\surefire-reports\*.xml
[withMaven] junitPublisher - Archive test results for Maven artifact org.apache.maven.its.plugins:maven-it-plugin-fork:maven-plugin:2.1-SNAPSHOT generated by maven-surefire-plugin:test (default-test): core-it-support\core-it-plugins\maven-it-plugin-fork\target\surefire-reports\*.xml
[withMaven] junitPublisher - Archive test results for Maven artifact org.apache.maven.its.plugins:maven-it-plugin-invalid-descriptor:maven-plugin:2.1-SNAPSHOT generated by maven-surefire-plugin:test (default-test): core-it-support\core-it-plugins\maven-it-plugin-invalid-descriptor\target\surefire-reports\*.xml
[withMaven] junitPublisher - Archive test results for Maven artifact org.apache.maven.its.plugins:maven-it-plugin-log-file:maven-plugin:2.1-SNAPSHOT generated by maven-surefire-plugin:test (default-test): core-it-support\core-it-plugins\maven-it-plugin-log-file\target\surefire-reports\*.xml
[withMaven] junitPublisher - Archive test results for Maven artifact org.apache.maven.its:maven-it-helper:jar:2.1-SNAPSHOT generated by maven-surefire-plugin:test (default-test): core-it-support\maven-it-helper\target\surefire-reports\*.xml
[withMaven] junitPublisher - Archive test results for Maven artifact org.apache.maven.its.plugins:maven-it-plugin-model-interpolation:maven-plugin:2.1-SNAPSHOT generated by maven-surefire-plugin:test (default-test): core-it-support\core-it-plugins\maven-it-plugin-model-interpolation\target\surefire-reports\*.xml
[withMaven] junitPublisher - Archive test results for Maven artifact org.apache.maven.its.plugins:maven-it-plugin-no-default-comp:maven-plugin:2.1-SNAPSHOT generated by maven-surefire-plugin:test (default-test): core-it-support\core-it-plugins\maven-it-plugin-no-default-comp\target\surefire-reports\*.xml
[withMaven] junitPublisher - Archive test results for Maven artifact org.apache.maven.its.plugins:maven-it-plugin-no-project:maven-plugin:2.1-SNAPSHOT generated by maven-surefire-plugin:test (default-test): core-it-support\core-it-plugins\maven-it-plugin-no-project\target\surefire-reports\*.xml
[withMaven] junitPublisher - Archive test results for Maven artifact org.apache.maven.its.plugins:maven-it-plugin-online:maven-plugin:2.1-SNAPSHOT generated by maven-surefire-plugin:test (default-test): core-it-support\core-it-plugins\maven-it-plugin-online\target\surefire-reports\*.xml
[withMaven] junitPublisher - Archive test results for Maven artifact org.apache.maven.its.plugins:maven-it-plugin-optional-mojos:maven-plugin:2.1-SNAPSHOT generated by maven-surefire-plugin:test (default-test): core-it-support\core-it-plugins\maven-it-plugin-optional-mojos\target\surefire-reports\*.xml
[withMaven] junitPublisher - Archive test results for Maven artifact org.apache.maven.its.plugins:maven-it-plugin-packaging:maven-plugin:2.1-SNAPSHOT generated by maven-surefire-plugin:test (default-test): core-it-support\core-it-plugins\maven-it-plugin-packaging\target\surefire-reports\*.xml
[withMaven] junitPublisher - Archive test results for Maven artifact org.apache.maven.its.plugins:maven-it-plugin-parameter-implementation:maven-plugin:2.1-SNAPSHOT generated by maven-surefire-plugin:test (default-test): core-it-support\core-it-plugins\maven-it-plugin-parameter-implementation\target\surefire-reports\*.xml
[withMaven] junitPublisher - Archive test results for Maven artifact org.apache.maven.its.plugins:maven-it-plugin-plugin-dependency:maven-plugin:2.1-SNAPSHOT generated by maven-surefire-plugin:test (default-test): core-it-support\core-it-plugins\maven-it-plugin-plugin-dependency\target\surefire-reports\*.xml
[withMaven] junitPublisher - Archive test results for Maven artifact org.apache.maven.its.plugins:maven-it-plugin-project:maven-plugin:2.1-SNAPSHOT generated by maven-surefire-plugin:test (default-test): core-it-support\core-it-plugins\maven-it-plugin-project\target\surefire-reports\*.xml
[withMaven] junitPublisher - Archive test results for Maven artifact org.apache.maven.its.plugins:maven-it-plugin-project-interpolation:maven-plugin:2.1-SNAPSHOT generated by maven-surefire-plugin:test (default-test): core-it-support\core-it-plugins\maven-it-plugin-project-interpolation\target\surefire-reports\*.xml
[withMaven] junitPublisher - Archive test results for Maven artifact org.apache.maven.its.plugins:maven-it-plugin-setter:maven-plugin:2.1-SNAPSHOT generated by maven-surefire-plugin:test (default-test): core-it-support\core-it-plugins\maven-it-plugin-setter\target\surefire-reports\*.xml
[withMaven] junitPublisher - Archive test results for Maven artifact org.apache.maven.its.plugins:maven-it-plugin-singleton-component:maven-plugin:2.1-SNAPSHOT generated by maven-surefire-plugin:test (default-test): core-it-support\core-it-plugins\maven-it-plugin-singleton-component\target\surefire-reports\*.xml
[withMaven] junitPublisher - Archive test results for Maven artifact org.apache.maven.its.plugins:maven-it-plugin-site:maven-plugin:2.1-SNAPSHOT generated by maven-surefire-plugin:test (default-test): core-it-support\core-it-plugins\maven-it-plugin-site\target\surefire-reports\*.xml
[withMaven] junitPublisher - Archive test results for Maven artifact org.apache.maven.its.plugins:maven-it-plugin-toolchain:maven-plugin:2.1-SNAPSHOT generated by maven-surefire-plugin:test (default-test): core-it-support\core-it-plugins\maven-it-plugin-toolchain\target\surefire-reports\*.xml
[withMaven] junitPublisher - Archive test results for Maven artifact org.apache.maven.its.plugins:maven-it-plugin-touch:maven-plugin:2.1-SNAPSHOT generated by maven-surefire-plugin:test (default-test): core-it-support\core-it-plugins\maven-it-plugin-touch\target\surefire-reports\*.xml
[withMaven] junitPublisher - Archive test results for Maven artifact org.apache.maven.its.plugins:maven-it-plugin-uses-properties:maven-plugin:2.1-SNAPSHOT generated by maven-surefire-plugin:test (default-test): core-it-support\core-it-plugins\maven-it-plugin-uses-properties\target\surefire-reports\*.xml
[withMaven] junitPublisher - Archive test results for Maven artifact org.apache.maven.its.plugins:maven-it-plugin-uses-wagon:maven-plugin:2.1-SNAPSHOT generated by maven-surefire-plugin:test (default-test): core-it-support\core-it-plugins\maven-it-plugin-uses-wagon\target\surefire-reports\*.xml
[withMaven] junitPublisher - Archive test results for Maven artifact org.apache.maven.its.plugins:maven-it-plugin-all:maven-plugin:2.1-SNAPSHOT generated by maven-surefire-plugin:test (default-test): core-it-support\core-it-plugins\maven-it-plugin-all\target\surefire-reports\*.xml
[withMaven] junitPublisher - Archive test results for Maven artifact org.apache.maven.its.plugins:maven-it-plugin-plexus-utils-11:maven-plugin:2.1-SNAPSHOT generated by maven-surefire-plugin:test (default-test): core-it-support\core-it-plugins\maven-it-plugin-plexus-utils-11\target\surefire-reports\*.xml
[withMaven] junitPublisher - Archive test results for Maven artifact org.apache.maven.its.plugins:maven-it-plugin-plexus-utils-new:maven-plugin:2.1-SNAPSHOT generated by maven-surefire-plugin:test (default-test): core-it-support\core-it-plugins\maven-it-plugin-plexus-utils-new\target\surefire-reports\*.xml
[withMaven] junitPublisher - Archive test results for Maven artifact org.apache.maven.its.plugins:maven-it-plugin-plexus-component-api:maven-plugin:2.1-SNAPSHOT generated by maven-surefire-plugin:test (default-test): core-it-support\core-it-plugins\maven-it-plugin-plexus-component-api\target\surefire-reports\*.xml
[withMaven] junitPublisher - Archive test results for Maven artifact org.apache.maven.its.plugins:maven-it-plugin-log4j:maven-plugin:2.1-SNAPSHOT generated by maven-surefire-plugin:test (default-test): core-it-support\core-it-plugins\maven-it-plugin-log4j\target\surefire-reports\*.xml
[withMaven] junitPublisher - Archive test results for Maven artifact org.apache.maven.its.plugins:maven-it-plugin-extension1:maven-plugin:2.1-SNAPSHOT generated by maven-surefire-plugin:test (default-test): core-it-support\core-it-plugins\maven-it-plugin-extension1\target\surefire-reports\*.xml
[withMaven] junitPublisher - Archive test results for Maven artifact org.apache.maven.its.plugins:maven-it-plugin-extension2:maven-plugin:2.1-SNAPSHOT generated by maven-surefire-plugin:test (default-test): core-it-support\core-it-plugins\maven-it-plugin-extension2\target\surefire-reports\*.xml
[withMaven] junitPublisher - Archive test results for Maven artifact org.apache.maven.its.plugins:maven-it-plugin-plexus-lifecycle:maven-plugin:2.1-SNAPSHOT generated by maven-surefire-plugin:test (default-test): core-it-support\core-it-plugins\maven-it-plugin-plexus-lifecycle\target\surefire-reports\*.xml
[withMaven] junitPublisher - Archive test results for Maven artifact org.apache.maven.its.plugins:maven-it-plugin-settings:maven-plugin:2.1-SNAPSHOT generated by maven-surefire-plugin:test (default-test): core-it-support\core-it-plugins\maven-it-plugin-settings\target\surefire-reports\*.xml
[withMaven] junitPublisher - Archive test results for Maven artifact org.apache.maven.its.plugins:mng-5805-pkg-type-mojo-configuration-extension:jar:2.1-SNAPSHOT generated by maven-surefire-plugin:test (default-test): core-it-support\core-it-plugins\mng5805-extension\target\surefire-reports\*.xml
[withMaven] junitPublisher - Archive test results for Maven artifact org.apache.maven.its.plugins:mng-5805-pkg-type-mojo-configuration-extension2:jar:2.1-SNAPSHOT generated by maven-surefire-plugin:test (default-test): core-it-support\core-it-plugins\mng5805-extension2\target\surefire-reports\*.xml
[withMaven] junitPublisher - Archive test results for Maven artifact org.apache.maven.its.plugins:mng-5805-pkg-type-mojo-configuration-plugin:maven-plugin:2.1-SNAPSHOT generated by maven-surefire-plugin:test (default-test): core-it-support\core-it-plugins\mng5805-plugin\target\surefire-reports\*.xml
[withMaven] junitPublisher - Archive test results for Maven artifact org.apache.maven.its.plugins:mng-5805-pkg-type-mojo-configuration-plugin-dep:jar:2.1-SNAPSHOT generated by maven-surefire-plugin:test (default-test): core-it-support\core-it-plugins\mng5805-plugin-dep\target\surefire-reports\*.xml
[withMaven] junitPublisher - Archive test results for Maven artifact org.apache.maven.its.plugins:mng-5958-pkg-type-extension:jar:2.1-SNAPSHOT generated by maven-surefire-plugin:test (default-test): core-it-support\core-it-plugins\mng5958-extension\target\surefire-reports\*.xml
[withMaven] junitPublisher - Archive test results for Maven artifact org.apache.maven.its:core-it-toolchain:jar:2.1-SNAPSHOT generated by maven-surefire-plugin:test (default-test): core-it-support\core-it-toolchain\target\surefire-reports\*.xml
[withMaven] junitPublisher - Archive test results for Maven artifact org.apache.maven.its:core-it-wagon:jar:2.1-SNAPSHOT generated by maven-surefire-plugin:test (default-test): core-it-support\core-it-wagon\target\surefire-reports\*.xml
[withMaven] junitPublisher - Archive test results for Maven artifact org.apache.maven.its:core-it-extension:jar:2.1-SNAPSHOT generated by maven-surefire-plugin:test (default-test): core-it-support\core-it-extension\target\surefire-reports\*.xml
[withMaven] junitPublisher - Archive test results for Maven artifact org.apache.maven.its:core-it-suite:jar:2.1-SNAPSHOT generated by maven-surefire-plugin:test (default-test): core-it-suite\target\surefire-reports\*.xml
Recording test results
[withMaven] openTasksPublisher - Scan Tasks for Maven artifact org.apache.maven.its.plugins.class-loader:dep-b:jar:2.1-SNAPSHOT in source directory core-it-support/core-it-plugins/maven-it-plugin-class-loader/dep-b/src/main/java
[withMaven] openTasksPublisher - Scan Tasks for Maven artifact org.apache.maven.its.plugins:maven-it-plugin-class-loader:maven-plugin:2.1-SNAPSHOT in source directory core-it-support/core-it-plugins/maven-it-plugin-class-loader/maven-it-plugin-class-loader/src/main/java
[withMaven] openTasksPublisher - Scan Tasks for Maven artifact org.apache.maven.its.plugins:maven-it-plugin-configuration:maven-plugin:2.1-SNAPSHOT in source directory core-it-support/core-it-plugins/maven-it-plugin-configuration/src/main/java
[withMaven] openTasksPublisher - Scan Tasks for Maven artifact org.apache.maven.its.plugins:maven-it-plugin-context-passing:maven-plugin:2.1-SNAPSHOT in source directory core-it-support/core-it-plugins/maven-it-plugin-context-passing/src/main/java
[withMaven] openTasksPublisher - Scan Tasks for Maven artifact org.apache.maven.plugins:maven-clean-plugin:maven-plugin:0.1-stub-SNAPSHOT in source directory core-it-support/core-it-plugins/maven-it-plugin-core-stubs/maven-clean-plugin/src/main/java
[withMaven] openTasksPublisher - Scan Tasks for Maven artifact org.apache.maven.plugins:maven-compiler-plugin:maven-plugin:0.1-stub-SNAPSHOT in source directory core-it-support/core-it-plugins/maven-it-plugin-core-stubs/maven-compiler-plugin/src/main/java
[withMaven] openTasksPublisher - Scan Tasks for Maven artifact org.apache.maven.plugins:maven-deploy-plugin:maven-plugin:0.1-stub-SNAPSHOT in source directory core-it-support/core-it-plugins/maven-it-plugin-core-stubs/maven-deploy-plugin/src/main/java
[withMaven] openTasksPublisher - Scan Tasks for Maven artifact org.apache.maven.plugins:maven-ear-plugin:maven-plugin:0.1-stub-SNAPSHOT in source directory core-it-support/core-it-plugins/maven-it-plugin-core-stubs/maven-ear-plugin/src/main/java
[withMaven] openTasksPublisher - Scan Tasks for Maven artifact org.apache.maven.plugins:maven-ejb-plugin:maven-plugin:0.1-stub-SNAPSHOT in source directory core-it-support/core-it-plugins/maven-it-plugin-core-stubs/maven-ejb-plugin/src/main/java
[withMaven] openTasksPublisher - Scan Tasks for Maven artifact org.apache.maven.plugins:maven-install-plugin:maven-plugin:0.1-stub-SNAPSHOT in source directory core-it-support/core-it-plugins/maven-it-plugin-core-stubs/maven-install-plugin/src/main/java
[withMaven] openTasksPublisher - Scan Tasks for Maven artifact org.apache.maven.plugins:maven-jar-plugin:maven-plugin:0.1-stub-SNAPSHOT in source directory core-it-support/core-it-plugins/maven-it-plugin-core-stubs/maven-jar-plugin/src/main/java
[withMaven] openTasksPublisher - Scan Tasks for Maven artifact org.apache.maven.plugins:maven-javadoc-plugin:maven-plugin:0.1-stub-SNAPSHOT in source directory core-it-support/core-it-plugins/maven-it-plugin-core-stubs/maven-javadoc-plugin/src/main/java
[withMaven] openTasksPublisher - Scan Tasks for Maven artifact org.apache.maven.plugins:maven-plugin-plugin:maven-plugin:0.1-stub-SNAPSHOT in source directory core-it-support/core-it-plugins/maven-it-plugin-core-stubs/maven-plugin-plugin/src/main/java
[withMaven] openTasksPublisher - Scan Tasks for Maven artifact org.apache.maven.plugins:maven-rar-plugin:maven-plugin:0.1-stub-SNAPSHOT in source directory core-it-support/core-it-plugins/maven-it-plugin-core-stubs/maven-rar-plugin/src/main/java
[withMaven] openTasksPublisher - Scan Tasks for Maven artifact org.apache.maven.plugins:maven-resources-plugin:maven-plugin:0.1-stub-SNAPSHOT in source directory core-it-support/core-it-plugins/maven-it-plugin-core-stubs/maven-resources-plugin/src/main/java
[withMaven] openTasksPublisher - Scan Tasks for Maven artifact org.apache.maven.plugins:maven-site-plugin:maven-plugin:0.1-stub-SNAPSHOT in source directory core-it-support/core-it-plugins/maven-it-plugin-core-stubs/maven-site-plugin/src/main/java
[withMaven] openTasksPublisher - Scan Tasks for Maven artifact org.apache.maven.plugins:maven-source-plugin:maven-plugin:0.1-stub-SNAPSHOT in source directory core-it-support/core-it-plugins/maven-it-plugin-core-stubs/maven-source-plugin/src/main/java
[withMaven] openTasksPublisher - Scan Tasks for Maven artifact org.apache.maven.plugins:maven-surefire-plugin:maven-plugin:0.1-stub-SNAPSHOT in source directory core-it-support/core-it-plugins/maven-it-plugin-core-stubs/maven-surefire-plugin/src/main/java
[withMaven] openTasksPublisher - Scan Tasks for Maven artifact org.apache.maven.plugins:maven-war-plugin:maven-plugin:0.1-stub-SNAPSHOT in source directory core-it-support/core-it-plugins/maven-it-plugin-core-stubs/maven-war-plugin/src/main/java
[withMaven] openTasksPublisher - Scan Tasks for Maven artifact org.apache.maven.its.plugins:maven-it-plugin-dependency-collection:maven-plugin:2.1-SNAPSHOT in source directory core-it-support/core-it-plugins/maven-it-plugin-dependency-collection/src/main/java
[withMaven] openTasksPublisher - Scan Tasks for Maven artifact org.apache.maven.its.plugins:maven-it-plugin-dependency-resolution:maven-plugin:2.1-SNAPSHOT in source directory core-it-support/core-it-plugins/maven-it-plugin-dependency-resolution/src/main/java
[withMaven] openTasksPublisher - Scan Tasks for Maven artifact org.apache.maven.its.plugins:maven-it-plugin-expression:maven-plugin:2.1-SNAPSHOT in source directory core-it-support/core-it-plugins/maven-it-plugin-expression/src/main/java
[withMaven] openTasksPublisher - Scan Tasks for Maven artifact org.apache.maven.its.plugins:maven-it-plugin-error:maven-plugin:2.1-SNAPSHOT in source directory core-it-support/core-it-plugins/maven-it-plugin-error/src/main/java
[withMaven] openTasksPublisher - Scan Tasks for Maven artifact org.apache.maven.its:core-it-component:jar:2.1-SNAPSHOT in source directory core-it-support/core-it-component/src/main/java
[withMaven] openTasksPublisher - Scan Tasks for Maven artifact org.apache.maven.its.plugins:maven-it-plugin-extension-consumer:maven-plugin:2.1-SNAPSHOT in source directory core-it-support/core-it-plugins/maven-it-plugin-extension-consumer/src/main/java
[withMaven] openTasksPublisher - Scan Tasks for Maven artifact org.apache.maven.its.plugins:maven-it-plugin-extension-provider:maven-plugin:2.1-SNAPSHOT in source directory core-it-support/core-it-plugins/maven-it-plugin-extension-provider/src/main/java
[withMaven] openTasksPublisher - Scan Tasks for Maven artifact org.apache.maven.its.plugins:maven-it-plugin-fork:maven-plugin:2.1-SNAPSHOT in source directory core-it-support/core-it-plugins/maven-it-plugin-fork/src/main/java
[withMaven] openTasksPublisher - Scan Tasks for Maven artifact org.apache.maven.its.plugins:maven-it-plugin-invalid-descriptor:maven-plugin:2.1-SNAPSHOT in source directory core-it-support/core-it-plugins/maven-it-plugin-invalid-descriptor/src/main/java
[withMaven] openTasksPublisher - Scan Tasks for Maven artifact org.apache.maven.its.plugins:maven-it-plugin-log-file:maven-plugin:2.1-SNAPSHOT in source directory core-it-support/core-it-plugins/maven-it-plugin-log-file/src/main/java
[withMaven] openTasksPublisher - Scan Tasks for Maven artifact org.apache.maven.its:maven-it-helper:jar:2.1-SNAPSHOT in source directory core-it-support/maven-it-helper/src/main/java
[withMaven] openTasksPublisher - Scan Tasks for Maven artifact org.apache.maven.its.plugins:maven-it-plugin-model-interpolation:maven-plugin:2.1-SNAPSHOT in source directory core-it-support/core-it-plugins/maven-it-plugin-model-interpolation/src/main/java
[withMaven] openTasksPublisher - Scan Tasks for Maven artifact org.apache.maven.its.plugins:maven-it-plugin-no-default-comp:maven-plugin:2.1-SNAPSHOT in source directory core-it-support/core-it-plugins/maven-it-plugin-no-default-comp/src/main/java
[withMaven] openTasksPublisher - Scan Tasks for Maven artifact org.apache.maven.its.plugins:maven-it-plugin-no-project:maven-plugin:2.1-SNAPSHOT in source directory core-it-support/core-it-plugins/maven-it-plugin-no-project/src/main/java
[withMaven] openTasksPublisher - Scan Tasks for Maven artifact org.apache.maven.its.plugins:maven-it-plugin-online:maven-plugin:2.1-SNAPSHOT in source directory core-it-support/core-it-plugins/maven-it-plugin-online/src/main/java
[withMaven] openTasksPublisher - Scan Tasks for Maven artifact org.apache.maven.its.plugins:maven-it-plugin-optional-mojos:maven-plugin:2.1-SNAPSHOT in source directory core-it-support/core-it-plugins/maven-it-plugin-optional-mojos/src/main/java
[withMaven] openTasksPublisher - Scan Tasks for Maven artifact org.apache.maven.its.plugins:maven-it-plugin-packaging:maven-plugin:2.1-SNAPSHOT in source directory core-it-support/core-it-plugins/maven-it-plugin-packaging/src/main/java
[withMaven] openTasksPublisher - Scan Tasks for Maven artifact org.apache.maven.its.plugins:maven-it-plugin-parameter-implementation:maven-plugin:2.1-SNAPSHOT in source directory core-it-support/core-it-plugins/maven-it-plugin-parameter-implementation/src/main/java
[withMaven] openTasksPublisher - Scan Tasks for Maven artifact org.apache.maven.its.plugins:maven-it-plugin-plugin-dependency:maven-plugin:2.1-SNAPSHOT in source directory core-it-support/core-it-plugins/maven-it-plugin-plugin-dependency/src/main/java
[withMaven] openTasksPublisher - Scan Tasks for Maven artifact org.apache.maven.its.plugins:maven-it-plugin-project:maven-plugin:2.1-SNAPSHOT in source directory core-it-support/core-it-plugins/maven-it-plugin-project/src/main/java
[withMaven] openTasksPublisher - Scan Tasks for Maven artifact org.apache.maven.its.plugins:maven-it-plugin-project-interpolation:maven-plugin:2.1-SNAPSHOT in source directory core-it-support/core-it-plugins/maven-it-plugin-project-interpolation/src/main/java
[withMaven] openTasksPublisher - Scan Tasks for Maven artifact org.apache.maven.its.plugins:maven-it-plugin-setter:maven-plugin:2.1-SNAPSHOT in source directory core-it-support/core-it-plugins/maven-it-plugin-setter/src/main/java
[withMaven] openTasksPublisher - Scan Tasks for Maven artifact org.apache.maven.its.plugins:maven-it-plugin-singleton-component:maven-plugin:2.1-SNAPSHOT in source directory core-it-support/core-it-plugins/maven-it-plugin-singleton-component/src/main/java
[withMaven] openTasksPublisher - Scan Tasks for Maven artifact org.apache.maven.its.plugins:maven-it-plugin-site:maven-plugin:2.1-SNAPSHOT in source directory core-it-support/core-it-plugins/maven-it-plugin-site/src/main/java
[withMaven] openTasksPublisher - Scan Tasks for Maven artifact org.apache.maven.its.plugins:maven-it-plugin-toolchain:maven-plugin:2.1-SNAPSHOT in source directory core-it-support/core-it-plugins/maven-it-plugin-toolchain/src/main/java
[withMaven] openTasksPublisher - Scan Tasks for Maven artifact org.apache.maven.its.plugins:maven-it-plugin-touch:maven-plugin:2.1-SNAPSHOT in source directory core-it-support/core-it-plugins/maven-it-plugin-touch/src/main/java
[withMaven] openTasksPublisher - Scan Tasks for Maven artifact org.apache.maven.its.plugins:maven-it-plugin-uses-properties:maven-plugin:2.1-SNAPSHOT in source directory core-it-support/core-it-plugins/maven-it-plugin-uses-properties/src/main/java
[withMaven] openTasksPublisher - Scan Tasks for Maven artifact org.apache.maven.its.plugins:maven-it-plugin-uses-wagon:maven-plugin:2.1-SNAPSHOT in source directory core-it-support/core-it-plugins/maven-it-plugin-uses-wagon/src/main/java
[withMaven] openTasksPublisher - Scan Tasks for Maven artifact org.apache.maven.its.plugins:maven-it-plugin-all:maven-plugin:2.1-SNAPSHOT in source directory core-it-support/core-it-plugins/maven-it-plugin-all/src/main/java
[withMaven] openTasksPublisher - Scan Tasks for Maven artifact org.apache.maven.its.plugins:maven-it-plugin-plexus-utils-11:maven-plugin:2.1-SNAPSHOT in source directory core-it-support/core-it-plugins/maven-it-plugin-plexus-utils-11/src/main/java
[withMaven] openTasksPublisher - Scan Tasks for Maven artifact org.apache.maven.its.plugins:maven-it-plugin-plexus-utils-new:maven-plugin:2.1-SNAPSHOT in source directory core-it-support/core-it-plugins/maven-it-plugin-plexus-utils-new/src/main/java
[withMaven] openTasksPublisher - Scan Tasks for Maven artifact org.apache.maven.its.plugins:maven-it-plugin-plexus-component-api:maven-plugin:2.1-SNAPSHOT in source directory core-it-support/core-it-plugins/maven-it-plugin-plexus-component-api/src/main/java
[withMaven] openTasksPublisher - Scan Tasks for Maven artifact org.apache.maven.its.plugins:maven-it-plugin-log4j:maven-plugin:2.1-SNAPSHOT in source directory core-it-support/core-it-plugins/maven-it-plugin-log4j/src/main/java
[withMaven] openTasksPublisher - Scan Tasks for Maven artifact org.apache.maven.its.plugins:maven-it-plugin-extension1:maven-plugin:2.1-SNAPSHOT in source directory core-it-support/core-it-plugins/maven-it-plugin-extension1/src/main/java
[withMaven] openTasksPublisher - Scan Tasks for Maven artifact org.apache.maven.its.plugins:maven-it-plugin-extension2:maven-plugin:2.1-SNAPSHOT in source directory core-it-support/core-it-plugins/maven-it-plugin-extension2/src/main/java
[withMaven] openTasksPublisher - Scan Tasks for Maven artifact org.apache.maven.its.plugins:maven-it-plugin-plexus-lifecycle:maven-plugin:2.1-SNAPSHOT in source directory core-it-support/core-it-plugins/maven-it-plugin-plexus-lifecycle/src/main/java
[withMaven] openTasksPublisher - Scan Tasks for Maven artifact org.apache.maven.its.plugins:maven-it-plugin-settings:maven-plugin:2.1-SNAPSHOT in source directory core-it-support/core-it-plugins/maven-it-plugin-settings/src/main/java
[withMaven] openTasksPublisher - Scan Tasks for Maven artifact org.apache.maven.its.plugins:mng-5805-pkg-type-mojo-configuration-plugin:maven-plugin:2.1-SNAPSHOT in source directory core-it-support/core-it-plugins/mng5805-plugin/src/main/java
[withMaven] openTasksPublisher - Scan Tasks for Maven artifact org.apache.maven.its.plugins:mng-5805-pkg-type-mojo-configuration-plugin-dep:jar:2.1-SNAPSHOT in source directory core-it-support/core-it-plugins/mng5805-plugin-dep/src/main/java
[withMaven] openTasksPublisher - Scan Tasks for Maven artifact org.apache.maven.its.plugins:mng-5958-pkg-type-extension:jar:2.1-SNAPSHOT in source directory core-it-support/core-it-plugins/mng5958-extension/src/main/java
[withMaven] openTasksPublisher - Scan Tasks for Maven artifact org.apache.maven.its:core-it-toolchain:jar:2.1-SNAPSHOT in source directory core-it-support/core-it-toolchain/src/main/java
[withMaven] openTasksPublisher - Scan Tasks for Maven artifact org.apache.maven.its:core-it-wagon:jar:2.1-SNAPSHOT in source directory core-it-support/core-it-wagon/src/main/java
[withMaven] openTasksPublisher - Scan Tasks for Maven artifact org.apache.maven.its.plugins:maven-it-plugin-active-collection:maven-plugin:2.1-SNAPSHOT in source directory core-it-support\core-it-plugins\maven-it-plugin-active-collection\src\main\java
[withMaven] openTasksPublisher - Scan Tasks for Maven artifact org.apache.maven.its.plugins:maven-it-plugin-artifact:maven-plugin:2.1-SNAPSHOT in source directory core-it-support\core-it-plugins\maven-it-plugin-artifact\src\main\java
[withMaven] openTasksPublisher - Scan Tasks for Maven artifact org.apache.maven.its.plugins.class-loader:dep-a:jar:2.1-SNAPSHOT in source directory core-it-support\core-it-plugins\maven-it-plugin-class-loader\dep-a\src\main\java
[withMaven] openTasksPublisher - Scan Tasks for Maven artifact org.apache.maven.its.plugins.class-loader:dep-b:jar:2.1-SNAPSHOT in source directory core-it-support\core-it-plugins\maven-it-plugin-class-loader\dep-b\src\main\java
[withMaven] openTasksPublisher - Scan Tasks for Maven artifact org.apache.maven.its.plugins:maven-it-plugin-class-loader:maven-plugin:2.1-SNAPSHOT in source directory core-it-support\core-it-plugins\maven-it-plugin-class-loader\maven-it-plugin-class-loader\src\main\java
[withMaven] openTasksPublisher - Scan Tasks for Maven artifact org.apache.maven.its.plugins:maven-it-plugin-configuration:maven-plugin:2.1-SNAPSHOT in source directory core-it-support\core-it-plugins\maven-it-plugin-configuration\src\main\java
[withMaven] openTasksPublisher - Scan Tasks for Maven artifact org.apache.maven.its.plugins:maven-it-plugin-context-passing:maven-plugin:2.1-SNAPSHOT in source directory core-it-support\core-it-plugins\maven-it-plugin-context-passing\src\main\java
[withMaven] openTasksPublisher - Scan Tasks for Maven artifact org.apache.maven.plugins:maven-clean-plugin:maven-plugin:0.1-stub-SNAPSHOT in source directory core-it-support\core-it-plugins\maven-it-plugin-core-stubs\maven-clean-plugin\src\main\java
[withMaven] openTasksPublisher - Scan Tasks for Maven artifact org.apache.maven.plugins:maven-compiler-plugin:maven-plugin:0.1-stub-SNAPSHOT in source directory core-it-support\core-it-plugins\maven-it-plugin-core-stubs\maven-compiler-plugin\src\main\java
[withMaven] openTasksPublisher - Scan Tasks for Maven artifact org.apache.maven.plugins:maven-deploy-plugin:maven-plugin:0.1-stub-SNAPSHOT in source directory core-it-support\core-it-plugins\maven-it-plugin-core-stubs\maven-deploy-plugin\src\main\java
[withMaven] openTasksPublisher - Scan Tasks for Maven artifact org.apache.maven.plugins:maven-ear-plugin:maven-plugin:0.1-stub-SNAPSHOT in source directory core-it-support\core-it-plugins\maven-it-plugin-core-stubs\maven-ear-plugin\src\main\java
[withMaven] openTasksPublisher - Scan Tasks for Maven artifact org.apache.maven.plugins:maven-ejb-plugin:maven-plugin:0.1-stub-SNAPSHOT in source directory core-it-support\core-it-plugins\maven-it-plugin-core-stubs\maven-ejb-plugin\src\main\java
[withMaven] openTasksPublisher - Scan Tasks for Maven artifact org.apache.maven.plugins:maven-install-plugin:maven-plugin:0.1-stub-SNAPSHOT in source directory core-it-support\core-it-plugins\maven-it-plugin-core-stubs\maven-install-plugin\src\main\java
[withMaven] openTasksPublisher - Scan Tasks for Maven artifact org.apache.maven.plugins:maven-jar-plugin:maven-plugin:0.1-stub-SNAPSHOT in source directory core-it-support\core-it-plugins\maven-it-plugin-core-stubs\maven-jar-plugin\src\main\java
[withMaven] openTasksPublisher - Scan Tasks for Maven artifact org.apache.maven.plugins:maven-javadoc-plugin:maven-plugin:0.1-stub-SNAPSHOT in source directory core-it-support\core-it-plugins\maven-it-plugin-core-stubs\maven-javadoc-plugin\src\main\java
[withMaven] openTasksPublisher - Scan Tasks for Maven artifact org.apache.maven.plugins:maven-plugin-plugin:maven-plugin:0.1-stub-SNAPSHOT in source directory core-it-support\core-it-plugins\maven-it-plugin-core-stubs\maven-plugin-plugin\src\main\java
[withMaven] openTasksPublisher - Scan Tasks for Maven artifact org.apache.maven.plugins:maven-rar-plugin:maven-plugin:0.1-stub-SNAPSHOT in source directory core-it-support\core-it-plugins\maven-it-plugin-core-stubs\maven-rar-plugin\src\main\java
[withMaven] openTasksPublisher - Scan Tasks for Maven artifact org.apache.maven.plugins:maven-resources-plugin:maven-plugin:0.1-stub-SNAPSHOT in source directory core-it-support\core-it-plugins\maven-it-plugin-core-stubs\maven-resources-plugin\src\main\java
[withMaven] openTasksPublisher - Scan Tasks for Maven artifact org.apache.maven.plugins:maven-site-plugin:maven-plugin:0.1-stub-SNAPSHOT in source directory core-it-support\core-it-plugins\maven-it-plugin-core-stubs\maven-site-plugin\src\main\java
[withMaven] openTasksPublisher - Scan Tasks for Maven artifact org.apache.maven.plugins:maven-source-plugin:maven-plugin:0.1-stub-SNAPSHOT in source directory core-it-support\core-it-plugins\maven-it-plugin-core-stubs\maven-source-plugin\src\main\java
[withMaven] openTasksPublisher - Scan Tasks for Maven artifact org.apache.maven.plugins:maven-surefire-plugin:maven-plugin:0.1-stub-SNAPSHOT in source directory core-it-support\core-it-plugins\maven-it-plugin-core-stubs\maven-surefire-plugin\src\main\java
[withMaven] openTasksPublisher - Scan Tasks for Maven artifact org.apache.maven.plugins:maven-war-plugin:maven-plugin:0.1-stub-SNAPSHOT in source directory core-it-support\core-it-plugins\maven-it-plugin-core-stubs\maven-war-plugin\src\main\java
[withMaven] openTasksPublisher - Scan Tasks for Maven artifact org.apache.maven.its.plugins:maven-it-plugin-dependency-collection:maven-plugin:2.1-SNAPSHOT in source directory core-it-support\core-it-plugins\maven-it-plugin-dependency-collection\src\main\java
[withMaven] openTasksPublisher - Scan Tasks for Maven artifact org.apache.maven.its.plugins:maven-it-plugin-dependency-resolution:maven-plugin:2.1-SNAPSHOT in source directory core-it-support\core-it-plugins\maven-it-plugin-dependency-resolution\src\main\java
[withMaven] openTasksPublisher - Scan Tasks for Maven artifact org.apache.maven.its.plugins:maven-it-plugin-expression:maven-plugin:2.1-SNAPSHOT in source directory core-it-support\core-it-plugins\maven-it-plugin-expression\src\main\java
[withMaven] openTasksPublisher - Scan Tasks for Maven artifact org.apache.maven.its.plugins:maven-it-plugin-error:maven-plugin:2.1-SNAPSHOT in source directory core-it-support\core-it-plugins\maven-it-plugin-error\src\main\java
[withMaven] openTasksPublisher - Scan Tasks for Maven artifact org.apache.maven.its:core-it-component:jar:2.1-SNAPSHOT in source directory core-it-support\core-it-component\src\main\java
[withMaven] openTasksPublisher - Scan Tasks for Maven artifact org.apache.maven.its.plugins:maven-it-plugin-extension-consumer:maven-plugin:2.1-SNAPSHOT in source directory core-it-support\core-it-plugins\maven-it-plugin-extension-consumer\src\main\java
[withMaven] openTasksPublisher - Scan Tasks for Maven artifact org.apache.maven.its.plugins:maven-it-plugin-extension-provider:maven-plugin:2.1-SNAPSHOT in source directory core-it-support\core-it-plugins\maven-it-plugin-extension-provider\src\main\java
[withMaven] openTasksPublisher - Scan Tasks for Maven artifact org.apache.maven.its.plugins:maven-it-plugin-fork:maven-plugin:2.1-SNAPSHOT in source directory core-it-support\core-it-plugins\maven-it-plugin-fork\src\main\java
[withMaven] openTasksPublisher - Scan Tasks for Maven artifact org.apache.maven.its.plugins:maven-it-plugin-invalid-descriptor:maven-plugin:2.1-SNAPSHOT in source directory core-it-support\core-it-plugins\maven-it-plugin-invalid-descriptor\src\main\java
[withMaven] openTasksPublisher - Scan Tasks for Maven artifact org.apache.maven.its.plugins:maven-it-plugin-log-file:maven-plugin:2.1-SNAPSHOT in source directory core-it-support\core-it-plugins\maven-it-plugin-log-file\src\main\java
[withMaven] openTasksPublisher - Scan Tasks for Maven artifact org.apache.maven.its:maven-it-helper:jar:2.1-SNAPSHOT in source directory core-it-support\maven-it-helper\src\main\java
[withMaven] openTasksPublisher - Scan Tasks for Maven artifact org.apache.maven.its.plugins:maven-it-plugin-model-interpolation:maven-plugin:2.1-SNAPSHOT in source directory core-it-support\core-it-plugins\maven-it-plugin-model-interpolation\src\main\java
[withMaven] openTasksPublisher - Scan Tasks for Maven artifact org.apache.maven.its.plugins:maven-it-plugin-no-default-comp:maven-plugin:2.1-SNAPSHOT in source directory core-it-support\core-it-plugins\maven-it-plugin-no-default-comp\src\main\java
[withMaven] openTasksPublisher - Scan Tasks for Maven artifact org.apache.maven.its.plugins:maven-it-plugin-no-project:maven-plugin:2.1-SNAPSHOT in source directory core-it-support\core-it-plugins\maven-it-plugin-no-project\src\main\java
[withMaven] openTasksPublisher - Scan Tasks for Maven artifact org.apache.maven.its.plugins:maven-it-plugin-online:maven-plugin:2.1-SNAPSHOT in source directory core-it-support\core-it-plugins\maven-it-plugin-online\src\main\java
[withMaven] openTasksPublisher - Scan Tasks for Maven artifact org.apache.maven.its.plugins:maven-it-plugin-optional-mojos:maven-plugin:2.1-SNAPSHOT in source directory core-it-support\core-it-plugins\maven-it-plugin-optional-mojos\src\main\java
[withMaven] openTasksPublisher - Scan Tasks for Maven artifact org.apache.maven.its.plugins:maven-it-plugin-packaging:maven-plugin:2.1-SNAPSHOT in source directory core-it-support\core-it-plugins\maven-it-plugin-packaging\src\main\java
[withMaven] openTasksPublisher - Scan Tasks for Maven artifact org.apache.maven.its.plugins:maven-it-plugin-parameter-implementation:maven-plugin:2.1-SNAPSHOT in source directory core-it-support\core-it-plugins\maven-it-plugin-parameter-implementation\src\main\java
[withMaven] openTasksPublisher - Scan Tasks for Maven artifact org.apache.maven.its.plugins:maven-it-plugin-plugin-dependency:maven-plugin:2.1-SNAPSHOT in source directory core-it-support\core-it-plugins\maven-it-plugin-plugin-dependency\src\main\java
[withMaven] openTasksPublisher - Scan Tasks for Maven artifact org.apache.maven.its.plugins:maven-it-plugin-project:maven-plugin:2.1-SNAPSHOT in source directory core-it-support\core-it-plugins\maven-it-plugin-project\src\main\java
[withMaven] openTasksPublisher - Scan Tasks for Maven artifact org.apache.maven.its.plugins:maven-it-plugin-project-interpolation:maven-plugin:2.1-SNAPSHOT in source directory core-it-support\core-it-plugins\maven-it-plugin-project-interpolation\src\main\java
[withMaven] openTasksPublisher - Scan Tasks for Maven artifact org.apache.maven.its.plugins:maven-it-plugin-setter:maven-plugin:2.1-SNAPSHOT in source directory core-it-support\core-it-plugins\maven-it-plugin-setter\src\main\java
[withMaven] openTasksPublisher - Scan Tasks for Maven artifact org.apache.maven.its.plugins:maven-it-plugin-singleton-component:maven-plugin:2.1-SNAPSHOT in source directory core-it-support\core-it-plugins\maven-it-plugin-singleton-component\src\main\java
[withMaven] openTasksPublisher - Scan Tasks for Maven artifact org.apache.maven.its.plugins:maven-it-plugin-site:maven-plugin:2.1-SNAPSHOT in source directory core-it-support\core-it-plugins\maven-it-plugin-site\src\main\java
[withMaven] openTasksPublisher - Scan Tasks for Maven artifact org.apache.maven.its.plugins:maven-it-plugin-toolchain:maven-plugin:2.1-SNAPSHOT in source directory core-it-support\core-it-plugins\maven-it-plugin-toolchain\src\main\java
[withMaven] openTasksPublisher - Scan Tasks for Maven artifact org.apache.maven.its.plugins:maven-it-plugin-touch:maven-plugin:2.1-SNAPSHOT in source directory core-it-support\core-it-plugins\maven-it-plugin-touch\src\main\java
[withMaven] openTasksPublisher - Scan Tasks for Maven artifact org.apache.maven.its.plugins:maven-it-plugin-uses-properties:maven-plugin:2.1-SNAPSHOT in source directory core-it-support\core-it-plugins\maven-it-plugin-uses-properties\src\main\java
[withMaven] openTasksPublisher - Scan Tasks for Maven artifact org.apache.maven.its.plugins:maven-it-plugin-uses-wagon:maven-plugin:2.1-SNAPSHOT in source directory core-it-support\core-it-plugins\maven-it-plugin-uses-wagon\src\main\java
[withMaven] openTasksPublisher - Scan Tasks for Maven artifact org.apache.maven.its.plugins:maven-it-plugin-all:maven-plugin:2.1-SNAPSHOT in source directory core-it-support\core-it-plugins\maven-it-plugin-all\src\main\java
[withMaven] openTasksPublisher - Scan Tasks for Maven artifact org.apache.maven.its.plugins:maven-it-plugin-plexus-utils-11:maven-plugin:2.1-SNAPSHOT in source directory core-it-support\core-it-plugins\maven-it-plugin-plexus-utils-11\src\main\java
[withMaven] openTasksPublisher - Scan Tasks for Maven artifact org.apache.maven.its.plugins:maven-it-plugin-plexus-utils-new:maven-plugin:2.1-SNAPSHOT in source directory core-it-support\core-it-plugins\maven-it-plugin-plexus-utils-new\src\main\java
[withMaven] openTasksPublisher - Scan Tasks for Maven artifact org.apache.maven.its.plugins:maven-it-plugin-plexus-component-api:maven-plugin:2.1-SNAPSHOT in source directory core-it-support\core-it-plugins\maven-it-plugin-plexus-component-api\src\main\java
[withMaven] openTasksPublisher - Scan Tasks for Maven artifact org.apache.maven.its.plugins:maven-it-plugin-log4j:maven-plugin:2.1-SNAPSHOT in source directory core-it-support\core-it-plugins\maven-it-plugin-log4j\src\main\java
[withMaven] openTasksPublisher - Scan Tasks for Maven artifact org.apache.maven.its.plugins:maven-it-plugin-extension1:maven-plugin:2.1-SNAPSHOT in source directory core-it-support\core-it-plugins\maven-it-plugin-extension1\src\main\java
[withMaven] openTasksPublisher - Scan Tasks for Maven artifact org.apache.maven.its.plugins:maven-it-plugin-extension2:maven-plugin:2.1-SNAPSHOT in source directory core-it-support\core-it-plugins\maven-it-plugin-extension2\src\main\java
[withMaven] openTasksPublisher - Scan Tasks for Maven artifact org.apache.maven.its.plugins:maven-it-plugin-plexus-lifecycle:maven-plugin:2.1-SNAPSHOT in source directory core-it-support\core-it-plugins\maven-it-plugin-plexus-lifecycle\src\main\java
[TASKS] Scanning folder '/home/jenkins/jenkins-slave/workspace/maven-box_maven_master/test' for files matching the pattern 'core-it-support/core-it-plugins/maven-it-plugin-active-collection/src/main/java/**/*,core-it-support/core-it-plugins/maven-it-plugin-artifact/src/main/java/**/*,core-it-support/core-it-plugins/maven-it-plugin-class-loader/dep-a/src/main/java/**/*,core-it-support/core-it-plugins/maven-it-plugin-class-loader/dep-b/src/main/java/**/*,core-it-support/core-it-plugins/maven-it-plugin-class-loader/maven-it-plugin-class-loader/src/main/java/**/*,core-it-support/core-it-plugins/maven-it-plugin-configuration/src/main/java/**/*,core-it-support/core-it-plugins/maven-it-plugin-context-passing/src/main/java/**/*,core-it-support/core-it-plugins/maven-it-plugin-core-stubs/maven-clean-plugin/src/main/java/**/*,core-it-support/core-it-plugins/maven-it-plugin-core-stubs/maven-compiler-plugin/src/main/java/**/*,core-it-support/core-it-plugins/maven-it-plugin-core-stubs/maven-deploy-plugin/src/main/java/**/*,core-it-support/core-it-plugins/maven-it-plugin-core-stubs/maven-ear-plugin/src/main/java/**/*,core-it-support/core-it-plugins/maven-it-plugin-core-stubs/maven-ejb-plugin/src/main/java/**/*,core-it-support/core-it-plugins/maven-it-plugin-core-stubs/maven-install-plugin/src/main/java/**/*,core-it-support/core-it-plugins/maven-it-plugin-core-stubs/maven-jar-plugin/src/main/java/**/*,core-it-support/core-it-plugins/maven-it-plugin-core-stubs/maven-javadoc-plugin/src/main/java/**/*,core-it-support/core-it-plugins/maven-it-plugin-core-stubs/maven-plugin-plugin/src/main/java/**/*,core-it-support/core-it-plugins/maven-it-plugin-core-stubs/maven-rar-plugin/src/main/java/**/*,core-it-support/core-it-plugins/maven-it-plugin-core-stubs/maven-resources-plugin/src/main/java/**/*,core-it-support/core-it-plugins/maven-it-plugin-core-stubs/maven-site-plugin/src/main/java/**/*,core-it-support/core-it-plugins/maven-it-plugin-core-stubs/maven-source-plugin/src/main/java/**/*,core-it-support/core-it-plugins/maven-it-plugin-core-stubs/maven-surefire-plugin/src/main/java/**/*,core-it-support/core-it-plugins/maven-it-plugin-core-stubs/maven-war-plugin/src/main/java/**/*,core-it-support/core-it-plugins/maven-it-plugin-dependency-collection/src/main/java/**/*,core-it-support/core-it-plugins/maven-it-plugin-dependency-resolution/src/main/java/**/*,core-it-support/core-it-plugins/maven-it-plugin-expression/src/main/java/**/*,core-it-support/core-it-plugins/maven-it-plugin-error/src/main/java/**/*,core-it-support/core-it-component/src/main/java/**/*,core-it-support/core-it-plugins/maven-it-plugin-extension-consumer/src/main/java/**/*,core-it-support/core-it-plugins/maven-it-plugin-extension-provider/src/main/java/**/*,core-it-support/core-it-plugins/maven-it-plugin-fork/src/main/java/**/*,core-it-support/core-it-plugins/maven-it-plugin-invalid-descriptor/src/main/java/**/*,core-it-support/core-it-plugins/maven-it-plugin-log-file/src/main/java/**/*,core-it-support/maven-it-helper/src/main/java/**/*,core-it-support/core-it-plugins/maven-it-plugin-model-interpolation/src/main/java/**/*,core-it-support/core-it-plugins/maven-it-plugin-no-default-comp/src/main/java/**/*,core-it-support/core-it-plugins/maven-it-plugin-no-project/src/main/java/**/*,core-it-support/core-it-plugins/maven-it-plugin-online/src/main/java/**/*,core-it-support/core-it-plugins/maven-it-plugin-optional-mojos/src/main/java/**/*,core-it-support/core-it-plugins/maven-it-plugin-packaging/src/main/java/**/*,core-it-support/core-it-plugins/maven-it-plugin-parameter-implementation/src/main/java/**/*,core-it-support/core-it-plugins/maven-it-plugin-plugin-dependency/src/main/java/**/*,core-it-support/core-it-plugins/maven-it-plugin-project/src/main/java/**/*,core-it-support/core-it-plugins/maven-it-plugin-project-interpolation/src/main/java/**/*,core-it-support/core-it-plugins/maven-it-plugin-setter/src/main/java/**/*,core-it-support/core-it-plugins/maven-it-plugin-singleton-component/src/main/java/**/*,core-it-support/core-it-plugins/maven-it-plugin-site/src/main/java/**/*,core-it-support/core-it-plugins/maven-it-plugin-toolchain/src/main/java/**/*,core-it-support/core-it-plugins/maven-it-plugin-touch/src/main/java/**/*,core-it-support/core-it-plugins/maven-it-plugin-uses-properties/src/main/java/**/*,core-it-support/core-it-plugins/maven-it-plugin-uses-wagon/src/main/java/**/*,core-it-support/core-it-plugins/maven-it-plugin-all/src/main/java/**/*,core-it-support/core-it-plugins/maven-it-plugin-plexus-utils-11/src/main/java/**/*,core-it-support/core-it-plugins/maven-it-plugin-plexus-utils-new/src/main/java/**/*,core-it-support/core-it-plugins/maven-it-plugin-plexus-component-api/src/main/java/**/*,core-it-support/core-it-plugins/maven-it-plugin-log4j/src/main/java/**/*,core-it-support/core-it-plugins/maven-it-plugin-extension1/src/main/java/**/*,core-it-support/core-it-plugins/maven-it-plugin-extension2/src/main/java/**/*,core-it-support/core-it-plugins/maven-it-plugin-plexus-lifecycle/src/main/java/**/*,core-it-support/core-it-plugins/maven-it-plugin-settings/src/main/java/**/*,core-it-support/core-it-plugins/mng5805-plugin/src/main/java/**/*,core-it-support/core-it-plugins/mng5805-plugin-dep/src/main/java/**/*,core-it-support/core-it-plugins/mng5958-extension/src/main/java/**/*,core-it-support/core-it-toolchain/src/main/java/**/*,core-it-support/core-it-wagon/src/main/java/**/*' - excludes: null
[TASKS] Found 164 files to scan for tasks
[TASKS] Found 0 open tasks.
Skipping warnings blame since pipelines do not have an SCM link.%n
[withMaven] openTasksPublisher - Scan Tasks for Maven artifact org.apache.maven.its.plugins:maven-it-plugin-settings:maven-plugin:2.1-SNAPSHOT in source directory core-it-support\core-it-plugins\maven-it-plugin-settings\src\main\java
[withMaven] openTasksPublisher - Scan Tasks for Maven artifact org.apache.maven.its.plugins:mng-5805-pkg-type-mojo-configuration-plugin:maven-plugin:2.1-SNAPSHOT in source directory core-it-support\core-it-plugins\mng5805-plugin\src\main\java
[withMaven] openTasksPublisher - Scan Tasks for Maven artifact org.apache.maven.its.plugins:mng-5805-pkg-type-mojo-configuration-plugin-dep:jar:2.1-SNAPSHOT in source directory core-it-support\core-it-plugins\mng5805-plugin-dep\src\main\java
[TASKS] Computing warning deltas based on reference build #261
[withMaven] Publishers: Pipeline Graph Publisher: 27 ms, Generated Artifacts Publisher: 64044 ms, Invoker Publisher: 9 ms, Junit Publisher: 283505 ms, Concordion Publisher: 7 ms, Dependencies Fingerprint Publisher: 2504 ms, Findbugs Publisher: 3 ms, JGiven Publisher: 3 ms, Jacoco Publisher: 3 ms, SpotBugs Publisher: 3 ms, Open Task Scanner Publisher: 12111 ms
[withMaven] openTasksPublisher - Scan Tasks for Maven artifact org.apache.maven.its.plugins:mng-5958-pkg-type-extension:jar:2.1-SNAPSHOT in source directory core-it-support\core-it-plugins\mng5958-extension\src\main\java
[withMaven] openTasksPublisher - Scan Tasks for Maven artifact org.apache.maven.its:core-it-toolchain:jar:2.1-SNAPSHOT in source directory core-it-support\core-it-toolchain\src\main\java
[withMaven] openTasksPublisher - Scan Tasks for Maven artifact org.apache.maven.its:core-it-wagon:jar:2.1-SNAPSHOT in source directory core-it-support\core-it-wagon\src\main\java
[TASKS] Scanning folder 'c:\mvn-it-1.tmp' for files matching the pattern 'core-it-support\core-it-plugins\maven-it-plugin-active-collection\src\main\java\**\*,core-it-support\core-it-plugins\maven-it-plugin-artifact\src\main\java\**\*,core-it-support\core-it-plugins\maven-it-plugin-class-loader\dep-a\src\main\java\**\*,core-it-support\core-it-plugins\maven-it-plugin-class-loader\dep-b\src\main\java\**\*,core-it-support\core-it-plugins\maven-it-plugin-class-loader\maven-it-plugin-class-loader\src\main\java\**\*,core-it-support\core-it-plugins\maven-it-plugin-configuration\src\main\java\**\*,core-it-support\core-it-plugins\maven-it-plugin-context-passing\src\main\java\**\*,core-it-support\core-it-plugins\maven-it-plugin-core-stubs\maven-clean-plugin\src\main\java\**\*,core-it-support\core-it-plugins\maven-it-plugin-core-stubs\maven-compiler-plugin\src\main\java\**\*,core-it-support\core-it-plugins\maven-it-plugin-core-stubs\maven-deploy-plugin\src\main\java\**\*,core-it-support\core-it-plugins\maven-it-plugin-core-stubs\maven-ear-plugin\src\main\java\**\*,core-it-support\core-it-plugins\maven-it-plugin-core-stubs\maven-ejb-plugin\src\main\java\**\*,core-it-support\core-it-plugins\maven-it-plugin-core-stubs\maven-install-plugin\src\main\java\**\*,core-it-support\core-it-plugins\maven-it-plugin-core-stubs\maven-jar-plugin\src\main\java\**\*,core-it-support\core-it-plugins\maven-it-plugin-core-stubs\maven-javadoc-plugin\src\main\java\**\*,core-it-support\core-it-plugins\maven-it-plugin-core-stubs\maven-plugin-plugin\src\main\java\**\*,core-it-support\core-it-plugins\maven-it-plugin-core-stubs\maven-rar-plugin\src\main\java\**\*,core-it-support\core-it-plugins\maven-it-plugin-core-stubs\maven-resources-plugin\src\main\java\**\*,core-it-support\core-it-plugins\maven-it-plugin-core-stubs\maven-site-plugin\src\main\java\**\*,core-it-support\core-it-plugins\maven-it-plugin-core-stubs\maven-source-plugin\src\main\java\**\*,core-it-support\core-it-plugins\maven-it-plugin-core-stubs\maven-surefire-plugin\src\main\java\**\*,core-it-support\core-it-plugins\maven-it-plugin-core-stubs\maven-war-plugin\src\main\java\**\*,core-it-support\core-it-plugins\maven-it-plugin-dependency-collection\src\main\java\**\*,core-it-support\core-it-plugins\maven-it-plugin-dependency-resolution\src\main\java\**\*,core-it-support\core-it-plugins\maven-it-plugin-expression\src\main\java\**\*,core-it-support\core-it-plugins\maven-it-plugin-error\src\main\java\**\*,core-it-support\core-it-component\src\main\java\**\*,core-it-support\core-it-plugins\maven-it-plugin-extension-consumer\src\main\java\**\*,core-it-support\core-it-plugins\maven-it-plugin-extension-provider\src\main\java\**\*,core-it-support\core-it-plugins\maven-it-plugin-fork\src\main\java\**\*,core-it-support\core-it-plugins\maven-it-plugin-invalid-descriptor\src\main\java\**\*,core-it-support\core-it-plugins\maven-it-plugin-log-file\src\main\java\**\*,core-it-support\maven-it-helper\src\main\java\**\*,core-it-support\core-it-plugins\maven-it-plugin-model-interpolation\src\main\java\**\*,core-it-support\core-it-plugins\maven-it-plugin-no-default-comp\src\main\java\**\*,core-it-support\core-it-plugins\maven-it-plugin-no-project\src\main\java\**\*,core-it-support\core-it-plugins\maven-it-plugin-online\src\main\java\**\*,core-it-support\core-it-plugins\maven-it-plugin-optional-mojos\src\main\java\**\*,core-it-support\core-it-plugins\maven-it-plugin-packaging\src\main\java\**\*,core-it-support\core-it-plugins\maven-it-plugin-parameter-implementation\src\main\java\**\*,core-it-support\core-it-plugins\maven-it-plugin-plugin-dependency\src\main\java\**\*,core-it-support\core-it-plugins\maven-it-plugin-project\src\main\java\**\*,core-it-support\core-it-plugins\maven-it-plugin-project-interpolation\src\main\java\**\*,core-it-support\core-it-plugins\maven-it-plugin-setter\src\main\java\**\*,core-it-support\core-it-plugins\maven-it-plugin-singleton-component\src\main\java\**\*,core-it-support\core-it-plugins\maven-it-plugin-site\src\main\java\**\*,core-it-support\core-it-plugins\maven-it-plugin-toolchain\src\main\java\**\*,core-it-support\core-it-plugins\maven-it-plugin-touch\src\main\java\**\*,core-it-support\core-it-plugins\maven-it-plugin-uses-properties\src\main\java\**\*,core-it-support\core-it-plugins\maven-it-plugin-uses-wagon\src\main\java\**\*,core-it-support\core-it-plugins\maven-it-plugin-all\src\main\java\**\*,core-it-support\core-it-plugins\maven-it-plugin-plexus-utils-11\src\main\java\**\*,core-it-support\core-it-plugins\maven-it-plugin-plexus-utils-new\src\main\java\**\*,core-it-support\core-it-plugins\maven-it-plugin-plexus-component-api\src\main\java\**\*,core-it-support\core-it-plugins\maven-it-plugin-log4j\src\main\java\**\*,core-it-support\core-it-plugins\maven-it-plugin-extension1\src\main\java\**\*,core-it-support\core-it-plugins\maven-it-plugin-extension2\src\main\java\**\*,core-it-support\core-it-plugins\maven-it-plugin-plexus-lifecycle\src\main\java\**\*,core-it-support\core-it-plugins\maven-it-plugin-settings\src\main\java\**\*,core-it-support\core-it-plugins\mng5805-plugin\src\main\java\**\*,core-it-support\core-it-plugins\mng5805-plugin-dep\src\main\java\**\*,core-it-support\core-it-plugins\mng5958-extension\src\main\java\**\*,core-it-support\core-it-toolchain\src\main\java\**\*,core-it-support\core-it-wagon\src\main\java\**\*' - excludes: null
[TASKS] Found 164 files to scan for tasks
[TASKS] Found 0 open tasks.
Skipping warnings blame since pipelines do not have an SCM link.%n
[TASKS] Computing warning deltas based on reference build #261
[withMaven] Publishers: Pipeline Graph Publisher: 57 ms, Generated Artifacts Publisher: 196765 ms, Invoker Publisher: 4 ms, Junit Publisher: 10369 ms, Concordion Publisher: 7 ms, Dependencies Fingerprint Publisher: 100 ms, Findbugs Publisher: 3 ms, JGiven Publisher: 2 ms, Jacoco Publisher: 2 ms, SpotBugs Publisher: 1 ms, Open Task Scanner Publisher: 625 ms
[Pipeline] // withMaven
[Pipeline] fileExists
[Pipeline] zip
Writing zip file of c:\mvn-it-1.tmp\core-it-suite\target\test-classes to c:\mvn-it-1.tmp\core-it-suite-logs-windows-jdk7.zip
[Pipeline] // withMaven
[Pipeline] fileExists
[Pipeline] zip
Writing zip file of /home/jenkins/jenkins-slave/workspace/maven-box_maven_master/test/core-it-suite/target/test-classes to /home/jenkins/jenkins-slave/workspace/maven-box_maven_master/test/core-it-suite-logs-linux-jdk7.zip
Zipped 6484 entries.
Archiving /home/jenkins/jenkins-slave/workspace/maven-box_maven_master/test/core-it-suite-logs-linux-jdk7.zip
Zipped 6483 entries.
Archiving c:\mvn-it-1.tmp\core-it-suite-logs-windows-jdk7.zip
[Pipeline] fileExists
[Pipeline] zip
Writing zip file of c:\mvn-it-1.tmp\core-it-suite\target\surefire-reports to c:\mvn-it-1.tmp\core-it-suite-reports-windows-jdk7.zip
Zipped 2 entries.
Archiving c:\mvn-it-1.tmp\core-it-suite-reports-windows-jdk7.zip
[Pipeline] deleteDir
[Pipeline] fileExists
[Pipeline] zip
Writing zip file of /home/jenkins/jenkins-slave/workspace/maven-box_maven_master/test/core-it-suite/target/surefire-reports to /home/jenkins/jenkins-slave/workspace/maven-box_maven_master/test/core-it-suite-reports-linux-jdk7.zip
Zipped 3 entries.
Archiving /home/jenkins/jenkins-slave/workspace/maven-box_maven_master/test/core-it-suite-reports-linux-jdk7.zip
[Pipeline] deleteDir
[Pipeline] }
[Pipeline] // dir
[Pipeline] }
[Pipeline] // stage
[Pipeline] }
[Pipeline] // node
[Pipeline] }
[Pipeline] }
[Pipeline] // dir
[Pipeline] }
[Pipeline] // stage
[Pipeline] }
[Pipeline] // node
[Pipeline] }
[Pipeline] // parallel
[Pipeline] stage
[Pipeline] { (Notifications)
[Pipeline] echo
Build result: UNSTABLE
[Pipeline] jiraIssueSelector
[Pipeline] echo
The authors of changes [].
[Pipeline] echo
Sending email ...
[Pipeline] emailext
Mime
  • Unnamed multipart/mixed (inline, None, 0 bytes)
View raw message