maven-notifications mailing list archives

Site index · List index
Message view « Date » · « Thread »
Top « Date » · « Thread »
From Apache Jenkins Server <jenk...@builds.apache.org>
Subject Build failed in Jenkins: Maven TLP » maven-archetype » ARCHETYPE-571 #8
Date Mon, 12 Aug 2019 17:57:17 GMT
See https://builds.apache.org/job/maven-box/job/maven-archetype/job/ARCHETYPE-571/8/

Changes:

* [INFRA-18734] Jenkins builds fail on email notifications due to unknown
* Scripts not permitted to use staticMethod
* excluded message body from the log message
* NotSerializableException: hudson.plugins.git.GitChangeSetList
* investigating permissions to the call 'ChangeSetList.author'
* NotSerializableException: hudson.plugins.git.GitChangeSetList
* [INFRA-18734] Jenkins builds fail on email notifications due to unknown
* Prevent Caused: java.io.NotSerializableException: hudson.model.User
* [INFRA-18734] Jenkins builds fail on email notifications due to unknown
* last() cannot be called on []
* [improvement] currentBuild.changeSets can be referenced as changes
* moved the fix of INFRA-18734 to jenkinsNotify

All tests passed

Build log:
[...truncated 21175 lines...]
[withMaven] artifactsPublisher - Archive artifact j7m3.5.xb\archetype-models\pom.xml under
org\apache\maven\archetype\archetype-models\3.1.2-SNAPSHOT\archetype-models-3.1.2-SNAPSHOT.pom
[withMaven] artifactsPublisher - Archive artifact j7m3.5.xb\archetype-models\target\archetype-models-3.1.2-SNAPSHOT-site.xml
under org\apache\maven\archetype\archetype-models\3.1.2-SNAPSHOT\archetype-models-3.1.2-SNAPSHOT-site.xml
[withMaven] artifactsPublisher - Archive artifact j7m3.5.xb\archetype-models\archetype-catalog\pom.xml
under org\apache\maven\archetype\archetype-catalog\3.1.2-SNAPSHOT\archetype-catalog-3.1.2-SNAPSHOT.pom
[withMaven] artifactsPublisher - Archive artifact j7m3.5.xb\archetype-models\archetype-catalog\target\archetype-catalog-3.1.2-SNAPSHOT.jar
under org\apache\maven\archetype\archetype-catalog\3.1.2-SNAPSHOT\archetype-catalog-3.1.2-SNAPSHOT.jar
[withMaven] artifactsPublisher - Archive artifact j7m3.5.xb\archetype-models\archetype-descriptor\pom.xml
under org\apache\maven\archetype\archetype-descriptor\3.1.2-SNAPSHOT\archetype-descriptor-3.1.2-SNAPSHOT.pom
[withMaven] artifactsPublisher - Archive artifact j7m3.5.xb\archetype-models\archetype-descriptor\target\archetype-descriptor-3.1.2-SNAPSHOT.jar
under org\apache\maven\archetype\archetype-descriptor\3.1.2-SNAPSHOT\archetype-descriptor-3.1.2-SNAPSHOT.jar
[withMaven] artifactsPublisher - Archive artifact j7m3.5.xb\archetype-common\pom.xml under
org\apache\maven\archetype\archetype-common\3.1.2-SNAPSHOT\archetype-common-3.1.2-SNAPSHOT.pom
[withMaven] artifactsPublisher - Archive artifact j7m3.5.xb\archetype-common\target\archetype-common-3.1.2-SNAPSHOT.jar
under org\apache\maven\archetype\archetype-common\3.1.2-SNAPSHOT\archetype-common-3.1.2-SNAPSHOT.jar
[withMaven] artifactsPublisher - Archive artifact j7m3.5.xb\archetype-packaging\pom.xml under
org\apache\maven\archetype\archetype-packaging\3.1.2-SNAPSHOT\archetype-packaging-3.1.2-SNAPSHOT.pom
[withMaven] artifactsPublisher - Archive artifact j7m3.5.xb\archetype-packaging\target\archetype-packaging-3.1.2-SNAPSHOT.jar
under org\apache\maven\archetype\archetype-packaging\3.1.2-SNAPSHOT\archetype-packaging-3.1.2-SNAPSHOT.jar
[withMaven] junitPublisher - Archive test results for Maven artifact org.apache.maven.archetype:archetype-catalog:jar:3.1.2-SNAPSHOT
generated by maven-surefire-plugin:test (default-test): j7m3.5.xb\archetype-models\archetype-catalog\target\surefire-reports\*.xml
[withMaven] junitPublisher - Archive test results for Maven artifact org.apache.maven.archetype:archetype-descriptor:jar:3.1.2-SNAPSHOT
generated by maven-surefire-plugin:test (default-test): j7m3.5.xb\archetype-models\archetype-descriptor\target\surefire-reports\*.xml
[withMaven] junitPublisher - Archive test results for Maven artifact org.apache.maven.archetype:archetype-common:jar:3.1.2-SNAPSHOT
generated by maven-surefire-plugin:test (default-test): j7m3.5.xb\archetype-common\target\surefire-reports\*.xml
[withMaven] junitPublisher - Archive test results for Maven artifact org.apache.maven.archetype:archetype-packaging:jar:3.1.2-SNAPSHOT
generated by maven-surefire-plugin:test (default-test): j7m3.5.xb\archetype-packaging\target\surefire-reports\*.xml
[withMaven] junitPublisher - Archive test results for Maven artifact org.apache.maven.plugins:maven-archetype-plugin:maven-plugin:3.1.2-SNAPSHOT
generated by maven-surefire-plugin:test (default-test): j7m3.5.xb\maven-archetype-plugin\target\surefire-reports\*.xml
Recording test results
[withMaven] openTasksPublisher - Scan Tasks for Maven artifact org.apache.maven.archetype:archetype-common:jar:3.1.2-SNAPSHOT
in source directory j7m3.5.xb\archetype-common\src\main\java
[withMaven] openTasksPublisher - Scan Tasks for Maven artifact org.apache.maven.plugins:maven-archetype-plugin:maven-plugin:3.1.2-SNAPSHOT
in source directory j7m3.5.xb\maven-archetype-plugin\src\main\java
[TASKS] Scanning folder 'F:\short\jenkins-maven-box-maven-archetype-ARCHETYPE-571-8@2' for
files matching the pattern 'j7m3.5.xb\archetype-common\src\main\java\**\*,j7m3.5.xb\maven-archetype-plugin\src\main\java\**\*'
- excludes: null
[TASKS] Found 89 files to scan for tasks
[TASKS] Found 26 open tasks.
Skipping warnings blame since pipelines do not have an SCM link.%n
[TASKS] Computing warning deltas based on reference build #5
[withMaven] invokerPublisher - Archive invoker results for Maven artifact MavenArtifact{org.apache.maven.plugins:maven-archetype-plugin:maven-plugin:3.1.2-SNAPSHOT(version:
3.1.2-SNAPSHOT, snapshot:false) } generated by PluginInvocation{org.apache.maven.plugins:maven-invoker-plugin:3.1.0@run
 integration-test}: j7m3.5.xb\maven-archetype-plugin\target\invoker-reports\*.xml
[withMaven] invokerPublisher - Archive invoker results for Maven artifact MavenArtifact{org.apache.maven.plugins:maven-archetype-plugin:maven-plugin:3.1.2-SNAPSHOT(version:
3.1.2-SNAPSHOT, snapshot:false) } generated by PluginInvocation{org.apache.maven.plugins:maven-invoker-plugin:3.1.0@run
 integration-test}: linux-jdk7-m3.3.x_build/maven-archetype-plugin/target/invoker-reports/*.xml
[INFO] run post-build script verify.groovy
[INFO]           roundtrip-multi\pom.xml .......................... SUCCESS (18.9 s)
[INFO] -------------------------------------------------
[INFO] Build Summary:
[INFO]   Passed: 25, Failed: 0, Errors: 0, Skipped: 0
[INFO] -------------------------------------------------
[INFO] 
[INFO] --- mrm-maven-plugin:1.1.0:stop (mirror) @ maven-archetype-plugin ---
[INFO] Stopping Mock Repository Manager on http://localhost:56926
[INFO] Stopped SocketConnector@0.0.0.0:56926
[INFO] Mock Repository Manager http://localhost:56926 is stopped.
[INFO] 
[INFO] --- mrm-maven-plugin:1.1.0:stop (archetype-repository) @ maven-archetype-plugin ---
[INFO] Stopping Mock Repository Manager on http://localhost:56929
[INFO] Stopped SocketConnector@0.0.0.0:56929
[INFO] Mock Repository Manager http://localhost:56929 is stopped.
[INFO] 
[INFO] --- maven-checkstyle-plugin:3.0.0:check (checkstyle-check) @ maven-archetype-plugin
---
[INFO] There are 46 errors reported by Checkstyle 6.18 with config/maven_checks.xml ruleset.
[INFO] Ignored 46 errors, 0 violation remaining.
[INFO] ------------------------------------------------------------------------
[INFO] Reactor Summary for Maven Archetype 3.1.2-SNAPSHOT:
[INFO] 
[INFO] Maven Archetype .................................... SUCCESS [ 43.327 s]
[INFO] Maven Archetype Models ............................. SUCCESS [  0.624 s]
[INFO] Maven Archetype Catalog Model ...................... SUCCESS [ 13.996 s]
[INFO] Maven Archetype Descriptor Model ................... SUCCESS [  1.626 s]
[INFO] Maven Archetype Common ............................. SUCCESS [ 36.409 s]
[INFO] Maven Archetype Packaging .......................... SUCCESS [  0.594 s]
[INFO] Maven Archetype Plugin ............................. SUCCESS [06:03 min]
[INFO] ------------------------------------------------------------------------
[INFO] BUILD SUCCESS
[INFO] ------------------------------------------------------------------------
[INFO] Total time:  07:40 min
[INFO] Finished at: 2019-08-12T10:56:23-07:00
[INFO] ------------------------------------------------------------------------
[INFO] [jenkins-event-spy] Generated F:\short\jenkins-maven-box-maven-archetype-ARCHETYPE-571-8@3@tmp\withMaven6bbc216c\maven-spy-20190812-104842-5937005846637137387633.log
Picked up JAVA_TOOL_OPTIONS: -Dmaven.ext.class.path="F:\short\jenkins-maven-box-maven-archetype-ARCHETYPE-571-8@3@tmp\withMaven6bbc216c\pipeline-maven-spy.jar"
-Dorg.jenkinsci.plugins.pipeline.maven.reportsFolder="F:\short\jenkins-maven-box-maven-archetype-ARCHETYPE-571-8@3@tmp\withMaven6bbc216c"

[Pipeline] }
[Pipeline] // dir
[Pipeline] }
[withMaven] artifactsPublisher - Archive artifact j7m3.6.xb\pom.xml under org\apache\maven\archetype\maven-archetype\3.1.2-SNAPSHOT\maven-archetype-3.1.2-SNAPSHOT.pom
[withMaven] artifactsPublisher - Archive artifact j7m3.6.xb\target\maven-archetype-3.1.2-SNAPSHOT-site.xml
under org\apache\maven\archetype\maven-archetype\3.1.2-SNAPSHOT\maven-archetype-3.1.2-SNAPSHOT-site.xml
[withMaven] artifactsPublisher - Archive artifact j7m3.6.xb\archetype-models\pom.xml under
org\apache\maven\archetype\archetype-models\3.1.2-SNAPSHOT\archetype-models-3.1.2-SNAPSHOT.pom
[withMaven] artifactsPublisher - Archive artifact j7m3.6.xb\archetype-models\target\archetype-models-3.1.2-SNAPSHOT-site.xml
under org\apache\maven\archetype\archetype-models\3.1.2-SNAPSHOT\archetype-models-3.1.2-SNAPSHOT-site.xml
[withMaven] artifactsPublisher - Archive artifact j7m3.6.xb\archetype-models\archetype-catalog\pom.xml
under org\apache\maven\archetype\archetype-catalog\3.1.2-SNAPSHOT\archetype-catalog-3.1.2-SNAPSHOT.pom
[withMaven] artifactsPublisher - Archive artifact j7m3.6.xb\archetype-models\archetype-catalog\target\archetype-catalog-3.1.2-SNAPSHOT.jar
under org\apache\maven\archetype\archetype-catalog\3.1.2-SNAPSHOT\archetype-catalog-3.1.2-SNAPSHOT.jar
[withMaven] artifactsPublisher - Archive artifact j7m3.6.xb\archetype-models\archetype-descriptor\pom.xml
under org\apache\maven\archetype\archetype-descriptor\3.1.2-SNAPSHOT\archetype-descriptor-3.1.2-SNAPSHOT.pom
[withMaven] artifactsPublisher - Archive artifact j7m3.6.xb\archetype-models\archetype-descriptor\target\archetype-descriptor-3.1.2-SNAPSHOT.jar
under org\apache\maven\archetype\archetype-descriptor\3.1.2-SNAPSHOT\archetype-descriptor-3.1.2-SNAPSHOT.jar
[withMaven] artifactsPublisher - Archive artifact j7m3.6.xb\archetype-common\pom.xml under
org\apache\maven\archetype\archetype-common\3.1.2-SNAPSHOT\archetype-common-3.1.2-SNAPSHOT.pom
[withMaven] artifactsPublisher - Archive artifact j7m3.6.xb\archetype-common\target\archetype-common-3.1.2-SNAPSHOT.jar
under org\apache\maven\archetype\archetype-common\3.1.2-SNAPSHOT\archetype-common-3.1.2-SNAPSHOT.jar
[withMaven] artifactsPublisher - Archive artifact j7m3.6.xb\archetype-packaging\pom.xml under
org\apache\maven\archetype\archetype-packaging\3.1.2-SNAPSHOT\archetype-packaging-3.1.2-SNAPSHOT.pom
[withMaven] artifactsPublisher - Archive artifact j7m3.6.xb\archetype-packaging\target\archetype-packaging-3.1.2-SNAPSHOT.jar
under org\apache\maven\archetype\archetype-packaging\3.1.2-SNAPSHOT\archetype-packaging-3.1.2-SNAPSHOT.jar
[withMaven] artifactsPublisher - Archive artifact j7m3.6.xb\maven-archetype-plugin\pom.xml
under org\apache\maven\plugins\maven-archetype-plugin\3.1.2-SNAPSHOT\maven-archetype-plugin-3.1.2-SNAPSHOT.pom
[withMaven] artifactsPublisher - Archive artifact j7m3.6.xb\maven-archetype-plugin\target\maven-archetype-plugin-3.1.2-SNAPSHOT.jar
under org\apache\maven\plugins\maven-archetype-plugin\3.1.2-SNAPSHOT\maven-archetype-plugin-3.1.2-SNAPSHOT.jar
[withMaven] junitPublisher - Archive test results for Maven artifact org.apache.maven.archetype:archetype-catalog:jar:3.1.2-SNAPSHOT
generated by maven-surefire-plugin:test (default-test): j7m3.6.xb\archetype-models\archetype-catalog\target\surefire-reports\*.xml
[withMaven] junitPublisher - Archive test results for Maven artifact org.apache.maven.archetype:archetype-descriptor:jar:3.1.2-SNAPSHOT
generated by maven-surefire-plugin:test (default-test): j7m3.6.xb\archetype-models\archetype-descriptor\target\surefire-reports\*.xml
[withMaven] junitPublisher - Archive test results for Maven artifact org.apache.maven.archetype:archetype-common:jar:3.1.2-SNAPSHOT
generated by maven-surefire-plugin:test (default-test): j7m3.6.xb\archetype-common\target\surefire-reports\*.xml
[withMaven] junitPublisher - Archive test results for Maven artifact org.apache.maven.archetype:archetype-packaging:jar:3.1.2-SNAPSHOT
generated by maven-surefire-plugin:test (default-test): j7m3.6.xb\archetype-packaging\target\surefire-reports\*.xml
[withMaven] junitPublisher - Archive test results for Maven artifact org.apache.maven.plugins:maven-archetype-plugin:maven-plugin:3.1.2-SNAPSHOT
generated by maven-surefire-plugin:test (default-test): j7m3.6.xb\maven-archetype-plugin\target\surefire-reports\*.xml
Recording test results
[withMaven] openTasksPublisher - Scan Tasks for Maven artifact org.apache.maven.archetype:archetype-common:jar:3.1.2-SNAPSHOT
in source directory j7m3.6.xb\archetype-common\src\main\java
[withMaven] openTasksPublisher - Scan Tasks for Maven artifact org.apache.maven.plugins:maven-archetype-plugin:maven-plugin:3.1.2-SNAPSHOT
in source directory j7m3.6.xb\maven-archetype-plugin\src\main\java
[TASKS] Scanning folder 'F:\short\jenkins-maven-box-maven-archetype-ARCHETYPE-571-8@3' for
files matching the pattern 'j7m3.6.xb\archetype-common\src\main\java\**\*,j7m3.6.xb\maven-archetype-plugin\src\main\java\**\*'
- excludes: null
[TASKS] Found 89 files to scan for tasks
[TASKS] Found 26 open tasks.
Skipping warnings blame since pipelines do not have an SCM link.%n
[TASKS] Computing warning deltas based on reference build #5
[withMaven] invokerPublisher - Archive invoker results for Maven artifact MavenArtifact{org.apache.maven.plugins:maven-archetype-plugin:maven-plugin:3.1.2-SNAPSHOT(version:
3.1.2-SNAPSHOT, snapshot:false) } generated by PluginInvocation{org.apache.maven.plugins:maven-invoker-plugin:3.1.0@run
 integration-test}: j7m3.6.xb\maven-archetype-plugin\target\invoker-reports\*.xml
[withMaven] Publishers: Generated Artifacts Publisher: 348 ms, Junit Publisher: 358 ms, Open
Task Scanner Publisher: 272 ms, Dependencies Fingerprint Publisher: 65 ms, Invoker Publisher:
18113 ms, Pipeline Graph Publisher: 5 ms
[Pipeline] // withMaven
[Pipeline] cleanWs
[WS-CLEANUP] Deleting project workspace...
[WS-CLEANUP] Deferred wipeout is used...
[WS-CLEANUP] done
[Pipeline] }
[Pipeline] // stage
[Pipeline] }
[Pipeline] // ws
[Pipeline] }
[Pipeline] // node
[INFO] run post-build script verify.groovy
[INFO]           roundtrip-1-project .............................. SUCCESS (18.0 s)
[INFO] Building: roundtrip-multi\pom.xml
[Pipeline] }
[withMaven] Publishers: Generated Artifacts Publisher: 302 ms, Junit Publisher: 363 ms, Open
Task Scanner Publisher: 280 ms, Dependencies Fingerprint Publisher: 65 ms, Invoker Publisher:
17910 ms, Pipeline Graph Publisher: 4 ms
[Pipeline] // withMaven
[Pipeline] cleanWs
[WS-CLEANUP] Deleting project workspace...
[WS-CLEANUP] Deferred wipeout is used...
[WS-CLEANUP] done
[Pipeline] cleanWs
[WS-CLEANUP] Deleting project workspace...
[WS-CLEANUP] Deferred wipeout is used...
[WS-CLEANUP] done
[Pipeline] }
[Pipeline] // stage
[Pipeline] }
[Pipeline] // ws
[Pipeline] }
[Pipeline] // node
[Pipeline] }
Failed in branch windows-jdk7-m3.5.x_build
[withMaven] Publishers: Generated Artifacts Publisher: 393 ms, Junit Publisher: 377 ms, Open
Task Scanner Publisher: 335 ms, Dependencies Fingerprint Publisher: 67 ms, Invoker Publisher:
18089 ms, Pipeline Graph Publisher: 2 ms
[Pipeline] // withMaven
[Pipeline] cleanWs
[WS-CLEANUP] Deleting project workspace...
[WS-CLEANUP] Deferred wipeout is used...
[WS-CLEANUP] done
[Pipeline] }
[Pipeline] // stage
[Pipeline] }
[Pipeline] // ws
[Pipeline] }
[Pipeline] // node
[Pipeline] }
[withMaven] Publishers: Generated Artifacts Publisher: 5894 ms, Junit Publisher: 8104 ms,
Open Task Scanner Publisher: 3562 ms, Dependencies Fingerprint Publisher: 1565 ms, Invoker
Publisher: 25199 ms, Pipeline Graph Publisher: 4 ms
[Pipeline] // withMaven
[Pipeline] cleanWs
[WS-CLEANUP] Deleting project workspace...
[WS-CLEANUP] Deferred wipeout is used...
[WS-CLEANUP] done
[Pipeline] }
[Pipeline] // stage
[Pipeline] }
[Pipeline] // ws
[Pipeline] }
[Pipeline] // node
[Pipeline] }
[INFO] snapshot com.company.proficio:proficio-archetype:1.0-SNAPSHOT: checking for updates
from apache-snapshots
[INFO] snapshot com.company.proficio:proficio-archetype:1.0-SNAPSHOT: checking for updates
from Nexus
[INFO] artifact com.company.proficio.proficio-archetype:1.0-SNAPSHOT: checking for updates
from central
[INFO] run post-build script verify.groovy
[INFO]           roundtrip-multi\pom.xml .......................... SUCCESS (20.0 s)
[INFO] -------------------------------------------------
[INFO] Build Summary:
[INFO]   Passed: 25, Failed: 0, Errors: 0, Skipped: 0
[INFO] -------------------------------------------------
[INFO] 
[INFO] --- mrm-maven-plugin:1.1.0:stop (mirror) @ maven-archetype-plugin ---
[INFO] Stopping Mock Repository Manager on http://localhost:54404
[INFO] Stopped SocketConnector@0.0.0.0:54404
[INFO] Mock Repository Manager http://localhost:54404 is stopped.
[INFO] 
[INFO] --- mrm-maven-plugin:1.1.0:stop (archetype-repository) @ maven-archetype-plugin ---
[INFO] Stopping Mock Repository Manager on http://localhost:54407
[INFO] Stopped SocketConnector@0.0.0.0:54407
[INFO] Mock Repository Manager http://localhost:54407 is stopped.
[INFO] 
[INFO] --- maven-checkstyle-plugin:3.0.0:check (checkstyle-check) @ maven-archetype-plugin
---
[INFO] There are 46 errors reported by Checkstyle 6.18 with config/maven_checks.xml ruleset.
[INFO] Ignored 46 errors, 0 violation remaining.
[INFO] ------------------------------------------------------------------------
[INFO] Reactor Summary for Maven Archetype 3.1.2-SNAPSHOT:
[INFO] 
[INFO] Maven Archetype .................................... SUCCESS [ 37.441 s]
[INFO] Maven Archetype Models ............................. SUCCESS [  0.764 s]
[INFO] Maven Archetype Catalog Model ...................... SUCCESS [ 12.718 s]
[INFO] Maven Archetype Descriptor Model ................... SUCCESS [  1.833 s]
[INFO] Maven Archetype Common ............................. SUCCESS [ 42.387 s]
[INFO] Maven Archetype Packaging .......................... SUCCESS [  0.818 s]
[INFO] Maven Archetype Plugin ............................. SUCCESS [06:24 min]
[INFO] ------------------------------------------------------------------------
[INFO] BUILD SUCCESS
[INFO] ------------------------------------------------------------------------
[INFO] Total time:  08:01 min
[INFO] Finished at: 2019-08-12T10:56:57-07:00
[INFO] ------------------------------------------------------------------------
[INFO] [jenkins-event-spy] Generated F:\short\jenkins-maven-box-maven-archetype-ARCHETYPE-571-8@tmp\withMaven0a1f8e15\maven-spy-20190812-104855-7498855725562709387698.log
[Pipeline] }
[Pipeline] // dir
[Pipeline] }
[withMaven] artifactsPublisher - Archive artifact j11m3.6.xb\pom.xml under org\apache\maven\archetype\maven-archetype\3.1.2-SNAPSHOT\maven-archetype-3.1.2-SNAPSHOT.pom
[withMaven] artifactsPublisher - Archive artifact j11m3.6.xb\target\maven-archetype-3.1.2-SNAPSHOT-site.xml
under org\apache\maven\archetype\maven-archetype\3.1.2-SNAPSHOT\maven-archetype-3.1.2-SNAPSHOT-site.xml
[withMaven] artifactsPublisher - Archive artifact j11m3.6.xb\archetype-models\pom.xml under
org\apache\maven\archetype\archetype-models\3.1.2-SNAPSHOT\archetype-models-3.1.2-SNAPSHOT.pom
[withMaven] artifactsPublisher - Archive artifact j11m3.6.xb\archetype-models\target\archetype-models-3.1.2-SNAPSHOT-site.xml
under org\apache\maven\archetype\archetype-models\3.1.2-SNAPSHOT\archetype-models-3.1.2-SNAPSHOT-site.xml
[withMaven] artifactsPublisher - Archive artifact j11m3.6.xb\archetype-models\archetype-catalog\pom.xml
under org\apache\maven\archetype\archetype-catalog\3.1.2-SNAPSHOT\archetype-catalog-3.1.2-SNAPSHOT.pom
[withMaven] artifactsPublisher - Archive artifact j11m3.6.xb\archetype-models\archetype-catalog\target\archetype-catalog-3.1.2-SNAPSHOT.jar
under org\apache\maven\archetype\archetype-catalog\3.1.2-SNAPSHOT\archetype-catalog-3.1.2-SNAPSHOT.jar
[withMaven] artifactsPublisher - Archive artifact j11m3.6.xb\archetype-models\archetype-descriptor\pom.xml
under org\apache\maven\archetype\archetype-descriptor\3.1.2-SNAPSHOT\archetype-descriptor-3.1.2-SNAPSHOT.pom
[withMaven] artifactsPublisher - Archive artifact j11m3.6.xb\archetype-models\archetype-descriptor\target\archetype-descriptor-3.1.2-SNAPSHOT.jar
under org\apache\maven\archetype\archetype-descriptor\3.1.2-SNAPSHOT\archetype-descriptor-3.1.2-SNAPSHOT.jar
[withMaven] artifactsPublisher - Archive artifact j11m3.6.xb\archetype-common\pom.xml under
org\apache\maven\archetype\archetype-common\3.1.2-SNAPSHOT\archetype-common-3.1.2-SNAPSHOT.pom
[withMaven] artifactsPublisher - Archive artifact j11m3.6.xb\archetype-common\target\archetype-common-3.1.2-SNAPSHOT.jar
under org\apache\maven\archetype\archetype-common\3.1.2-SNAPSHOT\archetype-common-3.1.2-SNAPSHOT.jar
[withMaven] artifactsPublisher - Archive artifact j11m3.6.xb\archetype-packaging\pom.xml under
org\apache\maven\archetype\archetype-packaging\3.1.2-SNAPSHOT\archetype-packaging-3.1.2-SNAPSHOT.pom
[withMaven] artifactsPublisher - Archive artifact j11m3.6.xb\archetype-packaging\target\archetype-packaging-3.1.2-SNAPSHOT.jar
under org\apache\maven\archetype\archetype-packaging\3.1.2-SNAPSHOT\archetype-packaging-3.1.2-SNAPSHOT.jar
[withMaven] artifactsPublisher - Archive artifact j11m3.6.xb\maven-archetype-plugin\pom.xml
under org\apache\maven\plugins\maven-archetype-plugin\3.1.2-SNAPSHOT\maven-archetype-plugin-3.1.2-SNAPSHOT.pom
[withMaven] artifactsPublisher - Archive artifact j11m3.6.xb\maven-archetype-plugin\target\maven-archetype-plugin-3.1.2-SNAPSHOT.jar
under org\apache\maven\plugins\maven-archetype-plugin\3.1.2-SNAPSHOT\maven-archetype-plugin-3.1.2-SNAPSHOT.jar
[withMaven] junitPublisher - Archive test results for Maven artifact org.apache.maven.archetype:archetype-catalog:jar:3.1.2-SNAPSHOT
generated by maven-surefire-plugin:test (default-test): j11m3.6.xb\archetype-models\archetype-catalog\target\surefire-reports\*.xml
[withMaven] junitPublisher - Archive test results for Maven artifact org.apache.maven.archetype:archetype-descriptor:jar:3.1.2-SNAPSHOT
generated by maven-surefire-plugin:test (default-test): j11m3.6.xb\archetype-models\archetype-descriptor\target\surefire-reports\*.xml
[withMaven] junitPublisher - Archive test results for Maven artifact org.apache.maven.archetype:archetype-common:jar:3.1.2-SNAPSHOT
generated by maven-surefire-plugin:test (default-test): j11m3.6.xb\archetype-common\target\surefire-reports\*.xml
[withMaven] junitPublisher - Archive test results for Maven artifact org.apache.maven.archetype:archetype-packaging:jar:3.1.2-SNAPSHOT
generated by maven-surefire-plugin:test (default-test): j11m3.6.xb\archetype-packaging\target\surefire-reports\*.xml
[withMaven] junitPublisher - Archive test results for Maven artifact org.apache.maven.plugins:maven-archetype-plugin:maven-plugin:3.1.2-SNAPSHOT
generated by maven-surefire-plugin:test (default-test): j11m3.6.xb\maven-archetype-plugin\target\surefire-reports\*.xml
Recording test results
[withMaven] openTasksPublisher - Scan Tasks for Maven artifact org.apache.maven.archetype:archetype-common:jar:3.1.2-SNAPSHOT
in source directory j11m3.6.xb\archetype-common\src\main\java
[withMaven] openTasksPublisher - Scan Tasks for Maven artifact org.apache.maven.plugins:maven-archetype-plugin:maven-plugin:3.1.2-SNAPSHOT
in source directory j11m3.6.xb\maven-archetype-plugin\src\main\java
[TASKS] Scanning folder 'F:\short\jenkins-maven-box-maven-archetype-ARCHETYPE-571-8' for files
matching the pattern 'j11m3.6.xb\archetype-common\src\main\java\**\*,j11m3.6.xb\maven-archetype-plugin\src\main\java\**\*'
- excludes: null
[TASKS] Found 89 files to scan for tasks
[TASKS] Found 26 open tasks.
Skipping warnings blame since pipelines do not have an SCM link.%n
[TASKS] Computing warning deltas based on reference build #5
[withMaven] invokerPublisher - Archive invoker results for Maven artifact MavenArtifact{org.apache.maven.plugins:maven-archetype-plugin:maven-plugin:3.1.2-SNAPSHOT(version:
3.1.2-SNAPSHOT, snapshot:false) } generated by PluginInvocation{org.apache.maven.plugins:maven-invoker-plugin:3.1.0@run
 integration-test}: j11m3.6.xb\maven-archetype-plugin\target\invoker-reports\*.xml
[withMaven] Publishers: Generated Artifacts Publisher: 374 ms, Junit Publisher: 474 ms, Open
Task Scanner Publisher: 317 ms, Dependencies Fingerprint Publisher: 68 ms, Invoker Publisher:
17743 ms, Pipeline Graph Publisher: 5 ms
[Pipeline] // withMaven
[Pipeline] cleanWs
[WS-CLEANUP] Deleting project workspace...
[WS-CLEANUP] Deferred wipeout is used...
[WS-CLEANUP] done
[Pipeline] }
[Pipeline] // stage
[Pipeline] }
[Pipeline] // ws
[Pipeline] }
[Pipeline] // node
[Pipeline] }
[Pipeline] // parallel
[Pipeline] stage
[Pipeline] { (Notifications)
[Pipeline] echo
Build result: FAILURE
[Pipeline] jiraIssueSelector
[Pipeline] echo
The authors of changes [tibordigana, rfscholte].
[Pipeline] echo
Sending email ...
[Pipeline] emailext
Mime
  • Unnamed multipart/mixed (inline, None, 0 bytes)
View raw message