maven-notifications mailing list archives

Site index · List index
Message view « Date » · « Thread »
Top « Date » · « Thread »
From Apache Jenkins Server <jenk...@builds.apache.org>
Subject Build failed in Jenkins: Maven TLP » maven-site-plugin » master #35
Date Sat, 03 Aug 2019 23:21:12 GMT
See https://builds.apache.org/job/maven-box/job/maven-site-plugin/job/master/35/

Changes:

* exclude nodes with MAVEN_OPTS issues
* exclude more nodes with MAVEN_OPTS issues
* exclude more nodes with MAVEN_OPTS issues
* stop avoiding nodes with MAVEN_OPTS issue
* [INFRA-18734] Jenkins builds fail on email notifications due to unknown
* Scripts not permitted to use staticMethod
* excluded message body from the log message
* NotSerializableException: hudson.plugins.git.GitChangeSetList
* investigating permissions to the call 'ChangeSetList.author'
* NotSerializableException: hudson.plugins.git.GitChangeSetList
* [INFRA-18734] Jenkins builds fail on email notifications due to unknown
* added archives
* added archives fix
* print disk space usage
* sh 'df -hT'
* [INFRA-18734] Jenkins builds fail on email notifications due to unknown
* last() cannot be called on []
* [improvement] currentBuild.changeSets can be referenced as changes
* moved the fix of INFRA-18734 to jenkinsNotify
* [MSITE-848] Update sitedescriptor.apt
* [MSITE-848] Update sitedescriptor.apt
* [MSITE-848] Update sitedescriptor.apt
* [MSITE-848] Update sitedescriptor.apt
* [MSITE-848] Update sitedescriptor.apt
* [MSITE-848] Update sitedescriptor.apt
* [MSITE-848] Update sitedescriptor.apt
* [MSITE-848] Update sitedescriptor.apt
* [MSITE-848] Update sitedescriptor.apt
* [MSITE-848] Update sitedescriptor.apt
* [MSITE-848] Update sitedescriptor.apt
* [MSITE-848] Update sitedescriptor.apt
* [MSITE-848] Update sitedescriptor.apt

All tests passed

Build log:
[...truncated 11514 lines...]
[Pipeline] }
[Pipeline] // ws
[Pipeline] }
[Pipeline] // node
[Pipeline] }
[INFO] run post-build script verify.bsh
[INFO]           site-attach-descriptor\pom.xml ................... SUCCESS (9.4 s)
[INFO] Building: site-deploy\pom.xml
[INFO] run post-build script verify.bsh
[INFO]           site-attach-descriptor\pom.xml ................... SUCCESS (9.5 s)
[INFO] Building: site-deploy\pom.xml
[INFO] run post-build script verify.bsh
[INFO]           site-deploy\pom.xml .............................. SUCCESS (7.6 s)
[INFO] Building: site-inheritance\pom.xml
[INFO] run post-build script verify.bsh
[INFO]           site-deploy\pom.xml .............................. SUCCESS (7.7 s)
[INFO] Building: site-inheritance\pom.xml
[withMaven] Publishers: Generated Artifacts Publisher: 1290 ms, Junit Publisher: 1804 ms,
Open Task Scanner Publisher: 1522 ms, Dependencies Fingerprint Publisher: 1 ms, Invoker Publisher:
72083 ms, Pipeline Graph Publisher: 2 ms
[Pipeline] // withMaven
[Pipeline] cleanWs
[WS-CLEANUP] Deleting project workspace...
[WS-CLEANUP] Deferred wipeout is used...
[WS-CLEANUP] done
[Pipeline] }
[Pipeline] // stage
[Pipeline] }
[Pipeline] // ws
[Pipeline] }
[Pipeline] // node
[Pipeline] }
[withMaven] Publishers: Generated Artifacts Publisher: 12 ms, Junit Publisher: 100 ms, Open
Task Scanner Publisher: 133 ms, Dependencies Fingerprint Publisher: 1 ms, Invoker Publisher:
30675 ms
[Pipeline] // withMaven
[Pipeline] cleanWs
[WS-CLEANUP] Deleting project workspace...
[WS-CLEANUP] Deferred wipeout is used...
[WS-CLEANUP] done
[Pipeline] cleanWs
[WS-CLEANUP] Deleting project workspace...
[WS-CLEANUP] Deferred wipeout is used...
[WS-CLEANUP] done
[Pipeline] }
[Pipeline] // stage
[Pipeline] }
[Pipeline] // ws
[Pipeline] }
[Pipeline] // node
[Pipeline] }
Failed in branch windows-jdk11-m3.6.x_build
[withMaven] Publishers: Generated Artifacts Publisher: 11 ms, Junit Publisher: 83 ms, Open
Task Scanner Publisher: 117 ms, Dependencies Fingerprint Publisher: 1 ms, Invoker Publisher:
30336 ms
[Pipeline] // withMaven
[Pipeline] cleanWs
[WS-CLEANUP] Deleting project workspace...
[WS-CLEANUP] Deferred wipeout is used...
[WS-CLEANUP] done
[Pipeline] cleanWs
[WS-CLEANUP] Deleting project workspace...
[WS-CLEANUP] Deferred wipeout is used...
[WS-CLEANUP] done
[Pipeline] }
[Pipeline] // stage
[Pipeline] }
[Pipeline] // ws
[Pipeline] }
[Pipeline] // node
[Pipeline] }
Failed in branch windows-jdk12-m3.6.x_build
[INFO] run post-build script verify.bsh
[INFO]           site-inheritance\pom.xml ......................... SUCCESS (12.2 s)
[INFO] Building: site-jar\pom.xml
[INFO] run post-build script verify.bsh
[INFO]           site-jar\pom.xml ................................. SUCCESS (6.6 s)
[INFO] Building: site-sd\pom.xml
[INFO] run post-build script verify.bsh
[INFO]           site-inheritance\pom.xml ......................... SUCCESS (16.1 s)
[INFO] Building: site-jar\pom.xml
[INFO] run post-build script verify.bsh
[INFO]           site-jar\pom.xml ................................. SUCCESS (7.5 s)
[INFO] Building: site-sd\pom.xml
[INFO] run post-build script verify.groovy
[INFO]           site-sd\pom.xml .................................. SUCCESS (9.7 s)
[INFO] Building: site-sd-2\pom.xml
[INFO] run post-build script verify.groovy
[INFO]           site-sd\pom.xml .................................. SUCCESS (10.7 s)
[INFO] Building: site-sd-2\pom.xml
[INFO] run post-build script verify.groovy
[INFO]           site-sd-2\pom.xml ................................ SUCCESS (13.9 s)
[INFO] Building: site-sd-lang\pom.xml
[INFO] run post-build script verify.groovy
[INFO]           site-sd-2\pom.xml ................................ SUCCESS (14.3 s)
[INFO] Building: site-sd-lang\pom.xml
[INFO] run post-build script verify.bsh
[INFO]           site-sd-lang\pom.xml ............................. SUCCESS (12.4 s)
[INFO] Building: site-sd-stagingSiteURL\pom.xml
[INFO] run post-build script verify.bsh
[INFO]           site-sd-lang\pom.xml ............................. SUCCESS (12.6 s)
[INFO] Building: site-sd-stagingSiteURL\pom.xml
[INFO] run post-build script verify.groovy
[INFO]           site-sd-stagingSiteURL\pom.xml ................... SUCCESS (8.0 s)
[INFO] Building: site-sd-submodule\pom.xml
[INFO] run post-build script verify.groovy
[INFO]           site-sd-stagingSiteURL\pom.xml ................... SUCCESS (7.9 s)
[INFO] Building: site-sd-submodule\pom.xml
[INFO] run post-build script verify.groovy
[INFO]           site-sd-submodule\pom.xml ........................ SUCCESS (10.0 s)
[INFO] Building: site-sd-top-parent-different-site\pom.xml
[INFO] run post-build script verify.groovy
[INFO]           site-sd-submodule\pom.xml ........................ SUCCESS (10.9 s)
[INFO] Building: site-sd-top-parent-different-site\pom.xml
[INFO] run post-build script verify.groovy
[INFO]           site-sd-top-parent-different-site\pom.xml ........ SUCCESS (8.5 s)
[INFO] Building: site-sd-top-parent-no-site\pom.xml
[INFO] run post-build script verify.groovy
[INFO]           site-sd-top-parent-different-site\pom.xml ........ SUCCESS (10.1 s)
[INFO] Building: site-sd-top-parent-no-site\pom.xml
[INFO] run post-build script verify.groovy
[INFO]           site-sd-top-parent-no-site\pom.xml ............... SUCCESS (11.5 s)
[INFO] Building: site-sd-top-parent-same-site\pom.xml
[INFO] run post-build script verify.groovy
[INFO]           site-sd-top-parent-no-site\pom.xml ............... SUCCESS (11.8 s)
[INFO] Building: site-sd-top-parent-same-site\pom.xml
[INFO] run post-build script verify.groovy
[INFO]           site-sd-top-parent-same-site\pom.xml ............. SUCCESS (9.3 s)
[INFO] Building: site-skip\pom.xml
[INFO] run post-build script verify.groovy
[INFO]           site-sd-top-parent-same-site\pom.xml ............. SUCCESS (10.1 s)
[INFO] Building: site-skip\pom.xml
[INFO] run post-build script verify.bsh
[INFO]           site-skip\pom.xml ................................ SUCCESS (9.5 s)
[INFO] Building: surefire-report\pom.xml
[INFO] run post-build script verify.bsh
[INFO]           site-skip\pom.xml ................................ SUCCESS (9.7 s)
[INFO] Building: surefire-report\pom.xml
[INFO] run post-build script verify.groovy
[INFO]           surefire-report\pom.xml .......................... SUCCESS (11.3 s)
[INFO] Building: template-skin\pom.xml
[INFO] run post-build script verify.groovy
[INFO]           surefire-report\pom.xml .......................... SUCCESS (10.6 s)
[INFO] Building: template-skin\pom.xml
[INFO] snapshot org.apache.maven.plugins.site.its:template-skin:1.0-SNAPSHOT: checking for
updates from apache-snapshots
[INFO] snapshot org.apache.maven.plugins.site.its:template-skin:1.0-SNAPSHOT: checking for
updates from Nexus
[INFO] artifact org.apache.maven.plugins.site.its.template-skin:1.0-SNAPSHOT: checking for
updates from central
[INFO] run post-build script verify.bsh
[INFO]           template-skin\pom.xml ............................ SUCCESS (14.5 s)
[INFO] Building: validate\pom.xml
[INFO] run post-build script verify.groovy
[INFO]           validate\pom.xml ................................. SUCCESS (7.3 s)
[INFO] 
[INFO] --- mrm-maven-plugin:1.2.0:stop (default) @ maven-site-plugin ---
[INFO] Stopping Mock Repository Manager on http://localhost:51297
Aug 03, 2019 4:20:23 PM org.mortbay.log.Slf4jLog info
INFO: Stopped SocketConnector@0.0.0.0:51297
[INFO] Mock Repository Manager http://localhost:51297 is stopped.
[INFO] 
[INFO] --- maven-checkstyle-plugin:3.0.0:check (checkstyle-check) @ maven-site-plugin ---
[INFO] 
[INFO] --- maven-invoker-plugin:3.1.0:verify (integration-test) @ maven-site-plugin ---
[INFO] -------------------------------------------------
[INFO] Build Summary:
[INFO]   Passed: 56, Failed: 0, Errors: 0, Skipped: 0
[INFO] -------------------------------------------------
[INFO] ------------------------------------------------------------------------
[INFO] BUILD SUCCESS
[INFO] ------------------------------------------------------------------------
[INFO] Total time: 15:37.656s
[INFO] Finished at: Sat Aug 03 16:20:25 PDT 2019
[INFO] Final Memory: 57M/499M
[INFO] ------------------------------------------------------------------------
Picked up JAVA_TOOL_OPTIONS: -Dmaven.ext.class.path="f:\jenkins\jenkins-slave\workspace\ven-box_maven-site-plugin_master@3@tmp\withMaven1a30751c\pipeline-maven-spy.jar"
-Dorg.jenkinsci.plugins.pipeline.maven.reportsFolder="f:\jenkins\jenkins-slave\workspace\ven-box_maven-site-plugin_master@3@tmp\withMaven1a30751c"

[Pipeline] }
[Pipeline] // dir
[Pipeline] }
[Pipeline] // withMaven
[Pipeline] cleanWs
[WS-CLEANUP] Deleting project workspace...
[WS-CLEANUP] Deferred wipeout is used...
[WS-CLEANUP] done
[Pipeline] }
[Pipeline] // stage
[Pipeline] }
[Pipeline] // ws
[Pipeline] }
[Pipeline] // node
[Pipeline] }
[INFO] run post-build script verify.bsh
[INFO]           template-skin\pom.xml ............................ SUCCESS (13.6 s)
[INFO] Building: validate\pom.xml
[INFO] run post-build script verify.groovy
[INFO]           validate\pom.xml ................................. SUCCESS (7.0 s)
[INFO] 
[INFO] --- mrm-maven-plugin:1.2.0:stop (default) @ maven-site-plugin ---
[INFO] Stopping Mock Repository Manager on http://localhost:51298
[INFO] Stopped SocketConnector@0.0.0.0:51298
[INFO] Mock Repository Manager http://localhost:51298 is stopped.
[INFO] 
[INFO] --- maven-checkstyle-plugin:3.0.0:check (checkstyle-check) @ maven-site-plugin ---
[INFO] 
[INFO] --- maven-invoker-plugin:3.1.0:verify (integration-test) @ maven-site-plugin ---
[INFO] -------------------------------------------------
[INFO] Build Summary:
[INFO]   Passed: 56, Failed: 0, Errors: 0, Skipped: 0
[INFO] -------------------------------------------------
[INFO] ------------------------------------------------------------------------
[INFO] BUILD SUCCESS
[INFO] ------------------------------------------------------------------------
[INFO] Total time: 15:47 min
[INFO] Finished at: 2019-08-03T16:20:33-07:00
[INFO] Final Memory: 66M/736M
[INFO] ------------------------------------------------------------------------
[INFO] [jenkins-event-spy] Generated F:\jenkins\jenkins-slave\workspace\ven-box_maven-site-plugin_master@2@2@tmp\withMavena1d9a410\maven-spy-20190803-160445-5138119264702938884893.log
Picked up JAVA_TOOL_OPTIONS: -Dmaven.ext.class.path="f:\jenkins\jenkins-slave\workspace\ven-box_maven-site-plugin_master@2@2@tmp\withMavena1d9a410\pipeline-maven-spy.jar"
-Dorg.jenkinsci.plugins.pipeline.maven.reportsFolder="f:\jenkins\jenkins-slave\workspace\ven-box_maven-site-plugin_master@2@2@tmp\withMavena1d9a410"

[Pipeline] }
[Pipeline] // dir
[Pipeline] }
[withMaven] artifactsPublisher - Archive artifact windows-jdk7-m3.2.x_build\pom.xml under
org\apache\maven\plugins\maven-site-plugin\3.8.3-SNAPSHOT\maven-site-plugin-3.8.3-SNAPSHOT.pom
[withMaven] artifactsPublisher - Archive artifact windows-jdk7-m3.2.x_build\target\maven-site-plugin-3.8.3-SNAPSHOT.jar
under org\apache\maven\plugins\maven-site-plugin\3.8.3-SNAPSHOT\maven-site-plugin-3.8.3-SNAPSHOT.jar
[withMaven] junitPublisher - Archive test results for Maven artifact org.apache.maven.plugins:maven-site-plugin:maven-plugin:3.8.3-SNAPSHOT
generated by maven-surefire-plugin:test (default-test): windows-jdk7-m3.2.x_build\target\surefire-reports\*.xml
Recording test results
[withMaven] openTasksPublisher - Scan Tasks for Maven artifact org.apache.maven.plugins:maven-site-plugin:maven-plugin:3.8.3-SNAPSHOT
in source directory windows-jdk7-m3.2.x_build\src\main\java
[TASKS] Scanning folder 'f:\jenkins\jenkins-slave\workspace\ven-box_maven-site-plugin_master@2@2'
for files matching the pattern 'windows-jdk7-m3.2.x_build\src\main\java\**\*' - excludes:
null
[TASKS] Found 21 files to scan for tasks
[TASKS] Found 8 open tasks.
Skipping warnings blame since pipelines do not have an SCM link.%n
[TASKS] Computing warning deltas based on reference build #34
[withMaven] invokerPublisher - Archive invoker results for Maven artifact MavenArtifact{org.apache.maven.plugins:maven-site-plugin:maven-plugin:3.8.3-SNAPSHOT(version:
3.8.3-SNAPSHOT, snapshot:false) } generated by PluginInvocation{org.apache.maven.plugins:maven-invoker-plugin:3.1.0@integration-test
 integration-test}: windows-jdk7-m3.2.x_build\target\invoker-reports\*.xml
[withMaven] Publishers: Generated Artifacts Publisher: 100 ms, Junit Publisher: 93 ms, Open
Task Scanner Publisher: 133 ms, Dependencies Fingerprint Publisher: 1 ms, Invoker Publisher:
36021 ms, Pipeline Graph Publisher: 23 ms
[Pipeline] // withMaven
[Pipeline] cleanWs
[WS-CLEANUP] Deleting project workspace...
[WS-CLEANUP] Deferred wipeout is used...
[WS-CLEANUP] done
[Pipeline] }
[Pipeline] // stage
[Pipeline] }
[Pipeline] // ws
[Pipeline] }
[Pipeline] // node
[Pipeline] }
[Pipeline] // parallel
[Pipeline] stage
[Pipeline] { (Notifications)
[Pipeline] echo
Build result: FAILURE
[Pipeline] jiraIssueSelector
[Pipeline] jiraComment
[Pipeline] echo
The authors of changes [hboutemy, tibordigana, rfscholte].
[Pipeline] echo
Sending email ...
[Pipeline] emailext
Mime
  • Unnamed multipart/mixed (inline, None, 0 bytes)
View raw message