maven-notifications mailing list archives

Site index · List index
Message view « Date » · « Thread »
Top « Date » · « Thread »
From Apache Jenkins Server <jenk...@builds.apache.org>
Subject Build unstable in Jenkins: Maven TLP » maven-wagon » master #22
Date Mon, 05 Aug 2019 18:16:02 GMT
See https://builds.apache.org/job/maven-box/job/maven-wagon/job/master/22/

Changes:

* exclude more nodes with MAVEN_OPTS issues
* stop avoiding nodes with MAVEN_OPTS issue
* [INFRA-18734] Jenkins builds fail on email notifications due to unknown
* Scripts not permitted to use staticMethod
* excluded message body from the log message
* NotSerializableException: hudson.plugins.git.GitChangeSetList
* investigating permissions to the call 'ChangeSetList.author'
* NotSerializableException: hudson.plugins.git.GitChangeSetList
* [INFRA-18734] Jenkins builds fail on email notifications due to unknown
* added archives
* added archives fix
* print disk space usage
* sh 'df -hT'
* [INFRA-18734] Jenkins builds fail on email notifications due to unknown
* last() cannot be called on []
* [improvement] currentBuild.changeSets can be referenced as changes
* moved the fix of INFRA-18734 to jenkinsNotify

41 tests failed.
FAILED:  org.apache.maven.wagon.providers.ftp.FtpWagonTest.windows-jdk8 / Build windows-jdk8
/ testPutDirectoryCreation

Error Message:
Failed to bind to address 0.0.0.0/0.0.0.0:10023, check configuration

Stack Trace:
org.apache.ftpserver.FtpServerConfigurationException: Failed to bind to address 0.0.0.0/0.0.0.0:10023,
check configuration
	at org.apache.maven.wagon.providers.ftp.FtpWagonTest.setupWagonTestingFixtures(FtpWagonTest.java:123)
	at org.apache.maven.wagon.providers.ftp.FtpWagonTest.testPutDirectoryCreation(FtpWagonTest.java:212)
Caused by: java.io.IOException: 
Error while binding on 0.0.0.0/0.0.0.0:10023
original message : Address already in use: bind


FAILED:  org.apache.maven.wagon.providers.ftp.FtpWagonTest.windows-jdk8 / Build windows-jdk8
/ testDefaultUserName

Error Message:
Cannot login to remote system

Stack Trace:
org.apache.maven.wagon.ConnectionException: Cannot login to remote system
	at org.apache.maven.wagon.providers.ftp.FtpWagonTest.testDefaultUserName(FtpWagonTest.java:195)
Caused by: org.apache.commons.net.ftp.FTPConnectionClosedException: Connection closed without
indication.
	at org.apache.maven.wagon.providers.ftp.FtpWagonTest.testDefaultUserName(FtpWagonTest.java:195)


FAILED:  org.apache.maven.wagon.providers.ftp.FtpWagonTest.windows-jdk8 / Build windows-jdk8
/ testFailedGetIfNewerToStream

Error Message:
Failed to bind to address 0.0.0.0/0.0.0.0:10023, check configuration

Stack Trace:
org.apache.ftpserver.FtpServerConfigurationException: Failed to bind to address 0.0.0.0/0.0.0.0:10023,
check configuration
	at org.apache.maven.wagon.providers.ftp.FtpWagonTest.setupWagonTestingFixtures(FtpWagonTest.java:123)
Caused by: java.io.IOException: 
Error while binding on 0.0.0.0/0.0.0.0:10023
original message : Address already in use: bind


FAILED:  org.apache.maven.wagon.providers.ftp.FtpWagonTest.windows-jdk8 / Build windows-jdk8
/ testWagonGetIfNewerToStreamIsNewer

Error Message:

  Unexpected method call TransferListener.transferError(TransferEvent[GET|ERROR|Repository[ftp://localhost:10023]|null|test-resource[len
= -1; mod = 0]]):

Stack Trace:
java.lang.AssertionError: 

  Unexpected method call TransferListener.transferError(TransferEvent[GET|ERROR|Repository[ftp://localhost:10023]|null|test-resource[len
= -1; mod = 0]]):


FAILED:  org.apache.maven.wagon.providers.ftp.FtpWagonTest.windows-jdk8 / Build windows-jdk8
/ testWagonGetIfNewerToStreamIsOlder

Error Message:

  Unexpected method call TransferListener.transferError(TransferEvent[PUT|ERROR|Repository[ftp://localhost:10023]|null|test-resource[len
= 18; mod = 1565026432489]]):
    TransferListener.transferStarted(TransferEvent[PUT|STARTED|Repository[ftp://localhost:10023]|F:\jenkins\jenkins-slave\workspace\maven-box_maven-wagon_master@2\m\wagon-providers\wagon-ftp\target\test-output\test-resource|test-resource[len
= 18; mod = 1565026432489]]): expected: 1, actual: 0
    TransferListener.transferCompleted(TransferEvent[PUT|COMPLETED|Repository[ftp://localhost:10023]|F:\jenkins\jenkins-slave\workspace\maven-box_maven-wagon_master@2\m\wagon-providers\wagon-ftp\target\test-output\test-resource|test-resource[len
= 18; mod = 1565026432489]]): expected: 1, actual: 0

Stack Trace:
java.lang.AssertionError: 

  Unexpected method call TransferListener.transferError(TransferEvent[PUT|ERROR|Repository[ftp://localhost:10023]|null|test-resource[len
= 18; mod = 1565026432489]]):
    TransferListener.transferStarted(TransferEvent[PUT|STARTED|Repository[ftp://localhost:10023]|F:\jenkins\jenkins-slave\workspace\maven-box_maven-wagon_master@2\m\wagon-providers\wagon-ftp\target\test-output\test-resource|test-resource[len
= 18; mod = 1565026432489]]): expected: 1, actual: 0
    TransferListener.transferCompleted(TransferEvent[PUT|COMPLETED|Repository[ftp://localhost:10023]|F:\jenkins\jenkins-slave\workspace\maven-box_maven-wagon_master@2\m\wagon-providers\wagon-ftp\target\test-output\test-resource|test-resource[len
= 18; mod = 1565026432489]]): expected: 1, actual: 0


FAILED:  org.apache.maven.wagon.providers.ftp.FtpWagonTest.windows-jdk8 / Build windows-jdk8
/ testStreamingWagon

Error Message:

  Unexpected method call TransferListener.transferError(TransferEvent[PUT|ERROR|Repository[ftp://localhost:10023]|null|test-resource[len
= 18; mod = 1565026433007]]):
    TransferListener.transferStarted(TransferEvent[PUT|STARTED|Repository[ftp://localhost:10023]|F:\jenkins\jenkins-slave\workspace\maven-box_maven-wagon_master@2\m\wagon-providers\wagon-ftp\target\test-output\test-resource|test-resource[len
= 18; mod = 1565026433007]]): expected: 1, actual: 0
    TransferListener.transferCompleted(TransferEvent[PUT|COMPLETED|Repository[ftp://localhost:10023]|F:\jenkins\jenkins-slave\workspace\maven-box_maven-wagon_master@2\m\wagon-providers\wagon-ftp\target\test-output\test-resource|test-resource[len
= 18; mod = 1565026433007]]): expected: 1, actual: 0

Stack Trace:
java.lang.AssertionError: 

  Unexpected method call TransferListener.transferError(TransferEvent[PUT|ERROR|Repository[ftp://localhost:10023]|null|test-resource[len
= 18; mod = 1565026433007]]):
    TransferListener.transferStarted(TransferEvent[PUT|STARTED|Repository[ftp://localhost:10023]|F:\jenkins\jenkins-slave\workspace\maven-box_maven-wagon_master@2\m\wagon-providers\wagon-ftp\target\test-output\test-resource|test-resource[len
= 18; mod = 1565026433007]]): expected: 1, actual: 0
    TransferListener.transferCompleted(TransferEvent[PUT|COMPLETED|Repository[ftp://localhost:10023]|F:\jenkins\jenkins-slave\workspace\maven-box_maven-wagon_master@2\m\wagon-providers\wagon-ftp\target\test-output\test-resource|test-resource[len
= 18; mod = 1565026433007]]): expected: 1, actual: 0


FAILED:  org.apache.maven.wagon.providers.ftp.FtpWagonTest.windows-jdk8 / Build windows-jdk8
/ testWagonGetIfNewerToStreamIsSame

Error Message:

  Unexpected method call TransferListener.transferStarted(TransferEvent[GET|STARTED|Repository[ftp://localhost:10023]|null|test-resource[len
= 18; mod = 1565026380000]]):

Stack Trace:
java.lang.AssertionError: 

  Unexpected method call TransferListener.transferStarted(TransferEvent[GET|STARTED|Repository[ftp://localhost:10023]|null|test-resource[len
= 18; mod = 1565026380000]]):


FAILED:  org.apache.maven.wagon.providers.ftp.FtpWagonTest.windows-jdk8 / Build windows-jdk8
/ testWagonPutDirectoryDeepDestination

Error Message:
Error transferring file via FTP

Stack Trace:
org.apache.maven.wagon.TransferFailedException: Error transferring file via FTP
Caused by: java.net.SocketException: Software caused connection abort: recv failed


FAILED:  org.apache.maven.wagon.providers.ftp.FtpWagonTest.windows-jdk8 / Build windows-jdk8
/ testWagonGetFileListWhenDirectoryDoesNotExist

Error Message:
Could not connect to server.

Stack Trace:
org.apache.maven.wagon.authentication.AuthenticationException: Could not connect to server.
Caused by: java.net.ConnectException: Connection refused: connect


FAILED:  org.apache.maven.wagon.providers.ftp.FtpWagonTest.windows-jdk8 / Build windows-jdk8
/ testWagon

Error Message:
Could not connect to server.

Stack Trace:
org.apache.maven.wagon.authentication.AuthenticationException: Could not connect to server.
Caused by: java.net.ConnectException: Connection refused: connect


FAILED:  org.apache.maven.wagon.providers.ftp.FtpWagonTest.windows-jdk8 / Build windows-jdk8
/ testWagonPutDirectoryForDot

Error Message:
Could not connect to server.

Stack Trace:
org.apache.maven.wagon.authentication.AuthenticationException: Could not connect to server.
Caused by: java.net.ConnectException: Connection refused: connect


FAILED:  org.apache.maven.wagon.providers.ftp.FtpWagonTest.windows-jdk8 / Build windows-jdk8
/ testWagonGetIfNewerIsNewer

Error Message:
Could not connect to server.

Stack Trace:
org.apache.maven.wagon.authentication.AuthenticationException: Could not connect to server.
Caused by: java.net.ConnectException: Connection refused: connect


FAILED:  org.apache.maven.wagon.providers.ftp.FtpWagonTest.windows-jdk8 / Build windows-jdk8
/ testWagonGetIfNewerIsOlder

Error Message:
Could not connect to server.

Stack Trace:
org.apache.maven.wagon.authentication.AuthenticationException: Could not connect to server.
Caused by: java.net.ConnectException: Connection refused: connect


FAILED:  org.apache.maven.wagon.providers.ftp.FtpWagonTest.windows-jdk8 / Build windows-jdk8
/ testWagonGetFileList

Error Message:
Could not connect to server.

Stack Trace:
org.apache.maven.wagon.authentication.AuthenticationException: Could not connect to server.
Caused by: java.net.ConnectException: Connection refused: connect


FAILED:  org.apache.maven.wagon.providers.ftp.FtpWagonTest.windows-jdk8 / Build windows-jdk8
/ testFailedGet

Error Message:
Could not connect to server.

Stack Trace:
org.apache.maven.wagon.authentication.AuthenticationException: Could not connect to server.
Caused by: java.net.ConnectException: Connection refused: connect


FAILED:  org.apache.maven.wagon.providers.ftp.FtpWagonTest.windows-jdk8 / Build windows-jdk8
/ testWagonPutDirectoryWhenDirectoryAlreadyExists

Error Message:
Could not connect to server.

Stack Trace:
org.apache.maven.wagon.authentication.AuthenticationException: Could not connect to server.
Caused by: java.net.ConnectException: Connection refused: connect


FAILED:  org.apache.maven.wagon.providers.ftp.FtpWagonTest.windows-jdk8 / Build windows-jdk8
/ testWagonResourceExists

Error Message:
Could not connect to server.

Stack Trace:
org.apache.maven.wagon.authentication.AuthenticationException: Could not connect to server.
Caused by: java.net.ConnectException: Connection refused: connect


FAILED:  org.apache.maven.wagon.providers.ftp.FtpWagonTest.windows-jdk8 / Build windows-jdk8
/ testFailedGetIfNewer

Error Message:
Could not connect to server.

Stack Trace:
org.apache.maven.wagon.authentication.AuthenticationException: Could not connect to server.
Caused by: java.net.ConnectException: Connection refused: connect


FAILED:  org.apache.maven.wagon.providers.ftp.FtpWagonTest.windows-jdk8 / Build windows-jdk8
/ testWagonResourceNotExists

Error Message:
Could not connect to server.

Stack Trace:
org.apache.maven.wagon.authentication.AuthenticationException: Could not connect to server.
Caused by: java.net.ConnectException: Connection refused: connect


FAILED:  org.apache.maven.wagon.providers.ftp.FtpWagonTest.windows-jdk8 / Build windows-jdk8
/ testWagonPutDirectory

Error Message:
Could not connect to server.

Stack Trace:
org.apache.maven.wagon.authentication.AuthenticationException: Could not connect to server.
Caused by: java.net.ConnectException: Connection refused: connect


FAILED:  org.apache.maven.wagon.providers.ftp.FtpWagonTest.windows-jdk8 / Build windows-jdk8
/ testWagonGetIfNewerIsSame

Error Message:
Could not connect to server.

Stack Trace:
org.apache.maven.wagon.authentication.AuthenticationException: Could not connect to server.
Caused by: java.net.ConnectException: Connection refused: connect


FAILED:  org.apache.maven.wagon.providers.ftp.FtpWagonTest.windows-jdk7 / Build windows-jdk7
/ testDefaultUserName

Error Message:
Cannot login to remote system

Stack Trace:
org.apache.maven.wagon.ConnectionException: Cannot login to remote system
	at org.apache.maven.wagon.providers.ftp.FtpWagonTest.testDefaultUserName(FtpWagonTest.java:195)
Caused by: org.apache.commons.net.ftp.FTPConnectionClosedException: Connection closed without
indication.
	at org.apache.maven.wagon.providers.ftp.FtpWagonTest.testDefaultUserName(FtpWagonTest.java:195)


FAILED:  org.apache.maven.wagon.providers.http.HttpWagonTimeoutTest.windows-jdk7 / Build windows-jdk7
/ testGetTimeout

Error Message:
Address already in use: bind

Stack Trace:
java.net.BindException: Address already in use: bind
	at org.apache.maven.wagon.providers.http.HttpWagonTimeoutTest.setUp(HttpWagonTimeoutTest.java:45)


FAILED:  org.apache.maven.wagon.providers.http.HttpWagonTimeoutTest.windows-jdk7 / Build windows-jdk7
/ testConnectionTimeout

Error Message:
Address already in use: bind

Stack Trace:
java.net.BindException: Address already in use: bind
	at org.apache.maven.wagon.providers.http.HttpWagonTimeoutTest.setUp(HttpWagonTimeoutTest.java:45)


FAILED:  org.apache.maven.wagon.providers.http.HttpWagonTimeoutTest.windows-jdk7 / Build windows-jdk7
/ testGetFileList

Error Message:
Address already in use: bind

Stack Trace:
java.net.BindException: Address already in use: bind
	at org.apache.maven.wagon.providers.http.HttpWagonTimeoutTest.setUp(HttpWagonTimeoutTest.java:45)


FAILED:  org.apache.maven.wagon.providers.ftp.FtpWagonTest.windows-jdk11 / Build windows-jdk11
/ testDefaultUserName

Error Message:
Cannot login to remote system

Stack Trace:
org.apache.maven.wagon.ConnectionException: Cannot login to remote system
	at org.apache.maven.wagon.providers.ftp.FtpWagonTest.testDefaultUserName(FtpWagonTest.java:195)
Caused by: org.apache.commons.net.ftp.FTPConnectionClosedException: Connection closed without
indication.
	at org.apache.maven.wagon.providers.ftp.FtpWagonTest.testDefaultUserName(FtpWagonTest.java:195)


FAILED:  org.apache.maven.wagon.providers.ftp.FtpWagonTest.windows-jdk11 / Build windows-jdk11
/ testWagonPutDirectoryDeepDestination

Error Message:
Failed to bind to address 0.0.0.0/0.0.0.0:10023, check configuration

Stack Trace:
org.apache.ftpserver.FtpServerConfigurationException: Failed to bind to address 0.0.0.0/0.0.0.0:10023,
check configuration
	at org.apache.maven.wagon.providers.ftp.FtpWagonTest.setupWagonTestingFixtures(FtpWagonTest.java:123)
Caused by: java.io.IOException: 
Error while binding on 0.0.0.0/0.0.0.0:10023
original message : Address already in use: bind


FAILED:  org.apache.maven.wagon.providers.ftp.FtpWagonTest.windows-jdk11 / Build windows-jdk11
/ testWagon

Error Message:
Failed to bind to address 0.0.0.0/0.0.0.0:10023, check configuration

Stack Trace:
org.apache.ftpserver.FtpServerConfigurationException: Failed to bind to address 0.0.0.0/0.0.0.0:10023,
check configuration
	at org.apache.maven.wagon.providers.ftp.FtpWagonTest.setupWagonTestingFixtures(FtpWagonTest.java:123)
Caused by: java.io.IOException: 
Error while binding on 0.0.0.0/0.0.0.0:10023
original message : Address already in use: bind


FAILED:  org.apache.maven.wagon.providers.ftp.FtpWagonTest.windows-jdk11 / Build windows-jdk11
/ testWagonPutDirectoryForDot

Error Message:
IOException caught while processing path at F:\jenkins\jenkins-slave\workspace\maven-box_maven-wagon_master@3\m\wagon-providers\wagon-ftp\target\test-output\dot-repo\a\b

Stack Trace:
org.apache.maven.wagon.TransferFailedException: IOException caught while processing path at
F:\jenkins\jenkins-slave\workspace\maven-box_maven-wagon_master@3\m\wagon-providers\wagon-ftp\target\test-output\dot-repo\a\b
Caused by: org.apache.commons.net.ftp.FTPConnectionClosedException: Connection closed without
indication.


FAILED:  org.apache.maven.wagon.providers.ftp.FtpWagonTest.windows-jdk11 / Build windows-jdk11
/ testWagonGetIfNewerIsNewer

Error Message:
Cannot login to remote system

Stack Trace:
org.apache.maven.wagon.ConnectionException: Cannot login to remote system
Caused by: org.apache.commons.net.ftp.FTPConnectionClosedException: Connection closed without
indication.


FAILED:  org.apache.maven.wagon.providers.ftp.FtpWagonTest.windows-jdk11 / Build windows-jdk11
/ testWagonGetIfNewerIsOlder

Error Message:

  Unexpected method call TransferListener.transferStarted(TransferEvent[GET|STARTED|Repository[ftp://localhost:10023]|F:\jenkins\jenkins-slave\workspace\maven-box_maven-wagon_master@3\m\wagon-providers\wagon-ftp\target\test-output\testWagonGetIfNewerIsOlder\testWagonGetIfNewerIsOlder|test-resource[len
= 18; mod = 1565026380000]]):
    TransferListener.transferStarted(TransferEvent[GET|STARTED|Repository[ftp://localhost:10023]|null|test-resource[len
= 18; mod = 0]]): expected: 1, actual: 0
    TransferListener.transferCompleted(TransferEvent[GET|COMPLETED|Repository[ftp://localhost:10023]|F:\jenkins\jenkins-slave\workspace\maven-box_maven-wagon_master@3\m\wagon-providers\wagon-ftp\target\test-output\testWagonGetIfNewerIsOlder\testWagonGetIfNewerIsOlder|test-resource[len
= 18; mod = 0]]): expected: 1, actual: 0

Stack Trace:
java.lang.AssertionError: 

  Unexpected method call TransferListener.transferStarted(TransferEvent[GET|STARTED|Repository[ftp://localhost:10023]|F:\jenkins\jenkins-slave\workspace\maven-box_maven-wagon_master@3\m\wagon-providers\wagon-ftp\target\test-output\testWagonGetIfNewerIsOlder\testWagonGetIfNewerIsOlder|test-resource[len
= 18; mod = 1565026380000]]):
    TransferListener.transferStarted(TransferEvent[GET|STARTED|Repository[ftp://localhost:10023]|null|test-resource[len
= 18; mod = 0]]): expected: 1, actual: 0
    TransferListener.transferCompleted(TransferEvent[GET|COMPLETED|Repository[ftp://localhost:10023]|F:\jenkins\jenkins-slave\workspace\maven-box_maven-wagon_master@3\m\wagon-providers\wagon-ftp\target\test-output\testWagonGetIfNewerIsOlder\testWagonGetIfNewerIsOlder|test-resource[len
= 18; mod = 0]]): expected: 1, actual: 0


FAILED:  org.apache.maven.wagon.providers.ftp.FtpWagonTest.windows-jdk11 / Build windows-jdk11
/ testWagonGetFileList

Error Message:

  Unexpected method call TransferListener.transferError(TransferEvent[PUT|ERROR|Repository[ftp://localhost:10023]|null|file-list/.index.txt[len
= 11; mod = 1565026432902]]):
    TransferListener.transferStarted(TransferEvent[PUT|STARTED|Repository[ftp://localhost:10023]|F:\jenkins\jenkins-slave\workspace\maven-box_maven-wagon_master@3\m\wagon-providers\wagon-ftp\target\test-output\file-list\.index.txt|file-list/.index.txt[len
= 11; mod = 1565026432902]]): expected: 1, actual: 0
    TransferListener.transferCompleted(TransferEvent[PUT|COMPLETED|Repository[ftp://localhost:10023]|F:\jenkins\jenkins-slave\workspace\maven-box_maven-wagon_master@3\m\wagon-providers\wagon-ftp\target\test-output\file-list\.index.txt|file-list/.index.txt[len
= 11; mod = 1565026432902]]): expected: 1, actual: 0

Stack Trace:
java.lang.AssertionError: 

  Unexpected method call TransferListener.transferError(TransferEvent[PUT|ERROR|Repository[ftp://localhost:10023]|null|file-list/.index.txt[len
= 11; mod = 1565026432902]]):
    TransferListener.transferStarted(TransferEvent[PUT|STARTED|Repository[ftp://localhost:10023]|F:\jenkins\jenkins-slave\workspace\maven-box_maven-wagon_master@3\m\wagon-providers\wagon-ftp\target\test-output\file-list\.index.txt|file-list/.index.txt[len
= 11; mod = 1565026432902]]): expected: 1, actual: 0
    TransferListener.transferCompleted(TransferEvent[PUT|COMPLETED|Repository[ftp://localhost:10023]|F:\jenkins\jenkins-slave\workspace\maven-box_maven-wagon_master@3\m\wagon-providers\wagon-ftp\target\test-output\file-list\.index.txt|file-list/.index.txt[len
= 11; mod = 1565026432902]]): expected: 1, actual: 0


FAILED:  org.apache.maven.wagon.providers.ftp.FtpWagonTest.windows-jdk11 / Build windows-jdk11
/ testFailedGet

Error Message:
Could not connect to server.

Stack Trace:
org.apache.maven.wagon.authentication.AuthenticationException: Could not connect to server.
Caused by: java.net.ConnectException: Connection refused: connect


FAILED:  org.apache.maven.wagon.providers.ftp.FtpWagonTest.windows-jdk11 / Build windows-jdk11
/ testWagonPutDirectoryWhenDirectoryAlreadyExists

Error Message:
Could not connect to server.

Stack Trace:
org.apache.maven.wagon.authentication.AuthenticationException: Could not connect to server.
Caused by: java.net.ConnectException: Connection refused: connect


FAILED:  org.apache.maven.wagon.providers.ftp.FtpWagonTest.windows-jdk11 / Build windows-jdk11
/ testWagonResourceExists

Error Message:
Could not connect to server.

Stack Trace:
org.apache.maven.wagon.authentication.AuthenticationException: Could not connect to server.
Caused by: java.net.ConnectException: Connection refused: connect


FAILED:  org.apache.maven.wagon.providers.ftp.FtpWagonTest.windows-jdk11 / Build windows-jdk11
/ testFailedGetIfNewer

Error Message:
Could not connect to server.

Stack Trace:
org.apache.maven.wagon.authentication.AuthenticationException: Could not connect to server.
Caused by: java.net.ConnectException: Connection refused: connect


FAILED:  org.apache.maven.wagon.providers.ftp.FtpWagonTest.windows-jdk11 / Build windows-jdk11
/ testWagonResourceNotExists

Error Message:
Could not connect to server.

Stack Trace:
org.apache.maven.wagon.authentication.AuthenticationException: Could not connect to server.
Caused by: java.net.ConnectException: Connection refused: connect


FAILED:  org.apache.maven.wagon.providers.ftp.FtpWagonTest.windows-jdk11 / Build windows-jdk11
/ testWagonPutDirectory

Error Message:
Could not connect to server.

Stack Trace:
org.apache.maven.wagon.authentication.AuthenticationException: Could not connect to server.
Caused by: java.net.ConnectException: Connection refused: connect


FAILED:  org.apache.maven.wagon.providers.ftp.FtpWagonTest.windows-jdk11 / Build windows-jdk11
/ testWagonGetIfNewerIsSame

Error Message:
Could not connect to server.

Stack Trace:
org.apache.maven.wagon.authentication.AuthenticationException: Could not connect to server.
Caused by: java.net.ConnectException: Connection refused: connect


FAILED:  org.apache.maven.wagon.providers.http.HttpWagonTimeoutTest.windows-jdk11 / Build
windows-jdk11 / testConnectionTimeout

Error Message:
Address already in use: bind

Stack Trace:
java.net.BindException: Address already in use: bind
	at org.apache.maven.wagon.providers.http.HttpWagonTimeoutTest.setUp(HttpWagonTimeoutTest.java:45)


FAILED:  org.apache.maven.wagon.providers.http.HttpWagonTimeoutTest.windows-jdk11 / Build
windows-jdk11 / testGetFileList

Error Message:
Address already in use: bind

Stack Trace:
java.net.BindException: Address already in use: bind
	at org.apache.maven.wagon.providers.http.HttpWagonTimeoutTest.setUp(HttpWagonTimeoutTest.java:45)




Build log:
[...truncated 27559 lines...]
[INFO] --- maven-enforcer-plugin:3.0.0-M2:enforce (enforce-bytecode-version) @ wagon-ssh ---
[INFO] 
[INFO] --- maven-enforcer-plugin:3.0.0-M2:enforce (ban-known-bad-maven-versions) @ wagon-ssh
---
[INFO] 
[INFO] --- maven-enforcer-plugin:3.0.0-M2:enforce (default) @ wagon-ssh ---
[INFO] 
[INFO] --- apache-rat-plugin:0.12:check (rat-check) @ wagon-ssh ---
[INFO] Enabled default license matchers.
[INFO] Will parse SCM ignores for exclusions...
[INFO] Finished adding exclusions from SCM ignore files.
[INFO] 61 implicit excludes (use -debug for more details).
[INFO] Exclude: .checkstyle
[INFO] Exclude: **/*.odg
[INFO] Exclude: src/test/resources/**
[INFO] Exclude: src/main/resources/default-server-root/**
[INFO] Exclude: src/main/resources/ssh-keys/**
[INFO] Exclude: src/test/ssh-keys/**
[INFO] Exclude: .repository/**
[INFO] Exclude: out/**
[INFO] Exclude: .repository/**
[INFO] Exclude: .maven/spy.log
[INFO] Exclude: dependency-reduced-pom.xml
[INFO] Exclude: .java-version
[INFO] 19 resources included (use -debug for more details)
[INFO] Rat check: Summary over all files. Unapproved: 0, unknown: 0, generated: 0, approved:
19 licenses.
[INFO] 
[INFO] --- maven-remote-resources-plugin:1.5:process (process-resource-bundles) @ wagon-ssh
---
[INFO] 
[INFO] --- maven-resources-plugin:3.1.0:resources (default-resources) @ wagon-ssh ---
[INFO] Using 'UTF-8' encoding to copy filtered resources.
[INFO] skip non existing resourceDirectory /home/jenkins/jenkins-slave/workspace/maven-box_maven-wagon_master/m/wagon-providers/wagon-ssh/src/main/resources
[INFO] Copying 3 resources
[INFO] 
[INFO] --- maven-compiler-plugin:3.7.0:compile (default-compile) @ wagon-ssh ---
[INFO] Changes detected - recompiling the module!
[INFO] Compiling 7 source files to /home/jenkins/jenkins-slave/workspace/maven-box_maven-wagon_master/m/wagon-providers/wagon-ssh/target/classes
[INFO] 
[INFO] --- plexus-component-metadata:1.7.1:generate-metadata (generate) @ wagon-ssh ---
[INFO] Discovered 4 component descriptors(s)
[INFO] 
[INFO] --- animal-sniffer-maven-plugin:1.15:check (check-java-1.7-compat) @ wagon-ssh ---
[INFO] Checking unresolved references to org.codehaus.mojo.signature:java17:1.0
[INFO] 
[INFO] --- maven-resources-plugin:3.1.0:testResources (default-testResources) @ wagon-ssh
---
[INFO] Using 'UTF-8' encoding to copy filtered resources.
[INFO] Copying 6 resources
[INFO] Copying 3 resources
[INFO] 
[INFO] --- maven-compiler-plugin:3.7.0:testCompile (default-testCompile) @ wagon-ssh ---
[INFO] Changes detected - recompiling the module!
[INFO] Compiling 8 source files to /home/jenkins/jenkins-slave/workspace/maven-box_maven-wagon_master/m/wagon-providers/wagon-ssh/target/test-classes
[INFO] /home/jenkins/jenkins-slave/workspace/maven-box_maven-wagon_master/m/wagon-providers/wagon-ssh/src/test/java/org/apache/maven/wagon/providers/ssh/jsch/ScpWagonWithSshPrivateKeySearchTest.java:
/home/jenkins/jenkins-slave/workspace/maven-box_maven-wagon_master/m/wagon-providers/wagon-ssh/src/test/java/org/apache/maven/wagon/providers/ssh/jsch/ScpWagonWithSshPrivateKeySearchTest.java
uses or overrides a deprecated API.
[INFO] /home/jenkins/jenkins-slave/workspace/maven-box_maven-wagon_master/m/wagon-providers/wagon-ssh/src/test/java/org/apache/maven/wagon/providers/ssh/jsch/ScpWagonWithSshPrivateKeySearchTest.java:
Recompile with -Xlint:deprecation for details.
[INFO] 
[INFO] --- maven-surefire-plugin:2.20:test (default-test) @ wagon-ssh ---
[INFO] 
[INFO] --- maven-jar-plugin:3.1.0:jar (default-jar) @ wagon-ssh ---
[INFO] Building jar: /home/jenkins/jenkins-slave/workspace/maven-box_maven-wagon_master/m/wagon-providers/wagon-ssh/target/wagon-ssh-3.3.4-SNAPSHOT.jar
[INFO] 
[INFO] --- maven-site-plugin:3.7.1:attach-descriptor (attach-descriptor) @ wagon-ssh ---
[INFO] Skipping because packaging 'jar' is not pom.
[INFO] 
[INFO] --- maven-checkstyle-plugin:3.0.0:check (checkstyle-check) @ wagon-ssh ---
[INFO] There is 1 error reported by Checkstyle 6.18 with config/maven_checks.xml ruleset.
[INFO] Ignored 1 error, 0 violation remaining.
[INFO] 
[INFO] -----------< org.apache.maven.wagon:wagon-webdav-jackrabbit >-----------
[INFO] Building Apache Maven Wagon :: Providers :: WebDAV Provider 3.3.4-SNAPSHOT [17/17]
[INFO] --------------------------------[ jar ]---------------------------------
[INFO] Downloading from central: https://repo.maven.apache.org/maven2/org/apache/jackrabbit/jackrabbit-webdav/2.14.4/jackrabbit-webdav-2.14.4.pom
[INFO] Downloaded from central: https://repo.maven.apache.org/maven2/org/apache/jackrabbit/jackrabbit-webdav/2.14.4/jackrabbit-webdav-2.14.4.pom
(4.0 kB at 264 kB/s)
[INFO] Downloading from central: https://repo.maven.apache.org/maven2/org/apache/jackrabbit/jackrabbit-parent/2.14.4/jackrabbit-parent-2.14.4.pom
[INFO] Downloaded from central: https://repo.maven.apache.org/maven2/org/apache/jackrabbit/jackrabbit-parent/2.14.4/jackrabbit-parent-2.14.4.pom
(35 kB at 2.5 MB/s)
[INFO] Downloading from central: https://repo.maven.apache.org/maven2/commons-codec/commons-codec/1.10/commons-codec-1.10.pom
[INFO] Downloaded from central: https://repo.maven.apache.org/maven2/commons-codec/commons-codec/1.10/commons-codec-1.10.pom
(12 kB at 1.1 MB/s)
[INFO] Downloading from central: https://repo.maven.apache.org/maven2/org/apache/commons/commons-parent/35/commons-parent-35.pom
[INFO] Downloaded from central: https://repo.maven.apache.org/maven2/org/apache/commons/commons-parent/35/commons-parent-35.pom
(58 kB at 2.5 MB/s)
[INFO] Downloading from central: https://repo.maven.apache.org/maven2/it/could/webdav/0.4/webdav-0.4.pom
[INFO] Downloaded from central: https://repo.maven.apache.org/maven2/it/could/webdav/0.4/webdav-0.4.pom
(1.1 kB at 82 kB/s)
[INFO] Downloading from central: https://repo.maven.apache.org/maven2/biz/aQute/bnd/1.50.0/bnd-1.50.0.pom
[INFO] Downloaded from central: https://repo.maven.apache.org/maven2/biz/aQute/bnd/1.50.0/bnd-1.50.0.pom
(1.3 kB at 106 kB/s)
[INFO] Downloading from central: https://repo.maven.apache.org/maven2/org/apache/jackrabbit/jackrabbit-webdav/2.14.4/jackrabbit-webdav-2.14.4.jar
[INFO] Downloading from central: https://repo.maven.apache.org/maven2/biz/aQute/bnd/1.50.0/bnd-1.50.0.jar
[INFO] Downloading from central: https://repo.maven.apache.org/maven2/javax/servlet/servlet-api/2.3/servlet-api-2.3.jar
[INFO] Downloading from central: https://repo.maven.apache.org/maven2/it/could/webdav/0.4/webdav-0.4.jar
[INFO] Downloading from central: https://repo.maven.apache.org/maven2/commons-codec/commons-codec/1.10/commons-codec-1.10.jar
[INFO] Downloaded from central: https://repo.maven.apache.org/maven2/javax/servlet/servlet-api/2.3/servlet-api-2.3.jar
(78 kB at 4.3 MB/s)
[INFO] Downloaded from central: https://repo.maven.apache.org/maven2/it/could/webdav/0.4/webdav-0.4.jar
(103 kB at 5.4 MB/s)
[INFO] Downloaded from central: https://repo.maven.apache.org/maven2/commons-codec/commons-codec/1.10/commons-codec-1.10.jar
(284 kB at 15 MB/s)
[INFO] Downloaded from central: https://repo.maven.apache.org/maven2/org/apache/jackrabbit/jackrabbit-webdav/2.14.4/jackrabbit-webdav-2.14.4.jar
(365 kB at 14 MB/s)
[INFO] Downloaded from central: https://repo.maven.apache.org/maven2/biz/aQute/bnd/1.50.0/bnd-1.50.0.jar
(828 kB at 24 MB/s)
[INFO] 
[INFO] --- maven-clean-plugin:3.1.0:clean (default-clean) @ wagon-webdav-jackrabbit ---
[INFO] 
[INFO] --- maven-enforcer-plugin:3.0.0-M2:enforce (enforce-maven-version) @ wagon-webdav-jackrabbit
---
[INFO] 
[INFO] --- maven-enforcer-plugin:3.0.0-M2:enforce (enforce-bytecode-version) @ wagon-webdav-jackrabbit
---
[INFO] 
[INFO] --- maven-enforcer-plugin:3.0.0-M2:enforce (ban-known-bad-maven-versions) @ wagon-webdav-jackrabbit
---
[INFO] 
[INFO] --- maven-enforcer-plugin:3.0.0-M2:enforce (default) @ wagon-webdav-jackrabbit ---
[INFO] 
[INFO] --- apache-rat-plugin:0.12:check (rat-check) @ wagon-webdav-jackrabbit ---
[INFO] Enabled default license matchers.
[INFO] Will parse SCM ignores for exclusions...
[INFO] Finished adding exclusions from SCM ignore files.
[INFO] 61 implicit excludes (use -debug for more details).
[INFO] Exclude: .checkstyle
[INFO] Exclude: **/*.odg
[INFO] Exclude: src/test/resources/**
[INFO] Exclude: src/main/resources/default-server-root/**
[INFO] Exclude: src/main/resources/ssh-keys/**
[INFO] Exclude: src/test/ssh-keys/**
[INFO] Exclude: .repository/**
[INFO] Exclude: out/**
[INFO] Exclude: .repository/**
[INFO] Exclude: .maven/spy.log
[INFO] Exclude: dependency-reduced-pom.xml
[INFO] Exclude: .java-version
[INFO] 12 resources included (use -debug for more details)
[INFO] Rat check: Summary over all files. Unapproved: 0, unknown: 0, generated: 0, approved:
12 licenses.
[INFO] 
[INFO] --- maven-remote-resources-plugin:1.5:process (process-resource-bundles) @ wagon-webdav-jackrabbit
---
[INFO] 
[INFO] --- maven-resources-plugin:3.1.0:resources (default-resources) @ wagon-webdav-jackrabbit
---
[INFO] Using 'UTF-8' encoding to copy filtered resources.
[INFO] Copying 1 resource
[INFO] Copying 3 resources
[INFO] 
[INFO] --- maven-compiler-plugin:3.7.0:compile (default-compile) @ wagon-webdav-jackrabbit
---
[INFO] Changes detected - recompiling the module!
[INFO] Compiling 4 source files to /home/jenkins/jenkins-slave/workspace/maven-box_maven-wagon_master/m/wagon-providers/wagon-webdav-jackrabbit/target/classes
[INFO] /home/jenkins/jenkins-slave/workspace/maven-box_maven-wagon_master/m/wagon-providers/wagon-webdav-jackrabbit/src/main/java/org/apache/maven/wagon/providers/webdav/WebDavWagon.java:
/home/jenkins/jenkins-slave/workspace/maven-box_maven-wagon_master/m/wagon-providers/wagon-webdav-jackrabbit/src/main/java/org/apache/maven/wagon/providers/webdav/WebDavWagon.java
uses or overrides a deprecated API.
[INFO] /home/jenkins/jenkins-slave/workspace/maven-box_maven-wagon_master/m/wagon-providers/wagon-webdav-jackrabbit/src/main/java/org/apache/maven/wagon/providers/webdav/WebDavWagon.java:
Recompile with -Xlint:deprecation for details.
[INFO] 
[INFO] --- plexus-component-metadata:1.7.1:generate-metadata (generate) @ wagon-webdav-jackrabbit
---
[INFO] Discovered 1 component descriptors(s)
[INFO] 
[INFO] --- animal-sniffer-maven-plugin:1.15:check (check-java-1.7-compat) @ wagon-webdav-jackrabbit
---
[INFO] Checking unresolved references to org.codehaus.mojo.signature:java17:1.0
[INFO] 
[INFO] --- maven-resources-plugin:3.1.0:testResources (default-testResources) @ wagon-webdav-jackrabbit
---
[INFO] Using 'UTF-8' encoding to copy filtered resources.
[INFO] Copying 2 resources
[INFO] Copying 3 resources
[INFO] 
[INFO] --- maven-compiler-plugin:3.7.0:testCompile (default-testCompile) @ wagon-webdav-jackrabbit
---
[INFO] Changes detected - recompiling the module!
[INFO] Compiling 4 source files to /home/jenkins/jenkins-slave/workspace/maven-box_maven-wagon_master/m/wagon-providers/wagon-webdav-jackrabbit/target/test-classes
[INFO] /home/jenkins/jenkins-slave/workspace/maven-box_maven-wagon_master/m/wagon-providers/wagon-webdav-jackrabbit/src/test/java/org/apache/maven/wagon/providers/webdav/HttpClientWagonTest.java:
/home/jenkins/jenkins-slave/workspace/maven-box_maven-wagon_master/m/wagon-providers/wagon-webdav-jackrabbit/src/test/java/org/apache/maven/wagon/providers/webdav/HttpClientWagonTest.java
uses or overrides a deprecated API.
[INFO] /home/jenkins/jenkins-slave/workspace/maven-box_maven-wagon_master/m/wagon-providers/wagon-webdav-jackrabbit/src/test/java/org/apache/maven/wagon/providers/webdav/HttpClientWagonTest.java:
Recompile with -Xlint:deprecation for details.
[INFO] 
[INFO] --- maven-surefire-plugin:2.20:test (default-test) @ wagon-webdav-jackrabbit ---
[INFO] 
[INFO] -------------------------------------------------------
[INFO]  T E S T S
[INFO] -------------------------------------------------------
[INFO] Running org.apache.maven.wagon.providers.webdav.HttpClientWagonTest
[INFO] Tests run: 6, Failures: 0, Errors: 0, Skipped: 0, Time elapsed: 0.437 s - in org.apache.maven.wagon.providers.webdav.HttpClientWagonTest
[INFO] Running org.apache.maven.wagon.providers.webdav.PathNavigatorTest
[INFO] Tests run: 1, Failures: 0, Errors: 0, Skipped: 0, Time elapsed: 0.013 s - in org.apache.maven.wagon.providers.webdav.PathNavigatorTest
[INFO] Running org.apache.maven.wagon.providers.webdav.WebDavsWagonTest
[INFO] Tests run: 69, Failures: 0, Errors: 0, Skipped: 0, Time elapsed: 29.388 s - in org.apache.maven.wagon.providers.webdav.WebDavsWagonTest
[INFO] Running org.apache.maven.wagon.providers.webdav.WebDavWagonTest
[INFO] Tests run: 69, Failures: 0, Errors: 0, Skipped: 0, Time elapsed: 25.223 s - in org.apache.maven.wagon.providers.webdav.WebDavWagonTest
[INFO] 
[INFO] Results:
[INFO] 
[INFO] Tests run: 145, Failures: 0, Errors: 0, Skipped: 0
[INFO] 
[INFO] 
[INFO] --- maven-jar-plugin:3.1.0:jar (default-jar) @ wagon-webdav-jackrabbit ---
[INFO] Building jar: /home/jenkins/jenkins-slave/workspace/maven-box_maven-wagon_master/m/wagon-providers/wagon-webdav-jackrabbit/target/wagon-webdav-jackrabbit-3.3.4-SNAPSHOT.jar
[INFO] 
[INFO] --- maven-site-plugin:3.7.1:attach-descriptor (attach-descriptor) @ wagon-webdav-jackrabbit
---
[INFO] Skipping because packaging 'jar' is not pom.
[INFO] 
[INFO] --- maven-checkstyle-plugin:3.0.0:check (checkstyle-check) @ wagon-webdav-jackrabbit
---
[INFO] ------------------------------------------------------------------------
[INFO] Reactor Summary for Apache Maven Wagon 3.3.4-SNAPSHOT:
[INFO] 
[INFO] Apache Maven Wagon ................................. SUCCESS [ 14.540 s]
[INFO] Apache Maven Wagon :: API .......................... SUCCESS [  6.993 s]
[INFO] Apache Maven Wagon :: Provider Test ................ SUCCESS [  2.724 s]
[INFO] Apache Maven Wagon :: Providers .................... SUCCESS [  0.711 s]
[INFO] Apache Maven Wagon :: Providers :: File Provider ... SUCCESS [  2.144 s]
[INFO] Apache Maven Wagon :: Providers :: FTP Provider .... SUCCESS [  7.140 s]
[INFO] Apache Maven Wagon :: Providers :: HTTP Shared Library SUCCESS [  3.030 s]
[INFO] Apache Maven Wagon :: Test Compatibility Kits ...... SUCCESS [  0.548 s]
[INFO] Apache Maven Wagon :: HTTP Test Compatibility Kit .. SUCCESS [  1.186 s]
[INFO] Apache Maven Wagon :: Providers :: HTTP Provider ... SUCCESS [04:49 min]
[INFO] Apache Maven Wagon :: Providers :: Lightweight HTTP Provider SUCCESS [02:03 min]
[INFO] Apache Maven Wagon :: Providers :: SCM Provider .... SUCCESS [ 14.702 s]
[INFO] Apache Maven Wagon :: Providers :: SSH Common Library SUCCESS [  1.639 s]
[INFO] Apache Maven Wagon :: Providers :: SSH Common Tests  SUCCESS [  1.386 s]
[INFO] Apache Maven Wagon :: Providers :: SSH External Provider SUCCESS [  0.777 s]
[INFO] Apache Maven Wagon :: Providers :: SSH Provider .... SUCCESS [  1.451 s]
[INFO] Apache Maven Wagon :: Providers :: WebDAV Provider . SUCCESS [ 56.917 s]
[INFO] ------------------------------------------------------------------------
[INFO] BUILD SUCCESS
[INFO] ------------------------------------------------------------------------
[INFO] Total time:  08:50 min
[INFO] Finished at: 2019-08-05T18:15:25Z
[INFO] ------------------------------------------------------------------------
[WARNING] The requested profile "run-its" could not be activated because it does not exist.
[INFO] [jenkins-event-spy] Generated /home/jenkins/jenkins-slave/workspace/maven-box_maven-wagon_master@tmp/withMaven95f3d067/maven-spy-20190805-180634-2614584527514581793065.log
[Pipeline] }
[Pipeline] // dir
[Pipeline] }
[withMaven] junitPublisher - Archive test results for Maven artifact org.apache.maven.wagon:wagon-provider-api:jar:3.3.4-SNAPSHOT
generated by maven-surefire-plugin:test (default-test): m/wagon-provider-api/target/surefire-reports/*.xml
[withMaven] junitPublisher - Archive test results for Maven artifact org.apache.maven.wagon:wagon-provider-test:jar:3.3.4-SNAPSHOT
generated by maven-surefire-plugin:test (default-test): m/wagon-provider-test/target/surefire-reports/*.xml
[withMaven] junitPublisher - Archive test results for Maven artifact org.apache.maven.wagon:wagon-file:jar:3.3.4-SNAPSHOT
generated by maven-surefire-plugin:test (default-test): m/wagon-providers/wagon-file/target/surefire-reports/*.xml
[withMaven] junitPublisher - Archive test results for Maven artifact org.apache.maven.wagon:wagon-ftp:jar:3.3.4-SNAPSHOT
generated by maven-surefire-plugin:test (default-test): m/wagon-providers/wagon-ftp/target/surefire-reports/*.xml
[withMaven] junitPublisher - Archive test results for Maven artifact org.apache.maven.wagon:wagon-http-shared:jar:3.3.4-SNAPSHOT
generated by maven-surefire-plugin:test (default-test): m/wagon-providers/wagon-http-shared/target/surefire-reports/*.xml
[withMaven] junitPublisher - Archive test results for Maven artifact org.apache.maven.wagon:wagon-tck-http:jar:3.3.4-SNAPSHOT
generated by maven-surefire-plugin:test (default-test): m/wagon-tcks/wagon-tck-http/target/surefire-reports/*.xml
[withMaven] junitPublisher - Archive test results for Maven artifact org.apache.maven.wagon:wagon-http:jar:3.3.4-SNAPSHOT
generated by maven-surefire-plugin:test (default-test): m/wagon-providers/wagon-http/target/surefire-reports/*.xml
[withMaven] junitPublisher - Archive test results for Maven artifact org.apache.maven.wagon:wagon-http-lightweight:jar:3.3.4-SNAPSHOT
generated by maven-surefire-plugin:test (default-test): m/wagon-providers/wagon-http-lightweight/target/surefire-reports/*.xml
[withMaven] junitPublisher - Archive test results for Maven artifact org.apache.maven.wagon:wagon-scm:jar:3.3.4-SNAPSHOT
generated by maven-surefire-plugin:test (default-test): m/wagon-providers/wagon-scm/target/surefire-reports/*.xml
[withMaven] junitPublisher - Archive test results for Maven artifact org.apache.maven.wagon:wagon-ssh-common:jar:3.3.4-SNAPSHOT
generated by maven-surefire-plugin:test (default-test): m/wagon-providers/wagon-ssh-common/target/surefire-reports/*.xml
[withMaven] junitPublisher - Archive test results for Maven artifact org.apache.maven.wagon:wagon-ssh-common-test:jar:3.3.4-SNAPSHOT
generated by maven-surefire-plugin:test (default-test): m/wagon-providers/wagon-ssh-common-test/target/surefire-reports/*.xml
[withMaven] junitPublisher - Archive test results for Maven artifact org.apache.maven.wagon:wagon-ssh-external:jar:3.3.4-SNAPSHOT
generated by maven-surefire-plugin:test (default-test): m/wagon-providers/wagon-ssh-external/target/surefire-reports/*.xml
[withMaven] junitPublisher - Archive test results for Maven artifact org.apache.maven.wagon:wagon-ssh:jar:3.3.4-SNAPSHOT
generated by maven-surefire-plugin:test (default-test): m/wagon-providers/wagon-ssh/target/surefire-reports/*.xml
[withMaven] junitPublisher - Archive test results for Maven artifact org.apache.maven.wagon:wagon-webdav-jackrabbit:jar:3.3.4-SNAPSHOT
generated by maven-surefire-plugin:test (default-test): m/wagon-providers/wagon-webdav-jackrabbit/target/surefire-reports/*.xml
Recording test results
[withMaven] Publishers: Pipeline Graph Publisher: 29 ms, Invoker Publisher: 2 ms, Junit Publisher:
25928 ms, Concordion Publisher: 2 ms, Dependencies Fingerprint Publisher: 6852 ms, JGiven
Publisher: 1 ms, Jacoco Publisher: 1 ms, SpotBugs Publisher: 1 ms
[Pipeline] // withMaven
[Pipeline] cleanWs
[WS-CLEANUP] Deleting project workspace...
[WS-CLEANUP] Deferred wipeout is used...
[WS-CLEANUP] done
[Pipeline] }
[Pipeline] // stage
[Pipeline] }
[Pipeline] // node
[Pipeline] }
[Pipeline] // parallel
[Pipeline] stage
[Pipeline] { (Notifications)
[Pipeline] echo
Build result: UNSTABLE
[Pipeline] jiraIssueSelector
[Pipeline] echo
The authors of changes [hboutemy, tibordigana].
[Pipeline] echo
Sending email ...
[Pipeline] emailext
[Pipeline] }
[Pipeline] // stage
[Pipeline] End of Pipeline
Mime
  • Unnamed multipart/mixed (inline, None, 0 bytes)
View raw message