maven-notifications mailing list archives

Site index · List index
Message view « Date » · « Thread »
Top « Date » · « Thread »
From Apache Jenkins Server <jenk...@builds.apache.org>
Subject Build unstable in Jenkins: Maven TLP » maven » master #261
Date Thu, 01 Aug 2019 16:38:53 GMT
See https://builds.apache.org/job/maven-box/job/maven/job/master/261/

Changes:

* Add new bootstrap groups
* Add new bootstrap groups
* Add new bootstrap groups
* Add new bootstrap groups
* Add new bootstrap groups

16 tests failed.
FAILED:  org.apache.maven.it.MavenITmng3183LoggingToFileTest.linux-jdk8 / Run ITs Linux Java 8 / testit

Error Message:
expected:<[]> but was:<[Picked up JAVA_TOOL_OPTIONS: ]>

Stack Trace:
junit.framework.AssertionFailedError: expected:<[]> but was:<[Picked up JAVA_TOOL_OPTIONS: ]>
	at org.apache.maven.it.MavenITmng3183LoggingToFileTest.testit(MavenITmng3183LoggingToFileTest.java:74)


FAILED:  org.apache.maven.it.MavenITmng3183LoggingToFileTest.linux-jdk12 / Run ITs Linux Java 12 / testit

Error Message:
expected:<[]> but was:<[Picked up JAVA_TOOL_OPTIONS: , WARNING: An illegal reflective access operation has occurred, WARNING: Illegal reflective access by org.apache.maven.model.interpolation.StringSearchModelInterpolator$InterpolateObjectAction$CacheField (file:/home/jenkins/jenkins-slave/workspace/maven-box_maven_master@2/test/core-it-suite/target/apache-maven/lib/maven-model-builder-3.6.2-SNAPSHOT.jar) to field java.io.File.fs, WARNING: Please consider reporting this to the maintainers of org.apache.maven.model.interpolation.StringSearchModelInterpolator$InterpolateObjectAction$CacheField, WARNING: Use --illegal-access=warn to enable warnings of further illegal reflective access operations, WARNING: All illegal access operations will be denied in a future release]>

Stack Trace:
junit.framework.AssertionFailedError: expected:<[]> but was:<[Picked up JAVA_TOOL_OPTIONS: , WARNING: An illegal reflective access operation has occurred, WARNING: Illegal reflective access by org.apache.maven.model.interpolation.StringSearchModelInterpolator$InterpolateObjectAction$CacheField (file:/home/jenkins/jenkins-slave/workspace/maven-box_maven_master@2/test/core-it-suite/target/apache-maven/lib/maven-model-builder-3.6.2-SNAPSHOT.jar) to field java.io.File.fs, WARNING: Please consider reporting this to the maintainers of org.apache.maven.model.interpolation.StringSearchModelInterpolator$InterpolateObjectAction$CacheField, WARNING: Use --illegal-access=warn to enable warnings of further illegal reflective access operations, WARNING: All illegal access operations will be denied in a future release]>
	at org.apache.maven.it.MavenITmng3183LoggingToFileTest.testit(MavenITmng3183LoggingToFileTest.java:74)


FAILED:  org.apache.maven.it.MavenITmng3183LoggingToFileTest.linux-jdk11 / Run ITs Linux Java 11 / testit

Error Message:
expected:<[]> but was:<[Picked up JAVA_TOOL_OPTIONS: , WARNING: An illegal reflective access operation has occurred, WARNING: Illegal reflective access by org.apache.maven.model.interpolation.StringSearchModelInterpolator$InterpolateObjectAction$CacheField (file:/home/jenkins/jenkins-slave/workspace/maven-box_maven_master/test/core-it-suite/target/apache-maven/lib/maven-model-builder-3.6.2-SNAPSHOT.jar) to field java.io.File.fs, WARNING: Please consider reporting this to the maintainers of org.apache.maven.model.interpolation.StringSearchModelInterpolator$InterpolateObjectAction$CacheField, WARNING: Use --illegal-access=warn to enable warnings of further illegal reflective access operations, WARNING: All illegal access operations will be denied in a future release]>

Stack Trace:
junit.framework.AssertionFailedError: expected:<[]> but was:<[Picked up JAVA_TOOL_OPTIONS: , WARNING: An illegal reflective access operation has occurred, WARNING: Illegal reflective access by org.apache.maven.model.interpolation.StringSearchModelInterpolator$InterpolateObjectAction$CacheField (file:/home/jenkins/jenkins-slave/workspace/maven-box_maven_master/test/core-it-suite/target/apache-maven/lib/maven-model-builder-3.6.2-SNAPSHOT.jar) to field java.io.File.fs, WARNING: Please consider reporting this to the maintainers of org.apache.maven.model.interpolation.StringSearchModelInterpolator$InterpolateObjectAction$CacheField, WARNING: Use --illegal-access=warn to enable warnings of further illegal reflective access operations, WARNING: All illegal access operations will be denied in a future release]>
	at org.apache.maven.it.MavenITmng3183LoggingToFileTest.testit(MavenITmng3183LoggingToFileTest.java:74)


FAILED:  org.apache.maven.it.MavenITmng3183LoggingToFileTest.linux-jdk7 / Run ITs Linux Java 7 / testit

Error Message:
expected:<[]> but was:<[Picked up JAVA_TOOL_OPTIONS: ]>

Stack Trace:
junit.framework.AssertionFailedError: expected:<[]> but was:<[Picked up JAVA_TOOL_OPTIONS: ]>
	at org.apache.maven.it.MavenITmng3183LoggingToFileTest.testit(MavenITmng3183LoggingToFileTest.java:74)


FAILED:  org.apache.maven.it.MavenITmng3183LoggingToFileTest.windows-jdk12 / Run ITs Windows Java 12 / testit

Error Message:
expected:<[]> but was:<[Picked up JAVA_TOOL_OPTIONS: , WARNING: An illegal reflective access operation has occurred, WARNING: Illegal reflective access by org.apache.maven.model.interpolation.StringSearchModelInterpolator$InterpolateObjectAction$CacheField (file:/C:/mvn-it-2.tmp/core-it-suite/target/apache-maven/bin/../lib/maven-model-builder-3.6.2-SNAPSHOT.jar) to field java.io.File.fs, WARNING: Please consider reporting this to the maintainers of org.apache.maven.model.interpolation.StringSearchModelInterpolator$InterpolateObjectAction$CacheField, WARNING: Use --illegal-access=warn to enable warnings of further illegal reflective access operations, WARNING: All illegal access operations will be denied in a future release]>

Stack Trace:
junit.framework.AssertionFailedError: expected:<[]> but was:<[Picked up JAVA_TOOL_OPTIONS: , WARNING: An illegal reflective access operation has occurred, WARNING: Illegal reflective access by org.apache.maven.model.interpolation.StringSearchModelInterpolator$InterpolateObjectAction$CacheField (file:/C:/mvn-it-2.tmp/core-it-suite/target/apache-maven/bin/../lib/maven-model-builder-3.6.2-SNAPSHOT.jar) to field java.io.File.fs, WARNING: Please consider reporting this to the maintainers of org.apache.maven.model.interpolation.StringSearchModelInterpolator$InterpolateObjectAction$CacheField, WARNING: Use --illegal-access=warn to enable warnings of further illegal reflective access operations, WARNING: All illegal access operations will be denied in a future release]>
	at org.apache.maven.it.MavenITmng3183LoggingToFileTest.testit(MavenITmng3183LoggingToFileTest.java:74)


FAILED:  org.apache.maven.it.MavenITmng3183LoggingToFileTest.windows-jdk11 / Run ITs Windows Java 11 / testit

Error Message:
expected:<[]> but was:<[Picked up JAVA_TOOL_OPTIONS: , WARNING: An illegal reflective access operation has occurred, WARNING: Illegal reflective access by org.apache.maven.model.interpolation.StringSearchModelInterpolator$InterpolateObjectAction$CacheField (file:/C:/mvn-it-1.tmp/core-it-suite/target/apache-maven/bin/../lib/maven-model-builder-3.6.2-SNAPSHOT.jar) to field java.io.File.fs, WARNING: Please consider reporting this to the maintainers of org.apache.maven.model.interpolation.StringSearchModelInterpolator$InterpolateObjectAction$CacheField, WARNING: Use --illegal-access=warn to enable warnings of further illegal reflective access operations, WARNING: All illegal access operations will be denied in a future release]>

Stack Trace:
junit.framework.AssertionFailedError: expected:<[]> but was:<[Picked up JAVA_TOOL_OPTIONS: , WARNING: An illegal reflective access operation has occurred, WARNING: Illegal reflective access by org.apache.maven.model.interpolation.StringSearchModelInterpolator$InterpolateObjectAction$CacheField (file:/C:/mvn-it-1.tmp/core-it-suite/target/apache-maven/bin/../lib/maven-model-builder-3.6.2-SNAPSHOT.jar) to field java.io.File.fs, WARNING: Please consider reporting this to the maintainers of org.apache.maven.model.interpolation.StringSearchModelInterpolator$InterpolateObjectAction$CacheField, WARNING: Use --illegal-access=warn to enable warnings of further illegal reflective access operations, WARNING: All illegal access operations will be denied in a future release]>
	at org.apache.maven.it.MavenITmng3183LoggingToFileTest.testit(MavenITmng3183LoggingToFileTest.java:74)


FAILED:  org.apache.maven.it.MavenITmng4387QuietLoggingTest.linux-jdk8 / Run ITs Linux Java 8 / testit

Error Message:
expected:<[]> but was:<[Picked up JAVA_TOOL_OPTIONS: ]>

Stack Trace:
junit.framework.AssertionFailedError: expected:<[]> but was:<[Picked up JAVA_TOOL_OPTIONS: ]>
	at org.apache.maven.it.MavenITmng4387QuietLoggingTest.testit(MavenITmng4387QuietLoggingTest.java:71)


FAILED:  org.apache.maven.it.MavenITmng4387QuietLoggingTest.linux-jdk12 / Run ITs Linux Java 12 / testit

Error Message:
expected:<[]> but was:<[Picked up JAVA_TOOL_OPTIONS: , WARNING: An illegal reflective access operation has occurred, WARNING: Illegal reflective access by org.apache.maven.model.interpolation.StringSearchModelInterpolator$InterpolateObjectAction$CacheField (file:/home/jenkins/jenkins-slave/workspace/maven-box_maven_master@2/test/core-it-suite/target/apache-maven/lib/maven-model-builder-3.6.2-SNAPSHOT.jar) to field java.io.File.fs, WARNING: Please consider reporting this to the maintainers of org.apache.maven.model.interpolation.StringSearchModelInterpolator$InterpolateObjectAction$CacheField, WARNING: Use --illegal-access=warn to enable warnings of further illegal reflective access operations, WARNING: All illegal access operations will be denied in a future release]>

Stack Trace:
junit.framework.AssertionFailedError: expected:<[]> but was:<[Picked up JAVA_TOOL_OPTIONS: , WARNING: An illegal reflective access operation has occurred, WARNING: Illegal reflective access by org.apache.maven.model.interpolation.StringSearchModelInterpolator$InterpolateObjectAction$CacheField (file:/home/jenkins/jenkins-slave/workspace/maven-box_maven_master@2/test/core-it-suite/target/apache-maven/lib/maven-model-builder-3.6.2-SNAPSHOT.jar) to field java.io.File.fs, WARNING: Please consider reporting this to the maintainers of org.apache.maven.model.interpolation.StringSearchModelInterpolator$InterpolateObjectAction$CacheField, WARNING: Use --illegal-access=warn to enable warnings of further illegal reflective access operations, WARNING: All illegal access operations will be denied in a future release]>
	at org.apache.maven.it.MavenITmng4387QuietLoggingTest.testit(MavenITmng4387QuietLoggingTest.java:71)


FAILED:  org.apache.maven.it.MavenITmng4387QuietLoggingTest.linux-jdk11 / Run ITs Linux Java 11 / testit

Error Message:
expected:<[]> but was:<[Picked up JAVA_TOOL_OPTIONS: , WARNING: An illegal reflective access operation has occurred, WARNING: Illegal reflective access by org.apache.maven.model.interpolation.StringSearchModelInterpolator$InterpolateObjectAction$CacheField (file:/home/jenkins/jenkins-slave/workspace/maven-box_maven_master/test/core-it-suite/target/apache-maven/lib/maven-model-builder-3.6.2-SNAPSHOT.jar) to field java.io.File.fs, WARNING: Please consider reporting this to the maintainers of org.apache.maven.model.interpolation.StringSearchModelInterpolator$InterpolateObjectAction$CacheField, WARNING: Use --illegal-access=warn to enable warnings of further illegal reflective access operations, WARNING: All illegal access operations will be denied in a future release]>

Stack Trace:
junit.framework.AssertionFailedError: expected:<[]> but was:<[Picked up JAVA_TOOL_OPTIONS: , WARNING: An illegal reflective access operation has occurred, WARNING: Illegal reflective access by org.apache.maven.model.interpolation.StringSearchModelInterpolator$InterpolateObjectAction$CacheField (file:/home/jenkins/jenkins-slave/workspace/maven-box_maven_master/test/core-it-suite/target/apache-maven/lib/maven-model-builder-3.6.2-SNAPSHOT.jar) to field java.io.File.fs, WARNING: Please consider reporting this to the maintainers of org.apache.maven.model.interpolation.StringSearchModelInterpolator$InterpolateObjectAction$CacheField, WARNING: Use --illegal-access=warn to enable warnings of further illegal reflective access operations, WARNING: All illegal access operations will be denied in a future release]>
	at org.apache.maven.it.MavenITmng4387QuietLoggingTest.testit(MavenITmng4387QuietLoggingTest.java:71)


FAILED:  org.apache.maven.it.MavenITmng4387QuietLoggingTest.linux-jdk7 / Run ITs Linux Java 7 / testit

Error Message:
expected:<[]> but was:<[Picked up JAVA_TOOL_OPTIONS: ]>

Stack Trace:
junit.framework.AssertionFailedError: expected:<[]> but was:<[Picked up JAVA_TOOL_OPTIONS: ]>
	at org.apache.maven.it.MavenITmng4387QuietLoggingTest.testit(MavenITmng4387QuietLoggingTest.java:71)


FAILED:  org.apache.maven.it.MavenITmng4387QuietLoggingTest.windows-jdk12 / Run ITs Windows Java 12 / testit

Error Message:
expected:<[]> but was:<[Picked up JAVA_TOOL_OPTIONS: , WARNING: An illegal reflective access operation has occurred, WARNING: Illegal reflective access by org.apache.maven.model.interpolation.StringSearchModelInterpolator$InterpolateObjectAction$CacheField (file:/C:/mvn-it-2.tmp/core-it-suite/target/apache-maven/bin/../lib/maven-model-builder-3.6.2-SNAPSHOT.jar) to field java.io.File.fs, WARNING: Please consider reporting this to the maintainers of org.apache.maven.model.interpolation.StringSearchModelInterpolator$InterpolateObjectAction$CacheField, WARNING: Use --illegal-access=warn to enable warnings of further illegal reflective access operations, WARNING: All illegal access operations will be denied in a future release]>

Stack Trace:
junit.framework.AssertionFailedError: expected:<[]> but was:<[Picked up JAVA_TOOL_OPTIONS: , WARNING: An illegal reflective access operation has occurred, WARNING: Illegal reflective access by org.apache.maven.model.interpolation.StringSearchModelInterpolator$InterpolateObjectAction$CacheField (file:/C:/mvn-it-2.tmp/core-it-suite/target/apache-maven/bin/../lib/maven-model-builder-3.6.2-SNAPSHOT.jar) to field java.io.File.fs, WARNING: Please consider reporting this to the maintainers of org.apache.maven.model.interpolation.StringSearchModelInterpolator$InterpolateObjectAction$CacheField, WARNING: Use --illegal-access=warn to enable warnings of further illegal reflective access operations, WARNING: All illegal access operations will be denied in a future release]>
	at org.apache.maven.it.MavenITmng4387QuietLoggingTest.testit(MavenITmng4387QuietLoggingTest.java:71)


FAILED:  org.apache.maven.it.MavenITmng4387QuietLoggingTest.windows-jdk11 / Run ITs Windows Java 11 / testit

Error Message:
expected:<[]> but was:<[Picked up JAVA_TOOL_OPTIONS: , WARNING: An illegal reflective access operation has occurred, WARNING: Illegal reflective access by org.apache.maven.model.interpolation.StringSearchModelInterpolator$InterpolateObjectAction$CacheField (file:/C:/mvn-it-1.tmp/core-it-suite/target/apache-maven/bin/../lib/maven-model-builder-3.6.2-SNAPSHOT.jar) to field java.io.File.fs, WARNING: Please consider reporting this to the maintainers of org.apache.maven.model.interpolation.StringSearchModelInterpolator$InterpolateObjectAction$CacheField, WARNING: Use --illegal-access=warn to enable warnings of further illegal reflective access operations, WARNING: All illegal access operations will be denied in a future release]>

Stack Trace:
junit.framework.AssertionFailedError: expected:<[]> but was:<[Picked up JAVA_TOOL_OPTIONS: , WARNING: An illegal reflective access operation has occurred, WARNING: Illegal reflective access by org.apache.maven.model.interpolation.StringSearchModelInterpolator$InterpolateObjectAction$CacheField (file:/C:/mvn-it-1.tmp/core-it-suite/target/apache-maven/bin/../lib/maven-model-builder-3.6.2-SNAPSHOT.jar) to field java.io.File.fs, WARNING: Please consider reporting this to the maintainers of org.apache.maven.model.interpolation.StringSearchModelInterpolator$InterpolateObjectAction$CacheField, WARNING: Use --illegal-access=warn to enable warnings of further illegal reflective access operations, WARNING: All illegal access operations will be denied in a future release]>
	at org.apache.maven.it.MavenITmng4387QuietLoggingTest.testit(MavenITmng4387QuietLoggingTest.java:71)


FAILED:  org.apache.maven.it.MavenITmng5576CdFriendlyVersions.linux-jdk12 / Run ITs Linux Java 12 / testContinuousDeliveryFriendlyVersionsAreWarningFree

Error Message:
WARNING: An illegal reflective access operation has occurred

Stack Trace:
junit.framework.AssertionFailedError: WARNING: An illegal reflective access operation has occurred
	at org.apache.maven.it.MavenITmng5576CdFriendlyVersions.testContinuousDeliveryFriendlyVersionsAreWarningFree(MavenITmng5576CdFriendlyVersions.java:65)


FAILED:  org.apache.maven.it.MavenITmng5576CdFriendlyVersions.linux-jdk11 / Run ITs Linux Java 11 / testContinuousDeliveryFriendlyVersionsAreWarningFree

Error Message:
WARNING: An illegal reflective access operation has occurred

Stack Trace:
junit.framework.AssertionFailedError: WARNING: An illegal reflective access operation has occurred
	at org.apache.maven.it.MavenITmng5576CdFriendlyVersions.testContinuousDeliveryFriendlyVersionsAreWarningFree(MavenITmng5576CdFriendlyVersions.java:65)


FAILED:  org.apache.maven.it.MavenITmng5576CdFriendlyVersions.windows-jdk12 / Run ITs Windows Java 12 / testContinuousDeliveryFriendlyVersionsAreWarningFree

Error Message:
WARNING: An illegal reflective access operation has occurred

Stack Trace:
junit.framework.AssertionFailedError: WARNING: An illegal reflective access operation has occurred
	at org.apache.maven.it.MavenITmng5576CdFriendlyVersions.testContinuousDeliveryFriendlyVersionsAreWarningFree(MavenITmng5576CdFriendlyVersions.java:65)


FAILED:  org.apache.maven.it.MavenITmng5576CdFriendlyVersions.windows-jdk11 / Run ITs Windows Java 11 / testContinuousDeliveryFriendlyVersionsAreWarningFree

Error Message:
WARNING: An illegal reflective access operation has occurred

Stack Trace:
junit.framework.AssertionFailedError: WARNING: An illegal reflective access operation has occurred
	at org.apache.maven.it.MavenITmng5576CdFriendlyVersions.testContinuousDeliveryFriendlyVersionsAreWarningFree(MavenITmng5576CdFriendlyVersions.java:65)




Build log:
[...truncated 77142 lines...]
[withMaven] openTasksPublisher - Scan Tasks for Maven artifact org.apache.maven.plugins:maven-resources-plugin:maven-plugin:0.1-stub-SNAPSHOT in source directory core-it-support\core-it-plugins\maven-it-plugin-core-stubs\maven-resources-plugin\src\main\java
[withMaven] openTasksPublisher - Scan Tasks for Maven artifact org.apache.maven.plugins:maven-site-plugin:maven-plugin:0.1-stub-SNAPSHOT in source directory core-it-support\core-it-plugins\maven-it-plugin-core-stubs\maven-site-plugin\src\main\java
[withMaven] openTasksPublisher - Scan Tasks for Maven artifact org.apache.maven.plugins:maven-source-plugin:maven-plugin:0.1-stub-SNAPSHOT in source directory core-it-support\core-it-plugins\maven-it-plugin-core-stubs\maven-source-plugin\src\main\java
[withMaven] openTasksPublisher - Scan Tasks for Maven artifact org.apache.maven.plugins:maven-surefire-plugin:maven-plugin:0.1-stub-SNAPSHOT in source directory core-it-support\core-it-plugins\maven-it-plugin-core-stubs\maven-surefire-plugin\src\main\java
[withMaven] openTasksPublisher - Scan Tasks for Maven artifact org.apache.maven.plugins:maven-war-plugin:maven-plugin:0.1-stub-SNAPSHOT in source directory core-it-support\core-it-plugins\maven-it-plugin-core-stubs\maven-war-plugin\src\main\java
[withMaven] openTasksPublisher - Scan Tasks for Maven artifact org.apache.maven.its.plugins:maven-it-plugin-dependency-collection:maven-plugin:2.1-SNAPSHOT in source directory core-it-support\core-it-plugins\maven-it-plugin-dependency-collection\src\main\java
[withMaven] openTasksPublisher - Scan Tasks for Maven artifact org.apache.maven.its.plugins:maven-it-plugin-dependency-resolution:maven-plugin:2.1-SNAPSHOT in source directory core-it-support\core-it-plugins\maven-it-plugin-dependency-resolution\src\main\java
[withMaven] openTasksPublisher - Scan Tasks for Maven artifact org.apache.maven.its.plugins:maven-it-plugin-expression:maven-plugin:2.1-SNAPSHOT in source directory core-it-support\core-it-plugins\maven-it-plugin-expression\src\main\java
[withMaven] openTasksPublisher - Scan Tasks for Maven artifact org.apache.maven.its.plugins:maven-it-plugin-error:maven-plugin:2.1-SNAPSHOT in source directory core-it-support\core-it-plugins\maven-it-plugin-error\src\main\java
[withMaven] openTasksPublisher - Scan Tasks for Maven artifact org.apache.maven.its:core-it-component:jar:2.1-SNAPSHOT in source directory core-it-support\core-it-component\src\main\java
[withMaven] openTasksPublisher - Scan Tasks for Maven artifact org.apache.maven.its.plugins:maven-it-plugin-extension-consumer:maven-plugin:2.1-SNAPSHOT in source directory core-it-support\core-it-plugins\maven-it-plugin-extension-consumer\src\main\java
[withMaven] openTasksPublisher - Scan Tasks for Maven artifact org.apache.maven.its.plugins:maven-it-plugin-extension-provider:maven-plugin:2.1-SNAPSHOT in source directory core-it-support\core-it-plugins\maven-it-plugin-extension-provider\src\main\java
[withMaven] openTasksPublisher - Scan Tasks for Maven artifact org.apache.maven.its.plugins:maven-it-plugin-fork:maven-plugin:2.1-SNAPSHOT in source directory core-it-support\core-it-plugins\maven-it-plugin-fork\src\main\java
[withMaven] openTasksPublisher - Scan Tasks for Maven artifact org.apache.maven.its.plugins:maven-it-plugin-invalid-descriptor:maven-plugin:2.1-SNAPSHOT in source directory core-it-support\core-it-plugins\maven-it-plugin-invalid-descriptor\src\main\java
[withMaven] openTasksPublisher - Scan Tasks for Maven artifact org.apache.maven.its.plugins:maven-it-plugin-log-file:maven-plugin:2.1-SNAPSHOT in source directory core-it-support\core-it-plugins\maven-it-plugin-log-file\src\main\java
[withMaven] openTasksPublisher - Scan Tasks for Maven artifact org.apache.maven.its:maven-it-helper:jar:2.1-SNAPSHOT in source directory core-it-support\maven-it-helper\src\main\java
[withMaven] openTasksPublisher - Scan Tasks for Maven artifact org.apache.maven.its.plugins:maven-it-plugin-model-interpolation:maven-plugin:2.1-SNAPSHOT in source directory core-it-support\core-it-plugins\maven-it-plugin-model-interpolation\src\main\java
[withMaven] openTasksPublisher - Scan Tasks for Maven artifact org.apache.maven.its.plugins:maven-it-plugin-no-default-comp:maven-plugin:2.1-SNAPSHOT in source directory core-it-support\core-it-plugins\maven-it-plugin-no-default-comp\src\main\java
[withMaven] openTasksPublisher - Scan Tasks for Maven artifact org.apache.maven.its.plugins:maven-it-plugin-no-project:maven-plugin:2.1-SNAPSHOT in source directory core-it-support\core-it-plugins\maven-it-plugin-no-project\src\main\java
[withMaven] openTasksPublisher - Scan Tasks for Maven artifact org.apache.maven.its.plugins:maven-it-plugin-online:maven-plugin:2.1-SNAPSHOT in source directory core-it-support\core-it-plugins\maven-it-plugin-online\src\main\java
[withMaven] openTasksPublisher - Scan Tasks for Maven artifact org.apache.maven.its.plugins:maven-it-plugin-optional-mojos:maven-plugin:2.1-SNAPSHOT in source directory core-it-support\core-it-plugins\maven-it-plugin-optional-mojos\src\main\java
[withMaven] openTasksPublisher - Scan Tasks for Maven artifact org.apache.maven.its.plugins:maven-it-plugin-packaging:maven-plugin:2.1-SNAPSHOT in source directory core-it-support\core-it-plugins\maven-it-plugin-packaging\src\main\java
[withMaven] openTasksPublisher - Scan Tasks for Maven artifact org.apache.maven.its.plugins:maven-it-plugin-parameter-implementation:maven-plugin:2.1-SNAPSHOT in source directory core-it-support\core-it-plugins\maven-it-plugin-parameter-implementation\src\main\java
[withMaven] openTasksPublisher - Scan Tasks for Maven artifact org.apache.maven.its.plugins:maven-it-plugin-plugin-dependency:maven-plugin:2.1-SNAPSHOT in source directory core-it-support\core-it-plugins\maven-it-plugin-plugin-dependency\src\main\java
[withMaven] openTasksPublisher - Scan Tasks for Maven artifact org.apache.maven.its.plugins:maven-it-plugin-project:maven-plugin:2.1-SNAPSHOT in source directory core-it-support\core-it-plugins\maven-it-plugin-project\src\main\java
[withMaven] openTasksPublisher - Scan Tasks for Maven artifact org.apache.maven.its.plugins:maven-it-plugin-project-interpolation:maven-plugin:2.1-SNAPSHOT in source directory core-it-support\core-it-plugins\maven-it-plugin-project-interpolation\src\main\java
[withMaven] openTasksPublisher - Scan Tasks for Maven artifact org.apache.maven.its.plugins:maven-it-plugin-setter:maven-plugin:2.1-SNAPSHOT in source directory core-it-support\core-it-plugins\maven-it-plugin-setter\src\main\java
[withMaven] openTasksPublisher - Scan Tasks for Maven artifact org.apache.maven.its.plugins:maven-it-plugin-singleton-component:maven-plugin:2.1-SNAPSHOT in source directory core-it-support\core-it-plugins\maven-it-plugin-singleton-component\src\main\java
[withMaven] openTasksPublisher - Scan Tasks for Maven artifact org.apache.maven.its.plugins:maven-it-plugin-site:maven-plugin:2.1-SNAPSHOT in source directory core-it-support\core-it-plugins\maven-it-plugin-site\src\main\java
[withMaven] openTasksPublisher - Scan Tasks for Maven artifact org.apache.maven.its.plugins:maven-it-plugin-toolchain:maven-plugin:2.1-SNAPSHOT in source directory core-it-support\core-it-plugins\maven-it-plugin-toolchain\src\main\java
[withMaven] openTasksPublisher - Scan Tasks for Maven artifact org.apache.maven.its.plugins:maven-it-plugin-touch:maven-plugin:2.1-SNAPSHOT in source directory core-it-support\core-it-plugins\maven-it-plugin-touch\src\main\java
[withMaven] openTasksPublisher - Scan Tasks for Maven artifact org.apache.maven.its.plugins:maven-it-plugin-uses-properties:maven-plugin:2.1-SNAPSHOT in source directory core-it-support\core-it-plugins\maven-it-plugin-uses-properties\src\main\java
[withMaven] openTasksPublisher - Scan Tasks for Maven artifact org.apache.maven.its.plugins:maven-it-plugin-uses-wagon:maven-plugin:2.1-SNAPSHOT in source directory core-it-support\core-it-plugins\maven-it-plugin-uses-wagon\src\main\java
[withMaven] openTasksPublisher - Scan Tasks for Maven artifact org.apache.maven.its.plugins:maven-it-plugin-all:maven-plugin:2.1-SNAPSHOT in source directory core-it-support\core-it-plugins\maven-it-plugin-all\src\main\java
[withMaven] openTasksPublisher - Scan Tasks for Maven artifact org.apache.maven.its.plugins:maven-it-plugin-plexus-utils-11:maven-plugin:2.1-SNAPSHOT in source directory core-it-support\core-it-plugins\maven-it-plugin-plexus-utils-11\src\main\java
[withMaven] openTasksPublisher - Scan Tasks for Maven artifact org.apache.maven.its.plugins:maven-it-plugin-plexus-utils-new:maven-plugin:2.1-SNAPSHOT in source directory core-it-support\core-it-plugins\maven-it-plugin-plexus-utils-new\src\main\java
[withMaven] openTasksPublisher - Scan Tasks for Maven artifact org.apache.maven.its.plugins:maven-it-plugin-plexus-component-api:maven-plugin:2.1-SNAPSHOT in source directory core-it-support\core-it-plugins\maven-it-plugin-plexus-component-api\src\main\java
[withMaven] openTasksPublisher - Scan Tasks for Maven artifact org.apache.maven.its.plugins:maven-it-plugin-log4j:maven-plugin:2.1-SNAPSHOT in source directory core-it-support\core-it-plugins\maven-it-plugin-log4j\src\main\java
[withMaven] openTasksPublisher - Scan Tasks for Maven artifact org.apache.maven.its.plugins:maven-it-plugin-extension1:maven-plugin:2.1-SNAPSHOT in source directory core-it-support\core-it-plugins\maven-it-plugin-extension1\src\main\java
[withMaven] openTasksPublisher - Scan Tasks for Maven artifact org.apache.maven.its.plugins:maven-it-plugin-extension2:maven-plugin:2.1-SNAPSHOT in source directory core-it-support\core-it-plugins\maven-it-plugin-extension2\src\main\java
[withMaven] openTasksPublisher - Scan Tasks for Maven artifact org.apache.maven.its.plugins:maven-it-plugin-plexus-lifecycle:maven-plugin:2.1-SNAPSHOT in source directory core-it-support\core-it-plugins\maven-it-plugin-plexus-lifecycle\src\main\java
[withMaven] openTasksPublisher - Scan Tasks for Maven artifact org.apache.maven.its.plugins:maven-it-plugin-settings:maven-plugin:2.1-SNAPSHOT in source directory core-it-support\core-it-plugins\maven-it-plugin-settings\src\main\java
[withMaven] openTasksPublisher - Scan Tasks for Maven artifact org.apache.maven.its.plugins:mng-5805-pkg-type-mojo-configuration-plugin:maven-plugin:2.1-SNAPSHOT in source directory core-it-support\core-it-plugins\mng5805-plugin\src\main\java
[withMaven] openTasksPublisher - Scan Tasks for Maven artifact org.apache.maven.its.plugins:mng-5805-pkg-type-mojo-configuration-plugin-dep:jar:2.1-SNAPSHOT in source directory core-it-support\core-it-plugins\mng5805-plugin-dep\src\main\java
[withMaven] openTasksPublisher - Scan Tasks for Maven artifact org.apache.maven.its.plugins:mng-5958-pkg-type-extension:jar:2.1-SNAPSHOT in source directory core-it-support\core-it-plugins\mng5958-extension\src\main\java
[withMaven] openTasksPublisher - Scan Tasks for Maven artifact org.apache.maven.its:core-it-toolchain:jar:2.1-SNAPSHOT in source directory core-it-support\core-it-toolchain\src\main\java
[withMaven] openTasksPublisher - Scan Tasks for Maven artifact org.apache.maven.its:core-it-wagon:jar:2.1-SNAPSHOT in source directory core-it-support\core-it-wagon\src\main\java
[TASKS] Scanning folder 'c:\mvn-it-2.tmp' for files matching the pattern 'core-it-support\core-it-plugins\maven-it-plugin-active-collection\src\main\java\**\*,core-it-support\core-it-plugins\maven-it-plugin-artifact\src\main\java\**\*,core-it-support\core-it-plugins\maven-it-plugin-class-loader\dep-a\src\main\java\**\*,core-it-support\core-it-plugins\maven-it-plugin-class-loader\dep-b\src\main\java\**\*,core-it-support\core-it-plugins\maven-it-plugin-class-loader\maven-it-plugin-class-loader\src\main\java\**\*,core-it-support\core-it-plugins\maven-it-plugin-configuration\src\main\java\**\*,core-it-support\core-it-plugins\maven-it-plugin-context-passing\src\main\java\**\*,core-it-support\core-it-plugins\maven-it-plugin-core-stubs\maven-clean-plugin\src\main\java\**\*,core-it-support\core-it-plugins\maven-it-plugin-core-stubs\maven-compiler-plugin\src\main\java\**\*,core-it-support\core-it-plugins\maven-it-plugin-core-stubs\maven-deploy-plugin\src\main\java\**\*,core-it-support\core-it-plugins\maven-it-plugin-core-stubs\maven-ear-plugin\src\main\java\**\*,core-it-support\core-it-plugins\maven-it-plugin-core-stubs\maven-ejb-plugin\src\main\java\**\*,core-it-support\core-it-plugins\maven-it-plugin-core-stubs\maven-install-plugin\src\main\java\**\*,core-it-support\core-it-plugins\maven-it-plugin-core-stubs\maven-jar-plugin\src\main\java\**\*,core-it-support\core-it-plugins\maven-it-plugin-core-stubs\maven-javadoc-plugin\src\main\java\**\*,core-it-support\core-it-plugins\maven-it-plugin-core-stubs\maven-plugin-plugin\src\main\java\**\*,core-it-support\core-it-plugins\maven-it-plugin-core-stubs\maven-rar-plugin\src\main\java\**\*,core-it-support\core-it-plugins\maven-it-plugin-core-stubs\maven-resources-plugin\src\main\java\**\*,core-it-support\core-it-plugins\maven-it-plugin-core-stubs\maven-site-plugin\src\main\java\**\*,core-it-support\core-it-plugins\maven-it-plugin-core-stubs\maven-source-plugin\src\main\java\**\*,core-it-support\core-it-plugins\maven-it-plugin-core-stubs\maven-surefire-plugin\src\main\java\**\*,core-it-support\core-it-plugins\maven-it-plugin-core-stubs\maven-war-plugin\src\main\java\**\*,core-it-support\core-it-plugins\maven-it-plugin-dependency-collection\src\main\java\**\*,core-it-support\core-it-plugins\maven-it-plugin-dependency-resolution\src\main\java\**\*,core-it-support\core-it-plugins\maven-it-plugin-expression\src\main\java\**\*,core-it-support\core-it-plugins\maven-it-plugin-error\src\main\java\**\*,core-it-support\core-it-component\src\main\java\**\*,core-it-support\core-it-plugins\maven-it-plugin-extension-consumer\src\main\java\**\*,core-it-support\core-it-plugins\maven-it-plugin-extension-provider\src\main\java\**\*,core-it-support\core-it-plugins\maven-it-plugin-fork\src\main\java\**\*,core-it-support\core-it-plugins\maven-it-plugin-invalid-descriptor\src\main\java\**\*,core-it-support\core-it-plugins\maven-it-plugin-log-file\src\main\java\**\*,core-it-support\maven-it-helper\src\main\java\**\*,core-it-support\core-it-plugins\maven-it-plugin-model-interpolation\src\main\java\**\*,core-it-support\core-it-plugins\maven-it-plugin-no-default-comp\src\main\java\**\*,core-it-support\core-it-plugins\maven-it-plugin-no-project\src\main\java\**\*,core-it-support\core-it-plugins\maven-it-plugin-online\src\main\java\**\*,core-it-support\core-it-plugins\maven-it-plugin-optional-mojos\src\main\java\**\*,core-it-support\core-it-plugins\maven-it-plugin-packaging\src\main\java\**\*,core-it-support\core-it-plugins\maven-it-plugin-parameter-implementation\src\main\java\**\*,core-it-support\core-it-plugins\maven-it-plugin-plugin-dependency\src\main\java\**\*,core-it-support\core-it-plugins\maven-it-plugin-project\src\main\java\**\*,core-it-support\core-it-plugins\maven-it-plugin-project-interpolation\src\main\java\**\*,core-it-support\core-it-plugins\maven-it-plugin-setter\src\main\java\**\*,core-it-support\core-it-plugins\maven-it-plugin-singleton-component\src\main\java\**\*,core-it-support\core-it-plugins\maven-it-plugin-site\src\main\java\**\*,core-it-support\core-it-plugins\maven-it-plugin-toolchain\src\main\java\**\*,core-it-support\core-it-plugins\maven-it-plugin-touch\src\main\java\**\*,core-it-support\core-it-plugins\maven-it-plugin-uses-properties\src\main\java\**\*,core-it-support\core-it-plugins\maven-it-plugin-uses-wagon\src\main\java\**\*,core-it-support\core-it-plugins\maven-it-plugin-all\src\main\java\**\*,core-it-support\core-it-plugins\maven-it-plugin-plexus-utils-11\src\main\java\**\*,core-it-support\core-it-plugins\maven-it-plugin-plexus-utils-new\src\main\java\**\*,core-it-support\core-it-plugins\maven-it-plugin-plexus-component-api\src\main\java\**\*,core-it-support\core-it-plugins\maven-it-plugin-log4j\src\main\java\**\*,core-it-support\core-it-plugins\maven-it-plugin-extension1\src\main\java\**\*,core-it-support\core-it-plugins\maven-it-plugin-extension2\src\main\java\**\*,core-it-support\core-it-plugins\maven-it-plugin-plexus-lifecycle\src\main\java\**\*,core-it-support\core-it-plugins\maven-it-plugin-settings\src\main\java\**\*,core-it-support\core-it-plugins\mng5805-plugin\src\main\java\**\*,core-it-support\core-it-plugins\mng5805-plugin-dep\src\main\java\**\*,core-it-support\core-it-plugins\mng5958-extension\src\main\java\**\*,core-it-support\core-it-toolchain\src\main\java\**\*,core-it-support\core-it-wagon\src\main\java\**\*' - excludes: null
[TASKS] Found 164 files to scan for tasks
[TASKS] Found 0 open tasks.
Skipping warnings blame since pipelines do not have an SCM link.%n
[TASKS] Computing warning deltas based on reference build #260
[withMaven] Publishers: Pipeline Graph Publisher: 46 ms, Generated Artifacts Publisher: 6055 ms, Invoker Publisher: 6 ms, Junit Publisher: 31624 ms, Concordion Publisher: 9 ms, Dependencies Fingerprint Publisher: 105 ms, Findbugs Publisher: 3 ms, JGiven Publisher: 2 ms, Jacoco Publisher: 3 ms, SpotBugs Publisher: 2 ms, Open Task Scanner Publisher: 863 ms
[Pipeline] // withMaven
[Pipeline] // withMaven
[Pipeline] // withMaven
[Pipeline] // withMaven
[Pipeline] zip
[Pipeline] zip
[Pipeline] fileExists
[Pipeline] fileExists
[Pipeline] fileExists
[Pipeline] fileExists
[Pipeline] zip
[Pipeline] zip
[Pipeline] zip
Writing zip file of c:\mvn-it-0.tmp\core-it-suite\target\test-classes to c:\mvn-it-0.tmp\core-it-suite-logs-windows-jdk7.zip
Writing zip file of c:\mvn-it-2.tmp\core-it-suite\target\test-classes to c:\mvn-it-2.tmp\core-it-suite-logs-windows-jdk8.zip
Writing zip file of c:\mvn-it-2.tmp\core-it-suite\target\test-classes to c:\mvn-it-2.tmp\core-it-suite-logs-windows-jdk12.zip
[withMaven] openTasksPublisher - Scan Tasks for Maven artifact org.apache.maven.its.plugins:maven-it-plugin-active-collection:maven-plugin:2.1-SNAPSHOT in source directory core-it-support\core-it-plugins\maven-it-plugin-active-collection\src\main\java
[withMaven] openTasksPublisher - Scan Tasks for Maven artifact org.apache.maven.its.plugins:maven-it-plugin-artifact:maven-plugin:2.1-SNAPSHOT in source directory core-it-support\core-it-plugins\maven-it-plugin-artifact\src\main\java
[withMaven] openTasksPublisher - Scan Tasks for Maven artifact org.apache.maven.its.plugins.class-loader:dep-a:jar:2.1-SNAPSHOT in source directory core-it-support\core-it-plugins\maven-it-plugin-class-loader\dep-a\src\main\java
[withMaven] openTasksPublisher - Scan Tasks for Maven artifact org.apache.maven.its.plugins.class-loader:dep-b:jar:2.1-SNAPSHOT in source directory core-it-support\core-it-plugins\maven-it-plugin-class-loader\dep-b\src\main\java
[withMaven] openTasksPublisher - Scan Tasks for Maven artifact org.apache.maven.its.plugins:maven-it-plugin-class-loader:maven-plugin:2.1-SNAPSHOT in source directory core-it-support\core-it-plugins\maven-it-plugin-class-loader\maven-it-plugin-class-loader\src\main\java
[withMaven] openTasksPublisher - Scan Tasks for Maven artifact org.apache.maven.its.plugins:maven-it-plugin-configuration:maven-plugin:2.1-SNAPSHOT in source directory core-it-support\core-it-plugins\maven-it-plugin-configuration\src\main\java
[withMaven] openTasksPublisher - Scan Tasks for Maven artifact org.apache.maven.its.plugins:maven-it-plugin-context-passing:maven-plugin:2.1-SNAPSHOT in source directory core-it-support\core-it-plugins\maven-it-plugin-context-passing\src\main\java
[withMaven] openTasksPublisher - Scan Tasks for Maven artifact org.apache.maven.plugins:maven-clean-plugin:maven-plugin:0.1-stub-SNAPSHOT in source directory core-it-support\core-it-plugins\maven-it-plugin-core-stubs\maven-clean-plugin\src\main\java
[withMaven] openTasksPublisher - Scan Tasks for Maven artifact org.apache.maven.plugins:maven-compiler-plugin:maven-plugin:0.1-stub-SNAPSHOT in source directory core-it-support\core-it-plugins\maven-it-plugin-core-stubs\maven-compiler-plugin\src\main\java
[withMaven] openTasksPublisher - Scan Tasks for Maven artifact org.apache.maven.plugins:maven-deploy-plugin:maven-plugin:0.1-stub-SNAPSHOT in source directory core-it-support\core-it-plugins\maven-it-plugin-core-stubs\maven-deploy-plugin\src\main\java
[withMaven] openTasksPublisher - Scan Tasks for Maven artifact org.apache.maven.plugins:maven-ear-plugin:maven-plugin:0.1-stub-SNAPSHOT in source directory core-it-support\core-it-plugins\maven-it-plugin-core-stubs\maven-ear-plugin\src\main\java
[withMaven] openTasksPublisher - Scan Tasks for Maven artifact org.apache.maven.plugins:maven-ejb-plugin:maven-plugin:0.1-stub-SNAPSHOT in source directory core-it-support\core-it-plugins\maven-it-plugin-core-stubs\maven-ejb-plugin\src\main\java
[withMaven] openTasksPublisher - Scan Tasks for Maven artifact org.apache.maven.plugins:maven-install-plugin:maven-plugin:0.1-stub-SNAPSHOT in source directory core-it-support\core-it-plugins\maven-it-plugin-core-stubs\maven-install-plugin\src\main\java
[Pipeline] zip
[withMaven] openTasksPublisher - Scan Tasks for Maven artifact org.apache.maven.plugins:maven-jar-plugin:maven-plugin:0.1-stub-SNAPSHOT in source directory core-it-support\core-it-plugins\maven-it-plugin-core-stubs\maven-jar-plugin\src\main\java
[withMaven] openTasksPublisher - Scan Tasks for Maven artifact org.apache.maven.plugins:maven-javadoc-plugin:maven-plugin:0.1-stub-SNAPSHOT in source directory core-it-support\core-it-plugins\maven-it-plugin-core-stubs\maven-javadoc-plugin\src\main\java
[withMaven] openTasksPublisher - Scan Tasks for Maven artifact org.apache.maven.plugins:maven-plugin-plugin:maven-plugin:0.1-stub-SNAPSHOT in source directory core-it-support\core-it-plugins\maven-it-plugin-core-stubs\maven-plugin-plugin\src\main\java
[withMaven] openTasksPublisher - Scan Tasks for Maven artifact org.apache.maven.plugins:maven-rar-plugin:maven-plugin:0.1-stub-SNAPSHOT in source directory core-it-support\core-it-plugins\maven-it-plugin-core-stubs\maven-rar-plugin\src\main\java
[withMaven] openTasksPublisher - Scan Tasks for Maven artifact org.apache.maven.plugins:maven-resources-plugin:maven-plugin:0.1-stub-SNAPSHOT in source directory core-it-support\core-it-plugins\maven-it-plugin-core-stubs\maven-resources-plugin\src\main\java
[withMaven] openTasksPublisher - Scan Tasks for Maven artifact org.apache.maven.plugins:maven-site-plugin:maven-plugin:0.1-stub-SNAPSHOT in source directory core-it-support\core-it-plugins\maven-it-plugin-core-stubs\maven-site-plugin\src\main\java
[withMaven] openTasksPublisher - Scan Tasks for Maven artifact org.apache.maven.plugins:maven-source-plugin:maven-plugin:0.1-stub-SNAPSHOT in source directory core-it-support\core-it-plugins\maven-it-plugin-core-stubs\maven-source-plugin\src\main\java
[withMaven] openTasksPublisher - Scan Tasks for Maven artifact org.apache.maven.plugins:maven-surefire-plugin:maven-plugin:0.1-stub-SNAPSHOT in source directory core-it-support\core-it-plugins\maven-it-plugin-core-stubs\maven-surefire-plugin\src\main\java
[withMaven] openTasksPublisher - Scan Tasks for Maven artifact org.apache.maven.plugins:maven-war-plugin:maven-plugin:0.1-stub-SNAPSHOT in source directory core-it-support\core-it-plugins\maven-it-plugin-core-stubs\maven-war-plugin\src\main\java
[withMaven] openTasksPublisher - Scan Tasks for Maven artifact org.apache.maven.its.plugins:maven-it-plugin-dependency-collection:maven-plugin:2.1-SNAPSHOT in source directory core-it-support\core-it-plugins\maven-it-plugin-dependency-collection\src\main\java
[withMaven] openTasksPublisher - Scan Tasks for Maven artifact org.apache.maven.its.plugins:maven-it-plugin-dependency-resolution:maven-plugin:2.1-SNAPSHOT in source directory core-it-support\core-it-plugins\maven-it-plugin-dependency-resolution\src\main\java
[withMaven] openTasksPublisher - Scan Tasks for Maven artifact org.apache.maven.its.plugins:maven-it-plugin-expression:maven-plugin:2.1-SNAPSHOT in source directory core-it-support\core-it-plugins\maven-it-plugin-expression\src\main\java
[withMaven] openTasksPublisher - Scan Tasks for Maven artifact org.apache.maven.its.plugins:maven-it-plugin-error:maven-plugin:2.1-SNAPSHOT in source directory core-it-support\core-it-plugins\maven-it-plugin-error\src\main\java
[withMaven] openTasksPublisher - Scan Tasks for Maven artifact org.apache.maven.its:core-it-component:jar:2.1-SNAPSHOT in source directory core-it-support\core-it-component\src\main\java
[withMaven] openTasksPublisher - Scan Tasks for Maven artifact org.apache.maven.its.plugins:maven-it-plugin-extension-consumer:maven-plugin:2.1-SNAPSHOT in source directory core-it-support\core-it-plugins\maven-it-plugin-extension-consumer\src\main\java
[withMaven] openTasksPublisher - Scan Tasks for Maven artifact org.apache.maven.its.plugins:maven-it-plugin-extension-provider:maven-plugin:2.1-SNAPSHOT in source directory core-it-support\core-it-plugins\maven-it-plugin-extension-provider\src\main\java
[withMaven] openTasksPublisher - Scan Tasks for Maven artifact org.apache.maven.its.plugins:maven-it-plugin-fork:maven-plugin:2.1-SNAPSHOT in source directory core-it-support\core-it-plugins\maven-it-plugin-fork\src\main\java
[withMaven] openTasksPublisher - Scan Tasks for Maven artifact org.apache.maven.its.plugins:maven-it-plugin-invalid-descriptor:maven-plugin:2.1-SNAPSHOT in source directory core-it-support\core-it-plugins\maven-it-plugin-invalid-descriptor\src\main\java
[withMaven] openTasksPublisher - Scan Tasks for Maven artifact org.apache.maven.its.plugins:maven-it-plugin-log-file:maven-plugin:2.1-SNAPSHOT in source directory core-it-support\core-it-plugins\maven-it-plugin-log-file\src\main\java
[withMaven] openTasksPublisher - Scan Tasks for Maven artifact org.apache.maven.its:maven-it-helper:jar:2.1-SNAPSHOT in source directory core-it-support\maven-it-helper\src\main\java
[withMaven] openTasksPublisher - Scan Tasks for Maven artifact org.apache.maven.its.plugins:maven-it-plugin-model-interpolation:maven-plugin:2.1-SNAPSHOT in source directory core-it-support\core-it-plugins\maven-it-plugin-model-interpolation\src\main\java
[withMaven] openTasksPublisher - Scan Tasks for Maven artifact org.apache.maven.its.plugins:maven-it-plugin-no-default-comp:maven-plugin:2.1-SNAPSHOT in source directory core-it-support\core-it-plugins\maven-it-plugin-no-default-comp\src\main\java
[withMaven] openTasksPublisher - Scan Tasks for Maven artifact org.apache.maven.its.plugins:maven-it-plugin-no-project:maven-plugin:2.1-SNAPSHOT in source directory core-it-support\core-it-plugins\maven-it-plugin-no-project\src\main\java
[withMaven] openTasksPublisher - Scan Tasks for Maven artifact org.apache.maven.its.plugins:maven-it-plugin-online:maven-plugin:2.1-SNAPSHOT in source directory core-it-support\core-it-plugins\maven-it-plugin-online\src\main\java
[withMaven] openTasksPublisher - Scan Tasks for Maven artifact org.apache.maven.its.plugins:maven-it-plugin-optional-mojos:maven-plugin:2.1-SNAPSHOT in source directory core-it-support\core-it-plugins\maven-it-plugin-optional-mojos\src\main\java
[withMaven] openTasksPublisher - Scan Tasks for Maven artifact org.apache.maven.its.plugins:maven-it-plugin-packaging:maven-plugin:2.1-SNAPSHOT in source directory core-it-support\core-it-plugins\maven-it-plugin-packaging\src\main\java
[withMaven] openTasksPublisher - Scan Tasks for Maven artifact org.apache.maven.its.plugins:maven-it-plugin-parameter-implementation:maven-plugin:2.1-SNAPSHOT in source directory core-it-support\core-it-plugins\maven-it-plugin-parameter-implementation\src\main\java
[withMaven] openTasksPublisher - Scan Tasks for Maven artifact org.apache.maven.its.plugins:maven-it-plugin-plugin-dependency:maven-plugin:2.1-SNAPSHOT in source directory core-it-support\core-it-plugins\maven-it-plugin-plugin-dependency\src\main\java
[withMaven] openTasksPublisher - Scan Tasks for Maven artifact org.apache.maven.its.plugins:maven-it-plugin-project:maven-plugin:2.1-SNAPSHOT in source directory core-it-support\core-it-plugins\maven-it-plugin-project\src\main\java
[withMaven] openTasksPublisher - Scan Tasks for Maven artifact org.apache.maven.its.plugins:maven-it-plugin-project-interpolation:maven-plugin:2.1-SNAPSHOT in source directory core-it-support\core-it-plugins\maven-it-plugin-project-interpolation\src\main\java
[withMaven] openTasksPublisher - Scan Tasks for Maven artifact org.apache.maven.its.plugins:maven-it-plugin-setter:maven-plugin:2.1-SNAPSHOT in source directory core-it-support\core-it-plugins\maven-it-plugin-setter\src\main\java
[withMaven] openTasksPublisher - Scan Tasks for Maven artifact org.apache.maven.its.plugins:maven-it-plugin-singleton-component:maven-plugin:2.1-SNAPSHOT in source directory core-it-support\core-it-plugins\maven-it-plugin-singleton-component\src\main\java
[withMaven] openTasksPublisher - Scan Tasks for Maven artifact org.apache.maven.its.plugins:maven-it-plugin-site:maven-plugin:2.1-SNAPSHOT in source directory core-it-support\core-it-plugins\maven-it-plugin-site\src\main\java
[withMaven] openTasksPublisher - Scan Tasks for Maven artifact org.apache.maven.its.plugins:maven-it-plugin-toolchain:maven-plugin:2.1-SNAPSHOT in source directory core-it-support\core-it-plugins\maven-it-plugin-toolchain\src\main\java
[withMaven] openTasksPublisher - Scan Tasks for Maven artifact org.apache.maven.its.plugins:maven-it-plugin-touch:maven-plugin:2.1-SNAPSHOT in source directory core-it-support\core-it-plugins\maven-it-plugin-touch\src\main\java
[withMaven] openTasksPublisher - Scan Tasks for Maven artifact org.apache.maven.its.plugins:maven-it-plugin-uses-properties:maven-plugin:2.1-SNAPSHOT in source directory core-it-support\core-it-plugins\maven-it-plugin-uses-properties\src\main\java
[withMaven] openTasksPublisher - Scan Tasks for Maven artifact org.apache.maven.its.plugins:maven-it-plugin-uses-wagon:maven-plugin:2.1-SNAPSHOT in source directory core-it-support\core-it-plugins\maven-it-plugin-uses-wagon\src\main\java
[withMaven] openTasksPublisher - Scan Tasks for Maven artifact org.apache.maven.its.plugins:maven-it-plugin-all:maven-plugin:2.1-SNAPSHOT in source directory core-it-support\core-it-plugins\maven-it-plugin-all\src\main\java
[withMaven] openTasksPublisher - Scan Tasks for Maven artifact org.apache.maven.its.plugins:maven-it-plugin-plexus-utils-11:maven-plugin:2.1-SNAPSHOT in source directory core-it-support\core-it-plugins\maven-it-plugin-plexus-utils-11\src\main\java
[withMaven] openTasksPublisher - Scan Tasks for Maven artifact org.apache.maven.its.plugins:maven-it-plugin-plexus-utils-new:maven-plugin:2.1-SNAPSHOT in source directory core-it-support\core-it-plugins\maven-it-plugin-plexus-utils-new\src\main\java
[withMaven] openTasksPublisher - Scan Tasks for Maven artifact org.apache.maven.its.plugins:maven-it-plugin-plexus-component-api:maven-plugin:2.1-SNAPSHOT in source directory core-it-support\core-it-plugins\maven-it-plugin-plexus-component-api\src\main\java
[withMaven] openTasksPublisher - Scan Tasks for Maven artifact org.apache.maven.its.plugins:maven-it-plugin-log4j:maven-plugin:2.1-SNAPSHOT in source directory core-it-support\core-it-plugins\maven-it-plugin-log4j\src\main\java
[withMaven] openTasksPublisher - Scan Tasks for Maven artifact org.apache.maven.its.plugins:maven-it-plugin-extension1:maven-plugin:2.1-SNAPSHOT in source directory core-it-support\core-it-plugins\maven-it-plugin-extension1\src\main\java
Writing zip file of /home/jenkins/jenkins-slave/workspace/maven-box_maven_master/test/core-it-suite/target/surefire-reports to /home/jenkins/jenkins-slave/workspace/maven-box_maven_master/test/core-it-suite-reports-linux-jdk11.zip
[withMaven] openTasksPublisher - Scan Tasks for Maven artifact org.apache.maven.its.plugins:maven-it-plugin-extension2:maven-plugin:2.1-SNAPSHOT in source directory core-it-support\core-it-plugins\maven-it-plugin-extension2\src\main\java
Writing zip file of /home/jenkins/jenkins-slave/workspace/maven-box_maven_master@2/test/core-it-suite/target/surefire-reports to /home/jenkins/jenkins-slave/workspace/maven-box_maven_master@2/test/core-it-suite-reports-linux-jdk12.zip
[withMaven] openTasksPublisher - Scan Tasks for Maven artifact org.apache.maven.its.plugins:maven-it-plugin-plexus-lifecycle:maven-plugin:2.1-SNAPSHOT in source directory core-it-support\core-it-plugins\maven-it-plugin-plexus-lifecycle\src\main\java
[withMaven] openTasksPublisher - Scan Tasks for Maven artifact org.apache.maven.its.plugins:maven-it-plugin-settings:maven-plugin:2.1-SNAPSHOT in source directory core-it-support\core-it-plugins\maven-it-plugin-settings\src\main\java
[withMaven] openTasksPublisher - Scan Tasks for Maven artifact org.apache.maven.its.plugins:mng-5805-pkg-type-mojo-configuration-plugin:maven-plugin:2.1-SNAPSHOT in source directory core-it-support\core-it-plugins\mng5805-plugin\src\main\java
[withMaven] openTasksPublisher - Scan Tasks for Maven artifact org.apache.maven.its.plugins:mng-5805-pkg-type-mojo-configuration-plugin-dep:jar:2.1-SNAPSHOT in source directory core-it-support\core-it-plugins\mng5805-plugin-dep\src\main\java
[withMaven] openTasksPublisher - Scan Tasks for Maven artifact org.apache.maven.its.plugins:mng-5958-pkg-type-extension:jar:2.1-SNAPSHOT in source directory core-it-support\core-it-plugins\mng5958-extension\src\main\java
[withMaven] openTasksPublisher - Scan Tasks for Maven artifact org.apache.maven.its:core-it-toolchain:jar:2.1-SNAPSHOT in source directory core-it-support\core-it-toolchain\src\main\java
[withMaven] openTasksPublisher - Scan Tasks for Maven artifact org.apache.maven.its:core-it-wagon:jar:2.1-SNAPSHOT in source directory core-it-support\core-it-wagon\src\main\java
Zipped 3 entries.
Archiving /home/jenkins/jenkins-slave/workspace/maven-box_maven_master/test/core-it-suite-reports-linux-jdk11.zip
Zipped 3 entries.
Archiving /home/jenkins/jenkins-slave/workspace/maven-box_maven_master@2/test/core-it-suite-reports-linux-jdk12.zip
Writing zip file of /home/jenkins/jenkins-slave/workspace/maven-box_maven_master/test/core-it-suite/target/test-classes to /home/jenkins/jenkins-slave/workspace/maven-box_maven_master/test/core-it-suite-logs-linux-jdk7.zip
[TASKS] Scanning folder 'c:\mvn-it-1.tmp' for files matching the pattern 'core-it-support\core-it-plugins\maven-it-plugin-active-collection\src\main\java\**\*,core-it-support\core-it-plugins\maven-it-plugin-artifact\src\main\java\**\*,core-it-support\core-it-plugins\maven-it-plugin-class-loader\dep-a\src\main\java\**\*,core-it-support\core-it-plugins\maven-it-plugin-class-loader\dep-b\src\main\java\**\*,core-it-support\core-it-plugins\maven-it-plugin-class-loader\maven-it-plugin-class-loader\src\main\java\**\*,core-it-support\core-it-plugins\maven-it-plugin-configuration\src\main\java\**\*,core-it-support\core-it-plugins\maven-it-plugin-context-passing\src\main\java\**\*,core-it-support\core-it-plugins\maven-it-plugin-core-stubs\maven-clean-plugin\src\main\java\**\*,core-it-support\core-it-plugins\maven-it-plugin-core-stubs\maven-compiler-plugin\src\main\java\**\*,core-it-support\core-it-plugins\maven-it-plugin-core-stubs\maven-deploy-plugin\src\main\java\**\*,core-it-support\core-it-plugins\maven-it-plugin-core-stubs\maven-ear-plugin\src\main\java\**\*,core-it-support\core-it-plugins\maven-it-plugin-core-stubs\maven-ejb-plugin\src\main\java\**\*,core-it-support\core-it-plugins\maven-it-plugin-core-stubs\maven-install-plugin\src\main\java\**\*,core-it-support\core-it-plugins\maven-it-plugin-core-stubs\maven-jar-plugin\src\main\java\**\*,core-it-support\core-it-plugins\maven-it-plugin-core-stubs\maven-javadoc-plugin\src\main\java\**\*,core-it-support\core-it-plugins\maven-it-plugin-core-stubs\maven-plugin-plugin\src\main\java\**\*,core-it-support\core-it-plugins\maven-it-plugin-core-stubs\maven-rar-plugin\src\main\java\**\*,core-it-support\core-it-plugins\maven-it-plugin-core-stubs\maven-resources-plugin\src\main\java\**\*,core-it-support\core-it-plugins\maven-it-plugin-core-stubs\maven-site-plugin\src\main\java\**\*,core-it-support\core-it-plugins\maven-it-plugin-core-stubs\maven-source-plugin\src\main\java\**\*,core-it-support\core-it-plugins\maven-it-plugin-core-stubs\maven-surefire-plugin\src\main\java\**\*,core-it-support\core-it-plugins\maven-it-plugin-core-stubs\maven-war-plugin\src\main\java\**\*,core-it-support\core-it-plugins\maven-it-plugin-dependency-collection\src\main\java\**\*,core-it-support\core-it-plugins\maven-it-plugin-dependency-resolution\src\main\java\**\*,core-it-support\core-it-plugins\maven-it-plugin-expression\src\main\java\**\*,core-it-support\core-it-plugins\maven-it-plugin-error\src\main\java\**\*,core-it-support\core-it-component\src\main\java\**\*,core-it-support\core-it-plugins\maven-it-plugin-extension-consumer\src\main\java\**\*,core-it-support\core-it-plugins\maven-it-plugin-extension-provider\src\main\java\**\*,core-it-support\core-it-plugins\maven-it-plugin-fork\src\main\java\**\*,core-it-support\core-it-plugins\maven-it-plugin-invalid-descriptor\src\main\java\**\*,core-it-support\core-it-plugins\maven-it-plugin-log-file\src\main\java\**\*,core-it-support\maven-it-helper\src\main\java\**\*,core-it-support\core-it-plugins\maven-it-plugin-model-interpolation\src\main\java\**\*,core-it-support\core-it-plugins\maven-it-plugin-no-default-comp\src\main\java\**\*,core-it-support\core-it-plugins\maven-it-plugin-no-project\src\main\java\**\*,core-it-support\core-it-plugins\maven-it-plugin-online\src\main\java\**\*,core-it-support\core-it-plugins\maven-it-plugin-optional-mojos\src\main\java\**\*,core-it-support\core-it-plugins\maven-it-plugin-packaging\src\main\java\**\*,core-it-support\core-it-plugins\maven-it-plugin-parameter-implementation\src\main\java\**\*,core-it-support\core-it-plugins\maven-it-plugin-plugin-dependency\src\main\java\**\*,core-it-support\core-it-plugins\maven-it-plugin-project\src\main\java\**\*,core-it-support\core-it-plugins\maven-it-plugin-project-interpolation\src\main\java\**\*,core-it-support\core-it-plugins\maven-it-plugin-setter\src\main\java\**\*,core-it-support\core-it-plugins\maven-it-plugin-singleton-component\src\main\java\**\*,core-it-support\core-it-plugins\maven-it-plugin-site\src\main\java\**\*,core-it-support\core-it-plugins\maven-it-plugin-toolchain\src\main\java\**\*,core-it-support\core-it-plugins\maven-it-plugin-touch\src\main\java\**\*,core-it-support\core-it-plugins\maven-it-plugin-uses-properties\src\main\java\**\*,core-it-support\core-it-plugins\maven-it-plugin-uses-wagon\src\main\java\**\*,core-it-support\core-it-plugins\maven-it-plugin-all\src\main\java\**\*,core-it-support\core-it-plugins\maven-it-plugin-plexus-utils-11\src\main\java\**\*,core-it-support\core-it-plugins\maven-it-plugin-plexus-utils-new\src\main\java\**\*,core-it-support\core-it-plugins\maven-it-plugin-plexus-component-api\src\main\java\**\*,core-it-support\core-it-plugins\maven-it-plugin-log4j\src\main\java\**\*,core-it-support\core-it-plugins\maven-it-plugin-extension1\src\main\java\**\*,core-it-support\core-it-plugins\maven-it-plugin-extension2\src\main\java\**\*,core-it-support\core-it-plugins\maven-it-plugin-plexus-lifecycle\src\main\java\**\*,core-it-support\core-it-plugins\maven-it-plugin-settings\src\main\java\**\*,core-it-support\core-it-plugins\mng5805-plugin\src\main\java\**\*,core-it-support\core-it-plugins\mng5805-plugin-dep\src\main\java\**\*,core-it-support\core-it-plugins\mng5958-extension\src\main\java\**\*,core-it-support\core-it-toolchain\src\main\java\**\*,core-it-support\core-it-wagon\src\main\java\**\*' - excludes: null
[TASKS] Found 164 files to scan for tasks
[TASKS] Found 0 open tasks.
Skipping warnings blame since pipelines do not have an SCM link.%n
[TASKS] Computing warning deltas based on reference build #260
[withMaven] Publishers: Pipeline Graph Publisher: 56 ms, Generated Artifacts Publisher: 5915 ms, Invoker Publisher: 10 ms, Junit Publisher: 44728 ms, Concordion Publisher: 5 ms, Dependencies Fingerprint Publisher: 98 ms, Findbugs Publisher: 2 ms, JGiven Publisher: 1 ms, Jacoco Publisher: 1 ms, SpotBugs Publisher: 1 ms, Open Task Scanner Publisher: 689 ms
[Pipeline] // withMaven
[Pipeline] fileExists
[Pipeline] zip
Writing zip file of c:\mvn-it-1.tmp\core-it-suite\target\test-classes to c:\mvn-it-1.tmp\core-it-suite-logs-windows-jdk11.zip
[Pipeline] deleteDir
[Pipeline] deleteDir
Zipped 6484 entries.
Archiving /home/jenkins/jenkins-slave/workspace/maven-box_maven_master/test/core-it-suite-logs-linux-jdk7.zip
Zipped 6483 entries.
Archiving c:\mvn-it-0.tmp\core-it-suite-logs-windows-jdk7.zip
Zipped 6486 entries.
Archiving c:\mvn-it-2.tmp\core-it-suite-logs-windows-jdk12.zip
[Pipeline] }
[Pipeline] // dir
[Pipeline] }
[Pipeline] // stage
[Pipeline] }
[Pipeline] // node
[Pipeline] }
[Pipeline] }
[Pipeline] // dir
[Pipeline] }
[Pipeline] // stage
[Pipeline] }
[Pipeline] // node
[Pipeline] }
[Pipeline] fileExists
[Pipeline] zip
Writing zip file of c:\mvn-it-0.tmp\core-it-suite\target\surefire-reports to c:\mvn-it-0.tmp\core-it-suite-reports-windows-jdk7.zip
Zipped 2 entries.
Archiving c:\mvn-it-0.tmp\core-it-suite-reports-windows-jdk7.zip
[Pipeline] fileExists
[Pipeline] zip
Writing zip file of c:\mvn-it-2.tmp\core-it-suite\target\surefire-reports to c:\mvn-it-2.tmp\core-it-suite-reports-windows-jdk12.zip
Zipped 6483 entries.
Archiving c:\mvn-it-2.tmp\core-it-suite-logs-windows-jdk8.zip
Zipped 3 entries.
Archiving c:\mvn-it-2.tmp\core-it-suite-reports-windows-jdk12.zip
[Pipeline] deleteDir
[Pipeline] fileExists
Zipped 6486 entries.
Archiving c:\mvn-it-1.tmp\core-it-suite-logs-windows-jdk11.zip
[Pipeline] deleteDir
[Pipeline] zip
Writing zip file of /home/jenkins/jenkins-slave/workspace/maven-box_maven_master/test/core-it-suite/target/surefire-reports to /home/jenkins/jenkins-slave/workspace/maven-box_maven_master/test/core-it-suite-reports-linux-jdk7.zip
Zipped 3 entries.
Archiving /home/jenkins/jenkins-slave/workspace/maven-box_maven_master/test/core-it-suite-reports-linux-jdk7.zip
[Pipeline] deleteDir
[Pipeline] fileExists
[Pipeline] zip
Writing zip file of c:\mvn-it-2.tmp\core-it-suite\target\surefire-reports to c:\mvn-it-2.tmp\core-it-suite-reports-windows-jdk8.zip
Zipped 2 entries.
Archiving c:\mvn-it-2.tmp\core-it-suite-reports-windows-jdk8.zip
[Pipeline] deleteDir
[Pipeline] fileExists
[Pipeline] zip
Writing zip file of c:\mvn-it-1.tmp\core-it-suite\target\surefire-reports to c:\mvn-it-1.tmp\core-it-suite-reports-windows-jdk11.zip
Zipped 3 entries.
Archiving c:\mvn-it-1.tmp\core-it-suite-reports-windows-jdk11.zip
[Pipeline] deleteDir
[Pipeline] }
[Pipeline] // dir
[Pipeline] }
[Pipeline] // stage
[Pipeline] }
[Pipeline] // node
[Pipeline] }
[Pipeline] }
[Pipeline] // dir
[Pipeline] }
[Pipeline] // stage
[Pipeline] }
[Pipeline] // node
[Pipeline] }
[Pipeline] }
[Pipeline] // dir
[Pipeline] }
[Pipeline] // stage
[Pipeline] }
[Pipeline] // node
[Pipeline] }
[Pipeline] }
[Pipeline] // dir
[Pipeline] }
[Pipeline] // stage
[Pipeline] }
[Pipeline] // node
[Pipeline] }
[Pipeline] }
[Pipeline] // dir
[Pipeline] }
[Pipeline] // stage
[Pipeline] }
[Pipeline] // node
[Pipeline] }
[Pipeline] // parallel
[Pipeline] stage
[Pipeline] { (Notifications)
[Pipeline] echo
Build result: UNSTABLE
[Pipeline] jiraIssueSelector
[Pipeline] emailext
Mime
  • Unnamed multipart/mixed (inline, None, 0 bytes)
View raw message