maven-notifications mailing list archives

Site index · List index
Message view « Date » · « Thread »
Top « Date » · « Thread »
From Apache Jenkins Server <jenk...@builds.apache.org>
Subject Build failed in Jenkins: Maven TLP » maven-indexer » dependabot/maven/indexer-examples/indexer-examples-spring/version.spring-5.2.0.RELEASE #1
Date Fri, 01 Nov 2019 12:44:42 GMT
See https://builds.apache.org/job/maven-box/job/maven-indexer/job/dependabot%252Fmaven%252Findexer-examples%252Findexer-examples-spring%252Fversion.spring-5.2.0.RELEASE/1/

No changes.

All tests passed

Build log:
[...truncated 28813 lines...]
[INFO] Exclude: src/test/**/*.sha1
[INFO] Exclude: src/test/**/*.md5
[INFO] Exclude: src/test/**/*.xml
[INFO] Exclude: src/test/**/*.pom
[INFO] Exclude: src/test/**/*.asc
[INFO] Exclude: src/test/**/*.properties
[INFO] Exclude: src/test/**/*.swc
[INFO] Exclude: src/test/**/*.txt
[INFO] Exclude: src/test/**/*.filename
[INFO] Exclude: src/test/**/.placeholder
[INFO] 1 resources included (use -debug for more details)
[INFO] Rat check: Summary over all files. Unapproved: 0, unknown: 0, generated: 0, approved:
1 licenses.
[INFO] 
[INFO] --- maven-remote-resources-plugin:1.5:process (process-resource-bundles) @ maven-indexer-examples
---
[INFO] 
[INFO] --- animal-sniffer-maven-plugin:1.16:check (check-java-compat) @ maven-indexer-examples
---
[INFO] Checking unresolved references to org.codehaus.mojo.signature:java17:1.0
[INFO] 
[INFO] --- maven-site-plugin:3.7.1:attach-descriptor (attach-descriptor) @ maven-indexer-examples
---
[INFO] No site descriptor found: nothing to attach.
[INFO] 
[INFO] --- maven-checkstyle-plugin:2.17:check (checkstyle-check) @ maven-indexer-examples
---
[INFO] 
[INFO] ----------< org.apache.maven.indexer:indexer-examples-basic >-----------
[INFO] Building Maven :: Indexer Examples [Basic] 6.1.0-SNAPSHOT          [6/7]
[INFO] --------------------------------[ jar ]---------------------------------
[INFO] Downloading from central: https://repo.maven.apache.org/maven2/org/apache/maven/wagon/wagon-http-lightweight/2.12/wagon-http-lightweight-2.12.pom
[INFO] Downloaded from central: https://repo.maven.apache.org/maven2/org/apache/maven/wagon/wagon-http-lightweight/2.12/wagon-http-lightweight-2.12.pom
(2.6 kB at 78 kB/s)
[INFO] Downloading from central: https://repo.maven.apache.org/maven2/org/apache/maven/wagon/wagon-http-lightweight/2.12/wagon-http-lightweight-2.12.jar
[INFO] Downloaded from central: https://repo.maven.apache.org/maven2/org/apache/maven/wagon/wagon-http-lightweight/2.12/wagon-http-lightweight-2.12.jar
(17 kB at 195 kB/s)
[INFO] 
[INFO] --- maven-clean-plugin:3.1.0:clean (default-clean) @ indexer-examples-basic ---
[INFO] 
[INFO] --- maven-enforcer-plugin:1.4.1:enforce (enforce-maven-version) @ indexer-examples-basic
---
[INFO] 
[INFO] --- maven-enforcer-plugin:1.4.1:enforce (enforce-bytecode-version) @ indexer-examples-basic
---
[INFO] 
[INFO] --- maven-enforcer-plugin:1.4.1:enforce (ban-known-bad-maven-versions) @ indexer-examples-basic
---
[INFO] 
[INFO] --- apache-rat-plugin:0.12:check (rat-check) @ indexer-examples-basic ---
[INFO] Enabled default license matchers.
[INFO] Will parse SCM ignores for exclusions...
[INFO] Finished adding exclusions from SCM ignore files.
[INFO] 61 implicit excludes (use -debug for more details).
[INFO] Exclude: .repository/**
[INFO] Exclude: .maven/spy.log
[INFO] Exclude: dependency-reduced-pom.xml
[INFO] Exclude: .java-version
[INFO] Exclude: README.md
[INFO] Exclude: .gitignore
[INFO] Exclude: NOTICE
[INFO] Exclude: **/packageinfo
[INFO] Exclude: .git/**
[INFO] Exclude: .idea/**
[INFO] Exclude: **/*.iml
[INFO] Exclude: src/test/**/*.sha1
[INFO] Exclude: src/test/**/*.md5
[INFO] Exclude: src/test/**/*.xml
[INFO] Exclude: src/test/**/*.pom
[INFO] Exclude: src/test/**/*.asc
[INFO] Exclude: src/test/**/*.properties
[INFO] Exclude: src/test/**/*.swc
[INFO] Exclude: src/test/**/*.txt
[INFO] Exclude: src/test/**/*.filename
[INFO] Exclude: src/test/**/.placeholder
[INFO] 4 resources included (use -debug for more details)
[INFO] Rat check: Summary over all files. Unapproved: 0, unknown: 0, generated: 0, approved:
4 licenses.
[INFO] 
[INFO] --- maven-remote-resources-plugin:1.5:process (process-resource-bundles) @ indexer-examples-basic
---
[INFO] 
[INFO] --- maven-resources-plugin:3.1.0:resources (default-resources) @ indexer-examples-basic
---
[INFO] Using 'UTF-8' encoding to copy filtered resources.
[INFO] skip non existing resourceDirectory F:\jenkins\jenkins-slave\workspace\ing_version.spring-5.2.0.RELEASE\m\indexer-examples\indexer-examples-basic\src\main\resources
[INFO] Copying 3 resources
[INFO] 
[INFO] --- maven-compiler-plugin:3.7.0:compile (default-compile) @ indexer-examples-basic
---
[INFO] Changes detected - recompiling the module!
[INFO] Compiling 1 source file to F:\jenkins\jenkins-slave\workspace\ing_version.spring-5.2.0.RELEASE\m\indexer-examples\indexer-examples-basic\target\classes
[INFO] 
[INFO] --- animal-sniffer-maven-plugin:1.16:check (check-java-compat) @ indexer-examples-basic
---
[INFO] Checking unresolved references to org.codehaus.mojo.signature:java17:1.0
[INFO] 
[INFO] --- maven-resources-plugin:3.1.0:testResources (default-testResources) @ indexer-examples-basic
---
[INFO] Using 'UTF-8' encoding to copy filtered resources.
[INFO] skip non existing resourceDirectory F:\jenkins\jenkins-slave\workspace\ing_version.spring-5.2.0.RELEASE\m\indexer-examples\indexer-examples-basic\src\test\resources
[INFO] Copying 3 resources
[INFO] 
[INFO] --- maven-compiler-plugin:3.7.0:testCompile (default-testCompile) @ indexer-examples-basic
---
[INFO] Changes detected - recompiling the module!
[INFO] Compiling 1 source file to F:\jenkins\jenkins-slave\workspace\ing_version.spring-5.2.0.RELEASE\m\indexer-examples\indexer-examples-basic\target\test-classes
[INFO] 
[INFO] --- maven-surefire-plugin:2.22.0:test (default-test) @ indexer-examples-basic ---
[INFO] Tests are skipped.
[INFO] 
[INFO] --- maven-jar-plugin:3.1.0:jar (default-jar) @ indexer-examples-basic ---
[INFO] Building jar: F:\jenkins\jenkins-slave\workspace\ing_version.spring-5.2.0.RELEASE\m\indexer-examples\indexer-examples-basic\target\indexer-examples-basic-6.1.0-SNAPSHOT.jar
[INFO] 
[INFO] --- maven-site-plugin:3.7.1:attach-descriptor (attach-descriptor) @ indexer-examples-basic
---
[INFO] Skipping because packaging 'jar' is not pom.
[INFO] 
[INFO] --- maven-checkstyle-plugin:2.17:check (checkstyle-check) @ indexer-examples-basic
---
[INFO] There is 1 error reported by Checkstyle 6.11.2 with config/maven_checks.xml ruleset.
[INFO] Ignored 1 error, 0 violation remaining.
[INFO] 
[INFO] ----------< org.apache.maven.indexer:indexer-examples-spring >----------
[INFO] Building Maven :: Indexer Examples [Spring] 6.1.0-SNAPSHOT         [7/7]
[INFO] --------------------------------[ jar ]---------------------------------
[INFO] Downloading from central: https://repo.maven.apache.org/maven2/ch/qos/logback/logback-classic/1.2.3/logback-classic-1.2.3.pom
[INFO] Downloaded from central: https://repo.maven.apache.org/maven2/ch/qos/logback/logback-classic/1.2.3/logback-classic-1.2.3.pom
(13 kB at 327 kB/s)
[INFO] Downloading from central: https://repo.maven.apache.org/maven2/ch/qos/logback/logback-parent/1.2.3/logback-parent-1.2.3.pom
[INFO] Downloaded from central: https://repo.maven.apache.org/maven2/ch/qos/logback/logback-parent/1.2.3/logback-parent-1.2.3.pom
(18 kB at 468 kB/s)
[INFO] Downloading from central: https://repo.maven.apache.org/maven2/ch/qos/logback/logback-core/1.2.3/logback-core-1.2.3.pom
[INFO] Downloaded from central: https://repo.maven.apache.org/maven2/ch/qos/logback/logback-core/1.2.3/logback-core-1.2.3.pom
(4.2 kB at 135 kB/s)
[INFO] Downloading from central: https://repo.maven.apache.org/maven2/org/apache/maven/maven-model-builder/3.5.2/maven-model-builder-3.5.2.pom
[INFO] Downloaded from central: https://repo.maven.apache.org/maven2/org/apache/maven/maven-model-builder/3.5.2/maven-model-builder-3.5.2.pom
(3.1 kB at 112 kB/s)
[INFO] Downloading from central: https://repo.maven.apache.org/maven2/org/apache/maven/maven-artifact/3.5.2/maven-artifact-3.5.2.pom
[INFO] Downloaded from central: https://repo.maven.apache.org/maven2/org/apache/maven/maven-artifact/3.5.2/maven-artifact-3.5.2.pom
(2.1 kB at 73 kB/s)
[INFO] Downloading from central: https://repo.maven.apache.org/maven2/org/apache/maven/maven-builder-support/3.5.2/maven-builder-support-3.5.2.pom
[INFO] Downloaded from central: https://repo.maven.apache.org/maven2/org/apache/maven/maven-builder-support/3.5.2/maven-builder-support-3.5.2.pom
(1.5 kB at 48 kB/s)
[INFO] Downloading from central: https://repo.maven.apache.org/maven2/org/springframework/spring-beans/5.2.0.RELEASE/spring-beans-5.2.0.RELEASE.pom
[INFO] Downloaded from central: https://repo.maven.apache.org/maven2/org/springframework/spring-beans/5.2.0.RELEASE/spring-beans-5.2.0.RELEASE.pom
(1.7 kB at 54 kB/s)
[INFO] Downloading from central: https://repo.maven.apache.org/maven2/org/springframework/spring-core/5.2.0.RELEASE/spring-core-5.2.0.RELEASE.pom
[INFO] Downloaded from central: https://repo.maven.apache.org/maven2/org/springframework/spring-core/5.2.0.RELEASE/spring-core-5.2.0.RELEASE.pom
(1.7 kB at 58 kB/s)
[INFO] Downloading from central: https://repo.maven.apache.org/maven2/org/springframework/spring-jcl/5.2.0.RELEASE/spring-jcl-5.2.0.RELEASE.pom
[INFO] Downloaded from central: https://repo.maven.apache.org/maven2/org/springframework/spring-jcl/5.2.0.RELEASE/spring-jcl-5.2.0.RELEASE.pom
(1.5 kB at 53 kB/s)
[INFO] Downloading from central: https://repo.maven.apache.org/maven2/org/springframework/spring-context/5.2.0.RELEASE/spring-context-5.2.0.RELEASE.pom
[INFO] Downloaded from central: https://repo.maven.apache.org/maven2/org/springframework/spring-context/5.2.0.RELEASE/spring-context-5.2.0.RELEASE.pom
(2.3 kB at 75 kB/s)
[INFO] Downloading from central: https://repo.maven.apache.org/maven2/org/springframework/spring-aop/5.2.0.RELEASE/spring-aop-5.2.0.RELEASE.pom
[INFO] Downloaded from central: https://repo.maven.apache.org/maven2/org/springframework/spring-aop/5.2.0.RELEASE/spring-aop-5.2.0.RELEASE.pom
(1.9 kB at 67 kB/s)
[INFO] Downloading from central: https://repo.maven.apache.org/maven2/org/springframework/spring-expression/5.2.0.RELEASE/spring-expression-5.2.0.RELEASE.pom
[INFO] Downloaded from central: https://repo.maven.apache.org/maven2/org/springframework/spring-expression/5.2.0.RELEASE/spring-expression-5.2.0.RELEASE.pom
(1.7 kB at 51 kB/s)
[INFO] Downloading from central: https://repo.maven.apache.org/maven2/org/springframework/spring-test/5.2.0.RELEASE/spring-test-5.2.0.RELEASE.pom
[INFO] Downloaded from central: https://repo.maven.apache.org/maven2/org/springframework/spring-test/5.2.0.RELEASE/spring-test-5.2.0.RELEASE.pom
(1.7 kB at 57 kB/s)
[INFO] Downloading from central: https://repo.maven.apache.org/maven2/ch/qos/logback/logback-classic/1.2.3/logback-classic-1.2.3.jar
[INFO] Downloading from central: https://repo.maven.apache.org/maven2/org/apache/maven/maven-builder-support/3.5.2/maven-builder-support-3.5.2.jar
[INFO] Downloading from central: https://repo.maven.apache.org/maven2/org/apache/maven/maven-artifact/3.5.2/maven-artifact-3.5.2.jar
[INFO] Downloading from central: https://repo.maven.apache.org/maven2/org/apache/maven/maven-model-builder/3.5.2/maven-model-builder-3.5.2.jar
[INFO] Downloading from central: https://repo.maven.apache.org/maven2/ch/qos/logback/logback-core/1.2.3/logback-core-1.2.3.jar
[INFO] Downloaded from central: https://repo.maven.apache.org/maven2/org/apache/maven/maven-artifact/3.5.2/maven-artifact-3.5.2.jar
(55 kB at 1.3 MB/s)
[INFO] Downloading from central: https://repo.maven.apache.org/maven2/org/springframework/spring-beans/5.2.0.RELEASE/spring-beans-5.2.0.RELEASE.jar
[INFO] Downloaded from central: https://repo.maven.apache.org/maven2/org/apache/maven/maven-model-builder/3.5.2/maven-model-builder-3.5.2.jar
(180 kB at 2.9 MB/s)
[INFO] Downloading from central: https://repo.maven.apache.org/maven2/org/springframework/spring-context/5.2.0.RELEASE/spring-context-5.2.0.RELEASE.jar
[INFO] Downloaded from central: https://repo.maven.apache.org/maven2/ch/qos/logback/logback-core/1.2.3/logback-core-1.2.3.jar
(472 kB at 6.6 MB/s)
[INFO] Downloading from central: https://repo.maven.apache.org/maven2/org/springframework/spring-aop/5.2.0.RELEASE/spring-aop-5.2.0.RELEASE.jar
[INFO] Downloaded from central: https://repo.maven.apache.org/maven2/ch/qos/logback/logback-classic/1.2.3/logback-classic-1.2.3.jar
(290 kB at 3.4 MB/s)
[INFO] Downloading from central: https://repo.maven.apache.org/maven2/org/springframework/spring-expression/5.2.0.RELEASE/spring-expression-5.2.0.RELEASE.jar
[INFO] Downloaded from central: https://repo.maven.apache.org/maven2/org/springframework/spring-beans/5.2.0.RELEASE/spring-beans-5.2.0.RELEASE.jar
(684 kB at 5.9 MB/s)
[INFO] Downloading from central: https://repo.maven.apache.org/maven2/org/springframework/spring-core/5.2.0.RELEASE/spring-core-5.2.0.RELEASE.jar
[INFO] Downloaded from central: https://repo.maven.apache.org/maven2/org/springframework/spring-expression/5.2.0.RELEASE/spring-expression-5.2.0.RELEASE.jar
(282 kB at 2.1 MB/s)
[INFO] Downloading from central: https://repo.maven.apache.org/maven2/org/springframework/spring-jcl/5.2.0.RELEASE/spring-jcl-5.2.0.RELEASE.jar
[INFO] Downloaded from central: https://repo.maven.apache.org/maven2/org/springframework/spring-aop/5.2.0.RELEASE/spring-aop-5.2.0.RELEASE.jar
(373 kB at 2.6 MB/s)
[INFO] Downloading from central: https://repo.maven.apache.org/maven2/org/springframework/spring-test/5.2.0.RELEASE/spring-test-5.2.0.RELEASE.jar
[INFO] Downloaded from central: https://repo.maven.apache.org/maven2/org/apache/maven/maven-builder-support/3.5.2/maven-builder-support-3.5.2.jar
(15 kB at 93 kB/s)
[INFO] Downloaded from central: https://repo.maven.apache.org/maven2/org/springframework/spring-context/5.2.0.RELEASE/spring-context-5.2.0.RELEASE.jar
(1.2 MB at 6.2 MB/s)
[INFO] Downloaded from central: https://repo.maven.apache.org/maven2/org/springframework/spring-test/5.2.0.RELEASE/spring-test-5.2.0.RELEASE.jar
(679 kB at 3.3 MB/s)
[INFO] Downloaded from central: https://repo.maven.apache.org/maven2/org/springframework/spring-core/5.2.0.RELEASE/spring-core-5.2.0.RELEASE.jar
(1.4 MB at 6.1 MB/s)
[INFO] Downloaded from central: https://repo.maven.apache.org/maven2/org/springframework/spring-jcl/5.2.0.RELEASE/spring-jcl-5.2.0.RELEASE.jar
(24 kB at 78 kB/s)
[INFO] 
[INFO] --- maven-clean-plugin:3.1.0:clean (default-clean) @ indexer-examples-spring ---
[INFO] 
[INFO] --- maven-enforcer-plugin:1.4.1:enforce (enforce-maven-version) @ indexer-examples-spring
---
[INFO] 
[INFO] --- maven-enforcer-plugin:1.4.1:enforce (enforce-bytecode-version) @ indexer-examples-spring
---
[INFO] Restricted to JDK 1.7 yet org.springframework:spring-core:jar:5.2.0.RELEASE:compile
contains org/springframework/core/ReactiveTypeDescriptor.class targeted to JDK 1.8
[INFO] Restricted to JDK 1.7 yet org.springframework:spring-context:jar:5.2.0.RELEASE:compile
contains org/springframework/instrument/classloading/ResourceOverridingShadowingClassLoader.class
targeted to JDK 1.8
[INFO] Restricted to JDK 1.7 yet org.springframework:spring-test:jar:5.2.0.RELEASE:test contains
org/springframework/test/annotation/DirtiesContext$MethodMode.class targeted to JDK 1.8
[INFO] Restricted to JDK 1.7 yet org.springframework:spring-jcl:jar:5.2.0.RELEASE:compile
contains org/apache/commons/logging/LogAdapter$1.class targeted to JDK 1.8
[INFO] Restricted to JDK 1.7 yet org.springframework:spring-aop:jar:5.2.0.RELEASE:compile
contains org/aopalliance/intercept/ConstructorInterceptor.class targeted to JDK 1.8
[INFO] Restricted to JDK 1.7 yet org.springframework:spring-expression:jar:5.2.0.RELEASE:compile
contains org/springframework/expression/MethodExecutor.class targeted to JDK 1.8
[INFO] Restricted to JDK 1.7 yet org.springframework:spring-beans:jar:5.2.0.RELEASE:compile
contains org/springframework/beans/TypeMismatchException.class targeted to JDK 1.8
[WARNING] Rule 0: org.apache.maven.plugins.enforcer.EnforceBytecodeVersion failed with message:
Found Banned Dependency: org.springframework:spring-core:jar:5.2.0.RELEASE
Found Banned Dependency: org.springframework:spring-context:jar:5.2.0.RELEASE
Found Banned Dependency: org.springframework:spring-test:jar:5.2.0.RELEASE
Found Banned Dependency: org.springframework:spring-jcl:jar:5.2.0.RELEASE
Found Banned Dependency: org.springframework:spring-aop:jar:5.2.0.RELEASE
Found Banned Dependency: org.springframework:spring-expression:jar:5.2.0.RELEASE
Found Banned Dependency: org.springframework:spring-beans:jar:5.2.0.RELEASE
Use 'mvn dependency:tree' to locate the source of the banned dependencies.
[INFO] ------------------------------------------------------------------------
[INFO] Reactor Summary for Maven-Indexer 6.1.0-SNAPSHOT:
[INFO] 
[INFO] Maven-Indexer ...................................... SUCCESS [ 33.261 s]
[INFO] Maven :: Indexer Core .............................. SUCCESS [06:48 min]
[INFO] Maven :: Indexer CLI ............................... SUCCESS [01:01 min]
[INFO] Maven :: Indexer Reader ............................ SUCCESS [  6.430 s]
[INFO] Maven :: Indexer Examples .......................... SUCCESS [  0.745 s]
[INFO] Maven :: Indexer Examples [Basic] .................. SUCCESS [  2.554 s]
[INFO] Maven :: Indexer Examples [Spring] ................. FAILURE [  1.847 s]
[INFO] ------------------------------------------------------------------------
[INFO] BUILD FAILURE
[INFO] ------------------------------------------------------------------------
[INFO] Total time:  08:47 min
[INFO] Finished at: 2019-11-01T05:44:40-07:00
[INFO] ------------------------------------------------------------------------
[WARNING] The requested profile "run-its" could not be activated because it does not exist.
[INFO] [jenkins-event-spy] Generated F:\jenkins\jenkins-slave\workspace\ing_version.spring-5.2.0.RELEASE@tmp\withMavenbab7ff28\maven-spy-20191101-053552-25515385544284100500580.log
[ERROR] Failed to execute goal org.apache.maven.plugins:maven-enforcer-plugin:1.4.1:enforce
(enforce-bytecode-version) on project indexer-examples-spring: Some Enforcer rules have failed.
Look above for specific messages explaining why the rule failed. -> [Help 1]
[ERROR] 
[ERROR] To see the full stack trace of the errors, re-run Maven with the -e switch.
[ERROR] Re-run Maven using the -X switch to enable full debug logging.
[ERROR] 
[ERROR] For more information about the errors and possible solutions, please read the following
articles:
[ERROR] [Help 1] http://cwiki.apache.org/confluence/display/MAVEN/MojoExecutionException
[ERROR] 
[ERROR] After correcting the problems, you can resume the build with the command
[ERROR]   mvn <args> -rf :indexer-examples-spring
[Pipeline] }
[Pipeline] // dir
[Pipeline] }
[withMaven] junitPublisher - Archive test results for Maven artifact org.apache.maven.indexer:indexer-core:jar:6.1.0-SNAPSHOT
generated by maven-surefire-plugin:test (default-test): m\indexer-core\target\surefire-reports\*.xml
[withMaven] junitPublisher - Archive test results for Maven artifact org.apache.maven.indexer:indexer-cli:jar:6.1.0-SNAPSHOT
generated by maven-surefire-plugin:test (default-test): m\indexer-cli\target\surefire-reports\*.xml
[withMaven] junitPublisher - Archive test results for Maven artifact org.apache.maven.indexer:indexer-reader:bundle:6.1.0-SNAPSHOT
generated by maven-surefire-plugin:test (default-test): m\indexer-reader\target\surefire-reports\*.xml
[withMaven] junitPublisher - Archive test results for Maven artifact org.apache.maven.indexer:indexer-examples-basic:jar:6.1.0-SNAPSHOT
generated by maven-surefire-plugin:test (default-test): m\indexer-examples\indexer-examples-basic\target\surefire-reports\*.xml
Recording test results
[withMaven] junitPublisher - Archive test results for Maven artifact org.apache.maven.indexer:indexer-core:jar:6.1.0-SNAPSHOT
generated by maven-failsafe-plugin:integration-test (default): m\indexer-core\target\failsafe-reports\*.xml
[withMaven] junitPublisher - Archive test results for Maven artifact org.apache.maven.indexer:indexer-cli:jar:6.1.0-SNAPSHOT
generated by maven-failsafe-plugin:integration-test (default): m\indexer-cli\target\failsafe-reports\*.xml
Recording test results
[withMaven] Publishers: Pipeline Graph Publisher: 2 ms, Junit Publisher: 1283 ms, Dependencies
Fingerprint Publisher: 42 ms
[Pipeline] // withMaven
[Pipeline] echo
[FAILURE-004] hudson.AbortException: script returned exit code 1
[Pipeline] cleanWs
[WS-CLEANUP] Deleting project workspace...
[WS-CLEANUP] Deferred wipeout is used...
[WS-CLEANUP] done
[Pipeline] cleanWs
[WS-CLEANUP] Deleting project workspace...
[WS-CLEANUP] Deferred wipeout is used...
[WS-CLEANUP] done
[Pipeline] }
[Pipeline] // stage
[Pipeline] }
[Pipeline] // node
[Pipeline] }
Failed in branch windows-jdk14
[Pipeline] // parallel
[Pipeline] echo
[FAILURE-003] AbortException hudson.AbortException: script returned exit code 1
[Pipeline] stage
[Pipeline] { (Notifications)
[Pipeline] echo
Build result: FAILURE
[Pipeline] jiraIssueSelector
[Pipeline] echo
The authors of changes [].
[Pipeline] echo
Sending email ...
[Pipeline] emailext
Mime
  • Unnamed multipart/mixed (inline, None, 0 bytes)
View raw message