maven-notifications mailing list archives

Site index · List index
Message view « Date » · « Thread »
Top « Date » · « Thread »
From Apache Jenkins Server <jenk...@builds.apache.org>
Subject Build failed in Jenkins: Maven TLP » maven-site-plugin » dependabot/maven/jettyVersion-9.4.22.v20191022 #2
Date Sat, 09 Nov 2019 14:46:57 GMT
See https://builds.apache.org/job/maven-box/job/maven-site-plugin/job/dependabot%252Fmaven%252FjettyVersion-9.4.22.v20191022/2/

No changes.

No tests ran.

Build log:
[...truncated 3115 lines...]
[INFO] Scanning for projects...
[INFO] 
[INFO] -------------< org.apache.maven.plugins:maven-site-plugin >-------------
[INFO] Building Apache Maven Site Plugin 3.9.0-SNAPSHOT
[INFO] ----------------------------[ maven-plugin ]----------------------------
[INFO] Scanning for projects...
[INFO] 
[INFO] -------------< org.apache.maven.plugins:maven-site-plugin >-------------
[INFO] Building Apache Maven Site Plugin 3.9.0-SNAPSHOT
[INFO] ----------------------------[ maven-plugin ]----------------------------
[INFO] 
[INFO] --- maven-clean-plugin:3.1.0:clean (default-clean) @ maven-site-plugin ---
[INFO] 
[INFO] --- maven-enforcer-plugin:1.4.1:enforce (enforce-maven-version) @ maven-site-plugin
---
[INFO] 
[INFO] --- maven-enforcer-plugin:1.4.1:enforce (enforce-bytecode-version) @ maven-site-plugin
---
[INFO] 
[INFO] --- maven-clean-plugin:3.1.0:clean (default-clean) @ maven-site-plugin ---
[INFO] 
[INFO] --- maven-enforcer-plugin:1.4.1:enforce (enforce-maven-version) @ maven-site-plugin
---
[INFO] 
[INFO] --- maven-enforcer-plugin:1.4.1:enforce (enforce-bytecode-version) @ maven-site-plugin
---
[INFO] Restricted to JDK 1.7 yet org.eclipse.jetty:jetty-util:jar:9.4.22.v20191022:compile
contains org/eclipse/jetty/util/StringUtil$CsvSplitState.class targeted to JDK 1.8
[INFO] Restricted to JDK 1.7 yet org.eclipse.jetty:jetty-http:jar:9.4.22.v20191022:compile
contains org/eclipse/jetty/http/HttpField$IntValueHttpField.class targeted to JDK 1.8
[INFO] Restricted to JDK 1.7 yet org.eclipse.jetty:jetty-server:jar:9.4.22.v20191022:compile
contains org/eclipse/jetty/server/HttpChannel$TransientListeners.class targeted to JDK 1.8
[INFO] Restricted to JDK 1.7 yet org.eclipse.jetty:jetty-xml:jar:9.4.22.v20191022:compile
contains org/eclipse/jetty/xml/XmlParser$Node.class targeted to JDK 1.8
[INFO] Restricted to JDK 1.7 yet org.eclipse.jetty:jetty-io:jar:9.4.22.v20191022:compile contains
org/eclipse/jetty/io/ManagedSelector$Accept.class targeted to JDK 1.8
[INFO] Restricted to JDK 1.7 yet org.eclipse.jetty:jetty-webapp:jar:9.4.22.v20191022:compile
contains org/eclipse/jetty/webapp/WebInfConfiguration$WebAppPathNameMatcher.class targeted
to JDK 1.8
[INFO] Restricted to JDK 1.7 yet org.eclipse.jetty:jetty-security:jar:9.4.22.v20191022:compile
contains org/eclipse/jetty/security/RunAsToken.class targeted to JDK 1.8
[INFO] Restricted to JDK 1.7 yet org.eclipse.jetty:jetty-client:jar:9.4.22.v20191022:test
contains org/eclipse/jetty/client/RoundRobinConnectionPool$Entry.class targeted to JDK 1.8
[INFO] Restricted to JDK 1.7 yet org.eclipse.jetty:jetty-servlet:jar:9.4.22.v20191022:compile
contains org/eclipse/jetty/servlet/ServletHandler.class targeted to JDK 1.8
[INFO] Restricted to JDK 1.7 yet org.eclipse.jetty:jetty-proxy:jar:9.4.22.v20191022:test contains
org/eclipse/jetty/proxy/AfterContentTransformer.class targeted to JDK 1.8
[WARNING] Rule 0: org.apache.maven.plugins.enforcer.EnforceBytecodeVersion failed with message:
Found Banned Dependency: org.eclipse.jetty:jetty-util:jar:9.4.22.v20191022
Found Banned Dependency: org.eclipse.jetty:jetty-http:jar:9.4.22.v20191022
Found Banned Dependency: org.eclipse.jetty:jetty-server:jar:9.4.22.v20191022
Found Banned Dependency: org.eclipse.jetty:jetty-xml:jar:9.4.22.v20191022
Found Banned Dependency: org.eclipse.jetty:jetty-io:jar:9.4.22.v20191022
Found Banned Dependency: org.eclipse.jetty:jetty-webapp:jar:9.4.22.v20191022
Found Banned Dependency: org.eclipse.jetty:jetty-security:jar:9.4.22.v20191022
Found Banned Dependency: org.eclipse.jetty:jetty-client:jar:9.4.22.v20191022
Found Banned Dependency: org.eclipse.jetty:jetty-servlet:jar:9.4.22.v20191022
Found Banned Dependency: org.eclipse.jetty:jetty-proxy:jar:9.4.22.v20191022
Use 'mvn dependency:tree' to locate the source of the banned dependencies.
[INFO] ------------------------------------------------------------------------
[INFO] BUILD FAILURE
[INFO] ------------------------------------------------------------------------
[INFO] Total time:  3.800 s
[INFO] Finished at: 2019-11-09T06:46:55-08:00
[INFO] ------------------------------------------------------------------------
[INFO] [jenkins-event-spy] Generated F:\jenkins\jenkins-slave\workspace\en_jettyVersion-9.4.22.v20191022@2@2@tmp\withMavene92ebab8\maven-spy-20191109-064651-5396717616531458136560.log
[ERROR] Failed to execute goal org.apache.maven.plugins:maven-enforcer-plugin:1.4.1:enforce
(enforce-bytecode-version) on project maven-site-plugin: Some Enforcer rules have failed.
Look above for specific messages explaining why the rule failed. -> [Help 1]
org.apache.maven.lifecycle.LifecycleExecutionException: Failed to execute goal org.apache.maven.plugins:maven-enforcer-plugin:1.4.1:enforce
(enforce-bytecode-version) on project maven-site-plugin: Some Enforcer rules have failed.
Look above for specific messages explaining why the rule failed.
    at org.apache.maven.lifecycle.internal.MojoExecutor.execute (MojoExecutor.java:215)
    at org.apache.maven.lifecycle.internal.MojoExecutor.execute (MojoExecutor.java:156)
    at org.apache.maven.lifecycle.internal.MojoExecutor.execute (MojoExecutor.java:148)
    at org.apache.maven.lifecycle.internal.LifecycleModuleBuilder.buildProject (LifecycleModuleBuilder.java:117)
    at org.apache.maven.lifecycle.internal.LifecycleModuleBuilder.buildProject (LifecycleModuleBuilder.java:81)
    at org.apache.maven.lifecycle.internal.builder.singlethreaded.SingleThreadedBuilder.build
(SingleThreadedBuilder.java:56)
    at org.apache.maven.lifecycle.internal.LifecycleStarter.execute (LifecycleStarter.java:128)
    at org.apache.maven.DefaultMaven.doExecute (DefaultMaven.java:305)
    at org.apache.maven.DefaultMaven.doExecute (DefaultMaven.java:192)
    at org.apache.maven.DefaultMaven.execute (DefaultMaven.java:105)
    at org.apache.maven.cli.MavenCli.execute (MavenCli.java:956)
    at org.apache.maven.cli.MavenCli.doMain (MavenCli.java:288)
    at org.apache.maven.cli.MavenCli.main (MavenCli.java:192)
    at jdk.internal.reflect.NativeMethodAccessorImpl.invoke0 (Native Method)
    at jdk.internal.reflect.NativeMethodAccessorImpl.invoke (NativeMethodAccessorImpl.java:62)
    at jdk.internal.reflect.DelegatingMethodAccessorImpl.invoke (DelegatingMethodAccessorImpl.java:43)
    at java.lang.reflect.Method.invoke (Method.java:567)
    at org.codehaus.plexus.classworlds.launcher.Launcher.launchEnhanced (Launcher.java:282)
    at org.codehaus.plexus.classworlds.launcher.Launcher.launch (Launcher.java:225)
    at org.codehaus.plexus.classworlds.launcher.Launcher.mainWithExitCode (Launcher.java:406)
    at org.codehaus.plexus.classworlds.launcher.Launcher.main (Launcher.java:347)
Caused by: org.apache.maven.plugin.MojoExecutionException: Some Enforcer rules have failed.
Look above for specific messages explaining why the rule failed.
    at org.apache.maven.plugins.enforcer.EnforceMojo.execute (EnforceMojo.java:237)
    at org.apache.maven.plugin.DefaultBuildPluginManager.executeMojo (DefaultBuildPluginManager.java:137)
    at org.apache.maven.lifecycle.internal.MojoExecutor.execute (MojoExecutor.java:210)
    at org.apache.maven.lifecycle.internal.MojoExecutor.execute (MojoExecutor.java:156)
    at org.apache.maven.lifecycle.internal.MojoExecutor.execute (MojoExecutor.java:148)
    at org.apache.maven.lifecycle.internal.LifecycleModuleBuilder.buildProject (LifecycleModuleBuilder.java:117)
    at org.apache.maven.lifecycle.internal.LifecycleModuleBuilder.buildProject (LifecycleModuleBuilder.java:81)
    at org.apache.maven.lifecycle.internal.builder.singlethreaded.SingleThreadedBuilder.build
(SingleThreadedBuilder.java:56)
    at org.apache.maven.lifecycle.internal.LifecycleStarter.execute (LifecycleStarter.java:128)
    at org.apache.maven.DefaultMaven.doExecute (DefaultMaven.java:305)
    at org.apache.maven.DefaultMaven.doExecute (DefaultMaven.java:192)
    at org.apache.maven.DefaultMaven.execute (DefaultMaven.java:105)
    at org.apache.maven.cli.MavenCli.execute (MavenCli.java:956)
    at org.apache.maven.cli.MavenCli.doMain (MavenCli.java:288)
    at org.apache.maven.cli.MavenCli.main (MavenCli.java:192)
    at jdk.internal.reflect.NativeMethodAccessorImpl.invoke0 (Native Method)
    at jdk.internal.reflect.NativeMethodAccessorImpl.invoke (NativeMethodAccessorImpl.java:62)
    at jdk.internal.reflect.DelegatingMethodAccessorImpl.invoke (DelegatingMethodAccessorImpl.java:43)
    at java.lang.reflect.Method.invoke (Method.java:567)
    at org.codehaus.plexus.classworlds.launcher.Launcher.launchEnhanced (Launcher.java:282)
    at org.codehaus.plexus.classworlds.launcher.Launcher.launch (Launcher.java:225)
    at org.codehaus.plexus.classworlds.launcher.Launcher.mainWithExitCode (Launcher.java:406)
    at org.codehaus.plexus.classworlds.launcher.Launcher.main (Launcher.java:347)
[ERROR] 
[ERROR] Re-run Maven using the -X switch to enable full debug logging.
[ERROR] 
[ERROR] For more information about the errors and possible solutions, please read the following
articles:
[ERROR] [Help 1] http://cwiki.apache.org/confluence/display/MAVEN/MojoExecutionException
[Pipeline] }
[Pipeline] // dir
[Pipeline] }
[Fast Archiver] No prior successful build to compare, so performing full copy of artifacts
[withMaven] openTasksPublisher - Scan Tasks for Maven artifact org.apache.maven.plugins:maven-site-plugin:maven-plugin:3.9.0-SNAPSHOT
in source directory windows-jdk12-m3.6.x_build\src\main\java
[TASKS] Scanning folder 'f:\jenkins\jenkins-slave\workspace\en_jettyVersion-9.4.22.v20191022@2@2'
for files matching the pattern 'windows-jdk12-m3.6.x_build\src\main\java\**\*' - excludes:
null
[TASKS] Found 21 files to scan for tasks
[TASKS] Found 8 open tasks.
Skipping warnings blame since pipelines do not have an SCM link.%n
[withMaven] Publishers: Generated Artifacts Publisher: 7 ms, Open Task Scanner Publisher:
229 ms, Dependencies Fingerprint Publisher: 1 ms
[Pipeline] // withMaven
[Pipeline] cleanWs
[WS-CLEANUP] Deleting project workspace...
[WS-CLEANUP] Deferred wipeout is used...
[WS-CLEANUP] done
[Pipeline] cleanWs
[WS-CLEANUP] Deleting project workspace...
[WS-CLEANUP] Deferred wipeout is used...
[WS-CLEANUP] done
[Pipeline] }
[Pipeline] // stage
[Pipeline] }
[Pipeline] // ws
[Pipeline] }
[Pipeline] // node
[Pipeline] }
Failed in branch windows-jdk12-m3.6.x_build
[INFO] Restricted to JDK 1.7 yet org.eclipse.jetty:jetty-util:jar:9.4.22.v20191022:compile
contains org/eclipse/jetty/util/StringUtil$CsvSplitState.class targeted to JDK 1.8
[INFO] Restricted to JDK 1.7 yet org.eclipse.jetty:jetty-http:jar:9.4.22.v20191022:compile
contains org/eclipse/jetty/http/HttpField$IntValueHttpField.class targeted to JDK 1.8
[INFO] Restricted to JDK 1.7 yet org.eclipse.jetty:jetty-server:jar:9.4.22.v20191022:compile
contains org/eclipse/jetty/server/HttpChannel$TransientListeners.class targeted to JDK 1.8
[INFO] Restricted to JDK 1.7 yet org.eclipse.jetty:jetty-xml:jar:9.4.22.v20191022:compile
contains org/eclipse/jetty/xml/XmlParser$Node.class targeted to JDK 1.8
[INFO] Restricted to JDK 1.7 yet org.eclipse.jetty:jetty-io:jar:9.4.22.v20191022:compile contains
org/eclipse/jetty/io/ManagedSelector$Accept.class targeted to JDK 1.8
[INFO] Restricted to JDK 1.7 yet org.eclipse.jetty:jetty-webapp:jar:9.4.22.v20191022:compile
contains org/eclipse/jetty/webapp/WebInfConfiguration$WebAppPathNameMatcher.class targeted
to JDK 1.8
[INFO] Restricted to JDK 1.7 yet org.eclipse.jetty:jetty-security:jar:9.4.22.v20191022:compile
contains org/eclipse/jetty/security/RunAsToken.class targeted to JDK 1.8
[INFO] Restricted to JDK 1.7 yet org.eclipse.jetty:jetty-client:jar:9.4.22.v20191022:test
contains org/eclipse/jetty/client/RoundRobinConnectionPool$Entry.class targeted to JDK 1.8
[INFO] Restricted to JDK 1.7 yet org.eclipse.jetty:jetty-servlet:jar:9.4.22.v20191022:compile
contains org/eclipse/jetty/servlet/ServletHandler.class targeted to JDK 1.8
[INFO] Restricted to JDK 1.7 yet org.eclipse.jetty:jetty-proxy:jar:9.4.22.v20191022:test contains
org/eclipse/jetty/proxy/AfterContentTransformer.class targeted to JDK 1.8
[WARNING] Rule 0: org.apache.maven.plugins.enforcer.EnforceBytecodeVersion failed with message:
Found Banned Dependency: org.eclipse.jetty:jetty-util:jar:9.4.22.v20191022
Found Banned Dependency: org.eclipse.jetty:jetty-http:jar:9.4.22.v20191022
Found Banned Dependency: org.eclipse.jetty:jetty-server:jar:9.4.22.v20191022
Found Banned Dependency: org.eclipse.jetty:jetty-xml:jar:9.4.22.v20191022
Found Banned Dependency: org.eclipse.jetty:jetty-io:jar:9.4.22.v20191022
Found Banned Dependency: org.eclipse.jetty:jetty-webapp:jar:9.4.22.v20191022
Found Banned Dependency: org.eclipse.jetty:jetty-security:jar:9.4.22.v20191022
Found Banned Dependency: org.eclipse.jetty:jetty-client:jar:9.4.22.v20191022
Found Banned Dependency: org.eclipse.jetty:jetty-servlet:jar:9.4.22.v20191022
Found Banned Dependency: org.eclipse.jetty:jetty-proxy:jar:9.4.22.v20191022
Use 'mvn dependency:tree' to locate the source of the banned dependencies.
[INFO] ------------------------------------------------------------------------
[INFO] BUILD FAILURE
[INFO] ------------------------------------------------------------------------
[INFO] Total time:  3.967 s
[INFO] Finished at: 2019-11-09T06:46:56-08:00
[INFO] ------------------------------------------------------------------------
[INFO] [jenkins-event-spy] Generated F:\jenkins\jenkins-slave\workspace\en_jettyVersion-9.4.22.v20191022@2@tmp\withMaven897a56f3\maven-spy-20191109-064651-88914710506680024513436.log
[ERROR] Failed to execute goal org.apache.maven.plugins:maven-enforcer-plugin:1.4.1:enforce
(enforce-bytecode-version) on project maven-site-plugin: Some Enforcer rules have failed.
Look above for specific messages explaining why the rule failed. -> [Help 1]
org.apache.maven.lifecycle.LifecycleExecutionException: Failed to execute goal org.apache.maven.plugins:maven-enforcer-plugin:1.4.1:enforce
(enforce-bytecode-version) on project maven-site-plugin: Some Enforcer rules have failed.
Look above for specific messages explaining why the rule failed.
    at org.apache.maven.lifecycle.internal.MojoExecutor.execute (MojoExecutor.java:215)
    at org.apache.maven.lifecycle.internal.MojoExecutor.execute (MojoExecutor.java:156)
    at org.apache.maven.lifecycle.internal.MojoExecutor.execute (MojoExecutor.java:148)
    at org.apache.maven.lifecycle.internal.LifecycleModuleBuilder.buildProject (LifecycleModuleBuilder.java:117)
    at org.apache.maven.lifecycle.internal.LifecycleModuleBuilder.buildProject (LifecycleModuleBuilder.java:81)
    at org.apache.maven.lifecycle.internal.builder.singlethreaded.SingleThreadedBuilder.build
(SingleThreadedBuilder.java:56)
    at org.apache.maven.lifecycle.internal.LifecycleStarter.execute (LifecycleStarter.java:128)
    at org.apache.maven.DefaultMaven.doExecute (DefaultMaven.java:305)
    at org.apache.maven.DefaultMaven.doExecute (DefaultMaven.java:192)
    at org.apache.maven.DefaultMaven.execute (DefaultMaven.java:105)
    at org.apache.maven.cli.MavenCli.execute (MavenCli.java:956)
    at org.apache.maven.cli.MavenCli.doMain (MavenCli.java:288)
    at org.apache.maven.cli.MavenCli.main (MavenCli.java:192)
    at jdk.internal.reflect.NativeMethodAccessorImpl.invoke0 (Native Method)
    at jdk.internal.reflect.NativeMethodAccessorImpl.invoke (NativeMethodAccessorImpl.java:62)
    at jdk.internal.reflect.DelegatingMethodAccessorImpl.invoke (DelegatingMethodAccessorImpl.java:43)
    at java.lang.reflect.Method.invoke (Method.java:566)
    at org.codehaus.plexus.classworlds.launcher.Launcher.launchEnhanced (Launcher.java:282)
    at org.codehaus.plexus.classworlds.launcher.Launcher.launch (Launcher.java:225)
    at org.codehaus.plexus.classworlds.launcher.Launcher.mainWithExitCode (Launcher.java:406)
    at org.codehaus.plexus.classworlds.launcher.Launcher.main (Launcher.java:347)
Caused by: org.apache.maven.plugin.MojoExecutionException: Some Enforcer rules have failed.
Look above for specific messages explaining why the rule failed.
    at org.apache.maven.plugins.enforcer.EnforceMojo.execute (EnforceMojo.java:237)
    at org.apache.maven.plugin.DefaultBuildPluginManager.executeMojo (DefaultBuildPluginManager.java:137)
    at org.apache.maven.lifecycle.internal.MojoExecutor.execute (MojoExecutor.java:210)
    at org.apache.maven.lifecycle.internal.MojoExecutor.execute (MojoExecutor.java:156)
    at org.apache.maven.lifecycle.internal.MojoExecutor.execute (MojoExecutor.java:148)
    at org.apache.maven.lifecycle.internal.LifecycleModuleBuilder.buildProject (LifecycleModuleBuilder.java:117)
    at org.apache.maven.lifecycle.internal.LifecycleModuleBuilder.buildProject (LifecycleModuleBuilder.java:81)
    at org.apache.maven.lifecycle.internal.builder.singlethreaded.SingleThreadedBuilder.build
(SingleThreadedBuilder.java:56)
    at org.apache.maven.lifecycle.internal.LifecycleStarter.execute (LifecycleStarter.java:128)
    at org.apache.maven.DefaultMaven.doExecute (DefaultMaven.java:305)
    at org.apache.maven.DefaultMaven.doExecute (DefaultMaven.java:192)
    at org.apache.maven.DefaultMaven.execute (DefaultMaven.java:105)
    at org.apache.maven.cli.MavenCli.execute (MavenCli.java:956)
    at org.apache.maven.cli.MavenCli.doMain (MavenCli.java:288)
    at org.apache.maven.cli.MavenCli.main (MavenCli.java:192)
    at jdk.internal.reflect.NativeMethodAccessorImpl.invoke0 (Native Method)
    at jdk.internal.reflect.NativeMethodAccessorImpl.invoke (NativeMethodAccessorImpl.java:62)
    at jdk.internal.reflect.DelegatingMethodAccessorImpl.invoke (DelegatingMethodAccessorImpl.java:43)
    at java.lang.reflect.Method.invoke (Method.java:566)
    at org.codehaus.plexus.classworlds.launcher.Launcher.launchEnhanced (Launcher.java:282)
    at org.codehaus.plexus.classworlds.launcher.Launcher.launch (Launcher.java:225)
    at org.codehaus.plexus.classworlds.launcher.Launcher.mainWithExitCode (Launcher.java:406)
    at org.codehaus.plexus.classworlds.launcher.Launcher.main (Launcher.java:347)
[ERROR] 
[ERROR] Re-run Maven using the -X switch to enable full debug logging.
[ERROR] 
[ERROR] For more information about the errors and possible solutions, please read the following
articles:
[ERROR] [Help 1] http://cwiki.apache.org/confluence/display/MAVEN/MojoExecutionException
[Pipeline] }
[Pipeline] // dir
[Pipeline] }
[Fast Archiver] No prior successful build to compare, so performing full copy of artifacts
[withMaven] openTasksPublisher - Scan Tasks for Maven artifact org.apache.maven.plugins:maven-site-plugin:maven-plugin:3.9.0-SNAPSHOT
in source directory windows-jdk11-m3.6.x_build\src\main\java
[TASKS] Scanning folder 'f:\jenkins\jenkins-slave\workspace\en_jettyVersion-9.4.22.v20191022@2'
for files matching the pattern 'windows-jdk11-m3.6.x_build\src\main\java\**\*' - excludes:
null
[TASKS] Found 21 files to scan for tasks
[TASKS] Found 8 open tasks.
Skipping warnings blame since pipelines do not have an SCM link.%n
[withMaven] Publishers: Generated Artifacts Publisher: 8 ms, Open Task Scanner Publisher:
276 ms, Dependencies Fingerprint Publisher: 1 ms
[Pipeline] // withMaven
[Pipeline] cleanWs
[WS-CLEANUP] Deleting project workspace...
[WS-CLEANUP] Deferred wipeout is used...
[WS-CLEANUP] done
[Pipeline] cleanWs
[WS-CLEANUP] Deleting project workspace...
[WS-CLEANUP] Deferred wipeout is used...
[WS-CLEANUP] done
[Pipeline] }
[Pipeline] // stage
[Pipeline] }
[Pipeline] // ws
[Pipeline] }
[Pipeline] // node
[Pipeline] }
Failed in branch windows-jdk11-m3.6.x_build
[Pipeline] // parallel
[Pipeline] stage
[Pipeline] { (Notifications)
[Pipeline] echo
Build result: FAILURE
[Pipeline] jiraIssueSelector
[Pipeline] echo
The authors of changes [].
[Pipeline] echo
Sending email ...
[Pipeline] emailext
Mime
  • Unnamed multipart/mixed (inline, None, 0 bytes)
View raw message