maven-notifications mailing list archives

Site index · List index
Message view « Date » · « Thread »
Top « Date » · « Thread »
From Apache Jenkins Server <jenk...@builds.apache.org>
Subject Build failed in Jenkins: Maven TLP » maven-compiler-plugin » it_fix #27
Date Wed, 01 Jan 2020 00:53:53 GMT
See https://builds.apache.org/job/maven-box/job/maven-compiler-plugin/job/it_fix/27/

No changes.

24 tests failed.
FAILED:  org.apache.maven.plugin.compiler.CompilerMojoTestCase.linux-jdk14-m3.6.x_build /
Build linux-jdk14-m3.6.x_build / testCompilerBasic

Error Message:
Compilation failure

Stack Trace:
org.apache.maven.plugin.compiler.CompilationFailureException: Compilation failure
	at org.apache.maven.plugin.compiler.CompilerMojoTestCase.testCompilerBasic(CompilerMojoTestCase.java:90)


FAILED:  org.apache.maven.plugin.compiler.CompilerMojoTestCase.linux-jdk14-m3.6.x_build /
Build linux-jdk14-m3.6.x_build / testCompilerIncludesExcludes

Error Message:
Compilation failure

Stack Trace:
org.apache.maven.plugin.compiler.CompilationFailureException: Compilation failure
	at org.apache.maven.plugin.compiler.CompilerMojoTestCase.testCompilerIncludesExcludes(CompilerMojoTestCase.java:173)


FAILED:  org.apache.maven.plugin.compiler.CompilerMojoTestCase.linux-jdk14-m3.6.x_build /
Build linux-jdk14-m3.6.x_build / testCompileSkipMain

Error Message:
Compilation failure

Stack Trace:
org.apache.maven.plugin.compiler.CompilationFailureException: Compilation failure
	at org.apache.maven.plugin.compiler.CompilerMojoTestCase.testCompileSkipMain(CompilerMojoTestCase.java:359)


FAILED:  org.apache.maven.plugin.compiler.CompilerMojoTestCase.linux-jdk14-m3.6.x_build /
Build linux-jdk14-m3.6.x_build / testCompileSkipTest

Error Message:
Compilation failure

Stack Trace:
org.apache.maven.plugin.compiler.CompilationFailureException: Compilation failure
	at org.apache.maven.plugin.compiler.CompilerMojoTestCase.testCompileSkipTest(CompilerMojoTestCase.java:373)


FAILED:  org.apache.maven.plugin.compiler.CompilerMojoTestCase.linux-jdk14-m3.6.x_build /
Build linux-jdk14-m3.6.x_build / testCompilerBasicSourceTarget

Error Message:
Compilation failure

Stack Trace:
org.apache.maven.plugin.compiler.CompilationFailureException: Compilation failure
	at org.apache.maven.plugin.compiler.CompilerMojoTestCase.testCompilerBasicSourceTarget(CompilerMojoTestCase.java:121)


FAILED:  org.apache.maven.plugin.compiler.CompilerMojoTestCase.linux-jdk14-m3.6.x_build /
Build linux-jdk14-m3.6.x_build / testCompilerFork

Error Message:
Compilation failure

Stack Trace:
org.apache.maven.plugin.compiler.CompilationFailureException: Compilation failure
	at org.apache.maven.plugin.compiler.CompilerMojoTestCase.testCompilerFork(CompilerMojoTestCase.java:215)


FAILED:  org.apache.maven.plugin.compiler.CompilerMojoTestCase.linux-jdk13-m3.6.x_build /
Build linux-jdk13-m3.6.x_build / testCompilerBasic

Error Message:
Compilation failure

Stack Trace:
org.apache.maven.plugin.compiler.CompilationFailureException: Compilation failure
	at org.apache.maven.plugin.compiler.CompilerMojoTestCase.testCompilerBasic(CompilerMojoTestCase.java:90)


FAILED:  org.apache.maven.plugin.compiler.CompilerMojoTestCase.linux-jdk13-m3.6.x_build /
Build linux-jdk13-m3.6.x_build / testCompilerIncludesExcludes

Error Message:
Compilation failure

Stack Trace:
org.apache.maven.plugin.compiler.CompilationFailureException: Compilation failure
	at org.apache.maven.plugin.compiler.CompilerMojoTestCase.testCompilerIncludesExcludes(CompilerMojoTestCase.java:173)


FAILED:  org.apache.maven.plugin.compiler.CompilerMojoTestCase.linux-jdk13-m3.6.x_build /
Build linux-jdk13-m3.6.x_build / testCompileSkipMain

Error Message:
Compilation failure

Stack Trace:
org.apache.maven.plugin.compiler.CompilationFailureException: Compilation failure
	at org.apache.maven.plugin.compiler.CompilerMojoTestCase.testCompileSkipMain(CompilerMojoTestCase.java:359)


FAILED:  org.apache.maven.plugin.compiler.CompilerMojoTestCase.linux-jdk13-m3.6.x_build /
Build linux-jdk13-m3.6.x_build / testCompileSkipTest

Error Message:
Compilation failure

Stack Trace:
org.apache.maven.plugin.compiler.CompilationFailureException: Compilation failure
	at org.apache.maven.plugin.compiler.CompilerMojoTestCase.testCompileSkipTest(CompilerMojoTestCase.java:373)


FAILED:  org.apache.maven.plugin.compiler.CompilerMojoTestCase.linux-jdk13-m3.6.x_build /
Build linux-jdk13-m3.6.x_build / testCompilerBasicSourceTarget

Error Message:
Compilation failure

Stack Trace:
org.apache.maven.plugin.compiler.CompilationFailureException: Compilation failure
	at org.apache.maven.plugin.compiler.CompilerMojoTestCase.testCompilerBasicSourceTarget(CompilerMojoTestCase.java:121)


FAILED:  org.apache.maven.plugin.compiler.CompilerMojoTestCase.linux-jdk13-m3.6.x_build /
Build linux-jdk13-m3.6.x_build / testCompilerFork

Error Message:
Compilation failure

Stack Trace:
org.apache.maven.plugin.compiler.CompilationFailureException: Compilation failure
	at org.apache.maven.plugin.compiler.CompilerMojoTestCase.testCompilerFork(CompilerMojoTestCase.java:215)


FAILED:  org.apache.maven.plugin.compiler.CompilerMojoTestCase.windows-jdk13-m3.6.x_build
/ Build windows-jdk13-m3.6.x_build / testCompilerBasic

Error Message:
Compilation failure

Stack Trace:
org.apache.maven.plugin.compiler.CompilationFailureException: Compilation failure
	at org.apache.maven.plugin.compiler.CompilerMojoTestCase.testCompilerBasic(CompilerMojoTestCase.java:90)


FAILED:  org.apache.maven.plugin.compiler.CompilerMojoTestCase.windows-jdk13-m3.6.x_build
/ Build windows-jdk13-m3.6.x_build / testCompilerIncludesExcludes

Error Message:
Compilation failure

Stack Trace:
org.apache.maven.plugin.compiler.CompilationFailureException: Compilation failure
	at org.apache.maven.plugin.compiler.CompilerMojoTestCase.testCompilerIncludesExcludes(CompilerMojoTestCase.java:173)


FAILED:  org.apache.maven.plugin.compiler.CompilerMojoTestCase.windows-jdk13-m3.6.x_build
/ Build windows-jdk13-m3.6.x_build / testCompileSkipMain

Error Message:
Compilation failure

Stack Trace:
org.apache.maven.plugin.compiler.CompilationFailureException: Compilation failure
	at org.apache.maven.plugin.compiler.CompilerMojoTestCase.testCompileSkipMain(CompilerMojoTestCase.java:359)


FAILED:  org.apache.maven.plugin.compiler.CompilerMojoTestCase.windows-jdk13-m3.6.x_build
/ Build windows-jdk13-m3.6.x_build / testCompileSkipTest

Error Message:
Compilation failure

Stack Trace:
org.apache.maven.plugin.compiler.CompilationFailureException: Compilation failure
	at org.apache.maven.plugin.compiler.CompilerMojoTestCase.testCompileSkipTest(CompilerMojoTestCase.java:373)


FAILED:  org.apache.maven.plugin.compiler.CompilerMojoTestCase.windows-jdk13-m3.6.x_build
/ Build windows-jdk13-m3.6.x_build / testCompilerBasicSourceTarget

Error Message:
Compilation failure

Stack Trace:
org.apache.maven.plugin.compiler.CompilationFailureException: Compilation failure
	at org.apache.maven.plugin.compiler.CompilerMojoTestCase.testCompilerBasicSourceTarget(CompilerMojoTestCase.java:121)


FAILED:  org.apache.maven.plugin.compiler.CompilerMojoTestCase.windows-jdk13-m3.6.x_build
/ Build windows-jdk13-m3.6.x_build / testCompilerFork

Error Message:
Compilation failure

Stack Trace:
org.apache.maven.plugin.compiler.CompilationFailureException: Compilation failure
	at org.apache.maven.plugin.compiler.CompilerMojoTestCase.testCompilerFork(CompilerMojoTestCase.java:215)


FAILED:  org.apache.maven.plugin.compiler.CompilerMojoTestCase.windows-jdk14-m3.6.x_build
/ Build windows-jdk14-m3.6.x_build / testCompilerBasic

Error Message:
Compilation failure

Stack Trace:
org.apache.maven.plugin.compiler.CompilationFailureException: Compilation failure
	at org.apache.maven.plugin.compiler.CompilerMojoTestCase.testCompilerBasic(CompilerMojoTestCase.java:90)


FAILED:  org.apache.maven.plugin.compiler.CompilerMojoTestCase.windows-jdk14-m3.6.x_build
/ Build windows-jdk14-m3.6.x_build / testCompilerIncludesExcludes

Error Message:
Compilation failure

Stack Trace:
org.apache.maven.plugin.compiler.CompilationFailureException: Compilation failure
	at org.apache.maven.plugin.compiler.CompilerMojoTestCase.testCompilerIncludesExcludes(CompilerMojoTestCase.java:173)


FAILED:  org.apache.maven.plugin.compiler.CompilerMojoTestCase.windows-jdk14-m3.6.x_build
/ Build windows-jdk14-m3.6.x_build / testCompileSkipMain

Error Message:
Compilation failure

Stack Trace:
org.apache.maven.plugin.compiler.CompilationFailureException: Compilation failure
	at org.apache.maven.plugin.compiler.CompilerMojoTestCase.testCompileSkipMain(CompilerMojoTestCase.java:359)


FAILED:  org.apache.maven.plugin.compiler.CompilerMojoTestCase.windows-jdk14-m3.6.x_build
/ Build windows-jdk14-m3.6.x_build / testCompileSkipTest

Error Message:
Compilation failure

Stack Trace:
org.apache.maven.plugin.compiler.CompilationFailureException: Compilation failure
	at org.apache.maven.plugin.compiler.CompilerMojoTestCase.testCompileSkipTest(CompilerMojoTestCase.java:373)


FAILED:  org.apache.maven.plugin.compiler.CompilerMojoTestCase.windows-jdk14-m3.6.x_build
/ Build windows-jdk14-m3.6.x_build / testCompilerBasicSourceTarget

Error Message:
Compilation failure

Stack Trace:
org.apache.maven.plugin.compiler.CompilationFailureException: Compilation failure
	at org.apache.maven.plugin.compiler.CompilerMojoTestCase.testCompilerBasicSourceTarget(CompilerMojoTestCase.java:121)


FAILED:  org.apache.maven.plugin.compiler.CompilerMojoTestCase.windows-jdk14-m3.6.x_build
/ Build windows-jdk14-m3.6.x_build / testCompilerFork

Error Message:
Compilation failure

Stack Trace:
org.apache.maven.plugin.compiler.CompilationFailureException: Compilation failure
	at org.apache.maven.plugin.compiler.CompilerMojoTestCase.testCompilerFork(CompilerMojoTestCase.java:215)




Build log:
[...truncated 25473 lines...]
         F:\jenkins\jenkins-slave\workspace\box_maven-compiler-plugin_it_fix@2\windows-jdk14-m3.6.x_build\target\it\MCOMPILER-275_separate-moduleinfo\src\main\java
         F:\jenkins\jenkins-slave\workspace\box_maven-compiler-plugin_it_fix@2\windows-jdk14-m3.6.x_build\target\it\MCOMPILER-275_separate-moduleinfo\target\generated-sources\annotations
       [DEBUG] CompilerReuseStrategy: reuseCreated
       [DEBUG] useIncrementalCompilation enabled
       [DEBUG] New dependency detected: F:\jenkins\jenkins-slave\workspace\box_maven-compiler-plugin_it_fix@2\windows-jdk14-m3.6.x_build\target\it\MCOMPILER-275_separate-moduleinfo\target\classes
       [INFO] Changes detected - recompiling the module!
       [DEBUG] Classpath:
       [DEBUG]  F:\jenkins\jenkins-slave\workspace\box_maven-compiler-plugin_it_fix@2\windows-jdk14-m3.6.x_build\target\it\MCOMPILER-275_separate-moduleinfo\target\classes
       [DEBUG] Source roots:
       [DEBUG]  F:\jenkins\jenkins-slave\workspace\box_maven-compiler-plugin_it_fix@2\windows-jdk14-m3.6.x_build\target\it\MCOMPILER-275_separate-moduleinfo\src\main\java
       [DEBUG]  F:\jenkins\jenkins-slave\workspace\box_maven-compiler-plugin_it_fix@2\windows-jdk14-m3.6.x_build\target\it\MCOMPILER-275_separate-moduleinfo\target\generated-sources\annotations
       [DEBUG] Command line options:
       [DEBUG] -d F:\jenkins\jenkins-slave\workspace\box_maven-compiler-plugin_it_fix@2\windows-jdk14-m3.6.x_build\target\it\MCOMPILER-275_separate-moduleinfo\target\classes
-classpath F:\jenkins\jenkins-slave\workspace\box_maven-compiler-plugin_it_fix@2\windows-jdk14-m3.6.x_build\target\it\MCOMPILER-275_separate-moduleinfo\target\classes;
-sourcepath F:\jenkins\jenkins-slave\workspace\box_maven-compiler-plugin_it_fix@2\windows-jdk14-m3.6.x_build\target\it\MCOMPILER-275_separate-moduleinfo\src\main\java;F:\jenkins\jenkins-slave\workspace\box_maven-compiler-plugin_it_fix@2\windows-jdk14-m3.6.x_build\target\it\MCOMPILER-275_separate-moduleinfo\target\generated-sources\annotations;F:\jenkins\jenkins-slave\workspace\box_maven-compiler-plugin_it_fix@2\windows-jdk14-m3.6.x_build\target\it\MCOMPILER-275_separate-moduleinfo\target\generated-sources\annotations;
-s F:\jenkins\jenkins-slave\workspace\box_maven-compiler-plugin_it_fix@2\windows-jdk14-m3.6.x_build\target\it\MCOMPILER-275_separate-moduleinfo\target\generated-sources\annotations
-g -nowarn -target 1.6 -source 1.6 -encoding UTF-8
       [DEBUG] incrementalBuildHelper#beforeRebuildExecution
       [INFO] Compiling 1 source file to F:\jenkins\jenkins-slave\workspace\box_maven-compiler-plugin_it_fix@2\windows-jdk14-m3.6.x_build\target\it\MCOMPILER-275_separate-moduleinfo\target\classes
       [DEBUG] incrementalBuildHelper#afterRebuildExecution
       [INFO] -------------------------------------------------------------
       [ERROR] COMPILATION ERROR : 
       [INFO] -------------------------------------------------------------
       [ERROR] Source option 6 is no longer supported. Use 7 or later.
       [ERROR] Target option 6 is no longer supported. Use 7 or later.
       [INFO] 2 errors 
       [INFO] -------------------------------------------------------------
       [INFO] ------------------------------------------------------------------------
       [INFO] BUILD FAILURE
       [INFO] ------------------------------------------------------------------------
       [INFO] Total time:  2.367 s
       [INFO] Finished at: 2019-12-31T16:50:54-08:00
       [INFO] ------------------------------------------------------------------------
       [ERROR] Failed to execute goal org.apache.maven.plugins:maven-compiler-plugin:3.8.1-SNAPSHOT:compile
(base-compile) on project mcompiler270: Compilation failure: Compilation failure: 
       [ERROR] Source option 6 is no longer supported. Use 7 or later.
       [ERROR] Target option 6 is no longer supported. Use 7 or later.
       [ERROR] -> [Help 1]
       org.apache.maven.lifecycle.LifecycleExecutionException: Failed to execute goal org.apache.maven.plugins:maven-compiler-plugin:3.8.1-SNAPSHOT:compile
(base-compile) on project mcompiler270: Compilation failure
           at org.apache.maven.lifecycle.internal.MojoExecutor.execute (MojoExecutor.java:215)
           at org.apache.maven.lifecycle.internal.MojoExecutor.execute (MojoExecutor.java:156)
           at org.apache.maven.lifecycle.internal.MojoExecutor.execute (MojoExecutor.java:148)
           at org.apache.maven.lifecycle.internal.LifecycleModuleBuilder.buildProject (LifecycleModuleBuilder.java:117)
           at org.apache.maven.lifecycle.internal.LifecycleModuleBuilder.buildProject (LifecycleModuleBuilder.java:81)
           at org.apache.maven.lifecycle.internal.builder.singlethreaded.SingleThreadedBuilder.build
(SingleThreadedBuilder.java:56)
           at org.apache.maven.lifecycle.internal.LifecycleStarter.execute (LifecycleStarter.java:128)
           at org.apache.maven.DefaultMaven.doExecute (DefaultMaven.java:305)
           at org.apache.maven.DefaultMaven.doExecute (DefaultMaven.java:192)
           at org.apache.maven.DefaultMaven.execute (DefaultMaven.java:105)
           at org.apache.maven.cli.MavenCli.execute (MavenCli.java:956)
           at org.apache.maven.cli.MavenCli.doMain (MavenCli.java:288)
           at org.apache.maven.cli.MavenCli.main (MavenCli.java:192)
           at jdk.internal.reflect.NativeMethodAccessorImpl.invoke0 (Native Method)
           at jdk.internal.reflect.NativeMethodAccessorImpl.invoke (NativeMethodAccessorImpl.java:62)
           at jdk.internal.reflect.DelegatingMethodAccessorImpl.invoke (DelegatingMethodAccessorImpl.java:43)
           at java.lang.reflect.Method.invoke (Method.java:567)
           at org.codehaus.plexus.classworlds.launcher.Launcher.launchEnhanced (Launcher.java:282)
           at org.codehaus.plexus.classworlds.launcher.Launcher.launch (Launcher.java:225)
           at org.codehaus.plexus.classworlds.launcher.Launcher.mainWithExitCode (Launcher.java:406)
           at org.codehaus.plexus.classworlds.launcher.Launcher.main (Launcher.java:347)
       Caused by: org.apache.maven.plugin.compiler.CompilationFailureException: Compilation
failure
           at org.apache.maven.plugin.compiler.AbstractCompilerMojo.execute (AbstractCompilerMojo.java:1215)
           at org.apache.maven.plugin.compiler.CompilerMojo.execute (CompilerMojo.java:187)
           at org.apache.maven.plugin.DefaultBuildPluginManager.executeMojo (DefaultBuildPluginManager.java:137)
           at org.apache.maven.lifecycle.internal.MojoExecutor.execute (MojoExecutor.java:210)
           at org.apache.maven.lifecycle.internal.MojoExecutor.execute (MojoExecutor.java:156)
           at org.apache.maven.lifecycle.internal.MojoExecutor.execute (MojoExecutor.java:148)
           at org.apache.maven.lifecycle.internal.LifecycleModuleBuilder.buildProject (LifecycleModuleBuilder.java:117)
           at org.apache.maven.lifecycle.internal.LifecycleModuleBuilder.buildProject (LifecycleModuleBuilder.java:81)
           at org.apache.maven.lifecycle.internal.builder.singlethreaded.SingleThreadedBuilder.build
(SingleThreadedBuilder.java:56)
           at org.apache.maven.lifecycle.internal.LifecycleStarter.execute (LifecycleStarter.java:128)
           at org.apache.maven.DefaultMaven.doExecute (DefaultMaven.java:305)
           at org.apache.maven.DefaultMaven.doExecute (DefaultMaven.java:192)
           at org.apache.maven.DefaultMaven.execute (DefaultMaven.java:105)
           at org.apache.maven.cli.MavenCli.execute (MavenCli.java:956)
           at org.apache.maven.cli.MavenCli.doMain (MavenCli.java:288)
           at org.apache.maven.cli.MavenCli.main (MavenCli.java:192)
           at jdk.internal.reflect.NativeMethodAccessorImpl.invoke0 (Native Method)
           at jdk.internal.reflect.NativeMethodAccessorImpl.invoke (NativeMethodAccessorImpl.java:62)
           at jdk.internal.reflect.DelegatingMethodAccessorImpl.invoke (DelegatingMethodAccessorImpl.java:43)
           at java.lang.reflect.Method.invoke (Method.java:567)
           at org.codehaus.plexus.classworlds.launcher.Launcher.launchEnhanced (Launcher.java:282)
           at org.codehaus.plexus.classworlds.launcher.Launcher.launch (Launcher.java:225)
           at org.codehaus.plexus.classworlds.launcher.Launcher.mainWithExitCode (Launcher.java:406)
           at org.codehaus.plexus.classworlds.launcher.Launcher.main (Launcher.java:347)
       [ERROR] 
       [ERROR] 
       [ERROR] For more information about the errors and possible solutions, please read the
following articles:
       [ERROR] [Help 1] http://cwiki.apache.org/confluence/display/MAVEN/MojoFailureException
       Running post-build script: f:\jenkins\jenkins-slave\workspace\box_maven-compiler-plugin_it_fix@2\windows-jdk14-m3.6.x_build\target\it\MCOMPILER-275_separate-moduleinfo\verify.groovy
[INFO] Building: MCOMPILER-284\pom.xml
[INFO] run post-build script verify.bsh
[INFO]           MCOMPILER-284\pom.xml ............................ SUCCESS (3.3 s)
[INFO] Building: MCOMPILER-294\pom.xml
[INFO]           MCOMPILER-294\pom.xml ............................ SUCCESS (4.6 s)
[INFO] Building: MCOMPILER-298\pom.xml
[INFO]           MCOMPILER-298\pom.xml ............................ SUCCESS (7.2 s)
[INFO] Building: MCOMPILER-321_pathexceptions\pom.xml
[INFO] run post-build script verify.groovy
[INFO]           MCOMPILER-321_pathexceptions\pom.xml ............. SUCCESS (5.4 s)
[INFO] Building: MCOMPILER-328_multiReleaseOutput\pom.xml
[INFO] run post-build script verify.groovy
[INFO]           MCOMPILER-328_multiReleaseOutput\pom.xml ......... SUCCESS (4.9 s)
[INFO] Building: MCOMPILER-332_release10\pom.xml
[INFO] run post-build script verify.groovy
[INFO]           MCOMPILER-332_release10\pom.xml .................. SUCCESS (5.0 s)
[INFO] Building: MCOMPILER-336_incremental-modulepath\pom.xml
[INFO]           MCOMPILER-336_incremental-modulepath\pom.xml ..... SUCCESS (11.3 s)
[INFO] Building: MCOMPILER-349_dependencyChanged\pom.xml
[INFO] run post-build script verify.groovy
[INFO]           MCOMPILER-349_dependencyChanged\pom.xml .......... SUCCESS (18.6 s)
[INFO] Building: MCOMPILER-360\pom.xml
[INFO]           MCOMPILER-360\pom.xml ............................ SUCCESS (4.7 s)
[INFO] Building: multirelease-patterns\multimodule\pom.xml
[INFO] run post-build script verify.groovy
[INFO]           multirelease-patterns\multimodule\pom.xml ........ SUCCESS (17.4 s)
[INFO] Building: multirelease-patterns\multiproject\pom.xml
[INFO] run post-build script verify.groovy
[INFO]           multirelease-patterns\multiproject\pom.xml ....... SUCCESS (34.4 s)
[INFO] Building: multirelease-patterns\packaging-plugin\pom.xml
[INFO] run post-build script verify.groovy
[INFO]           multirelease-patterns\packaging-plugin\pom.xml ... SUCCESS (17.1 s)
[INFO] Building: multirelease-patterns\singleproject-runtime\pom.xml
[INFO] run post-build script verify.groovy
[INFO]           multirelease-patterns\singleproject-runtime\pom.xml SUCCESS (9.1 s)
[INFO] Building: non-english-warnings\pom.xml
[INFO] run post-build script verify.bsh
[INFO]           non-english-warnings\pom.xml ..................... SUCCESS (4.4 s)
[INFO] Building: test1\pom.xml
[INFO]           test1\pom.xml .................................... SUCCESS (4.3 s)
[INFO] 
[INFO] --- maven-checkstyle-plugin:3.0.0:check (checkstyle-check) @ maven-compiler-plugin
---
[INFO] There are 2 errors reported by Checkstyle 6.18 with config/maven_checks.xml ruleset.
[INFO] Ignored 2 errors, 0 violation remaining.
[INFO] 
[INFO] --- maven-invoker-plugin:3.1.0:verify (integration-test) @ maven-compiler-plugin ---
[INFO] -------------------------------------------------
[INFO] Build Summary:
[INFO]   Passed: 41, Failed: 11, Errors: 0, Skipped: 2
[INFO] -------------------------------------------------
[ERROR] The following builds failed:
[ERROR] *  error-prone-compiler\pom.xml
[ERROR] *  jdk16-annotation\pom.xml
[ERROR] *  mcompiler-120\pom.xml
[ERROR] *  mcompiler-135\pom.xml
[ERROR] *  MCOMPILER-157\pom.xml
[ERROR] *  mcompiler-179\pom.xml
[ERROR] *  MCOMPILER-203-processorpath\pom.xml
[ERROR] *  MCOMPILER-224\pom.xml
[ERROR] *  MCOMPILER-260_customArguments\pom.xml
[ERROR] *  MCOMPILER-270_release\pom.xml
[ERROR] *  MCOMPILER-275_separate-moduleinfo\pom.xml
[INFO] -------------------------------------------------
[INFO] ------------------------------------------------------------------------
[INFO] BUILD FAILURE
[INFO] ------------------------------------------------------------------------
[INFO] Total time:  06:51 min
[INFO] Finished at: 2019-12-31T16:53:28-08:00
[INFO] ------------------------------------------------------------------------
[INFO] [jenkins-event-spy] Generated F:\jenkins\jenkins-slave\workspace\box_maven-compiler-plugin_it_fix@2@tmp\withMavenf737402b\maven-spy-20191231-164636-66716499488100725453455.log
[ERROR] Failed to execute goal org.apache.maven.plugins:maven-invoker-plugin:3.1.0:verify
(integration-test) on project maven-compiler-plugin: 11 builds failed. See console output
above for details. -> [Help 1]
org.apache.maven.lifecycle.LifecycleExecutionException: Failed to execute goal org.apache.maven.plugins:maven-invoker-plugin:3.1.0:verify
(integration-test) on project maven-compiler-plugin: 11 builds failed. See console output
above for details.
    at org.apache.maven.lifecycle.internal.MojoExecutor.execute (MojoExecutor.java:215)
    at org.apache.maven.lifecycle.internal.MojoExecutor.execute (MojoExecutor.java:156)
    at org.apache.maven.lifecycle.internal.MojoExecutor.execute (MojoExecutor.java:148)
    at org.apache.maven.lifecycle.internal.LifecycleModuleBuilder.buildProject (LifecycleModuleBuilder.java:117)
    at org.apache.maven.lifecycle.internal.LifecycleModuleBuilder.buildProject (LifecycleModuleBuilder.java:81)
    at org.apache.maven.lifecycle.internal.builder.singlethreaded.SingleThreadedBuilder.build
(SingleThreadedBuilder.java:56)
    at org.apache.maven.lifecycle.internal.LifecycleStarter.execute (LifecycleStarter.java:128)
    at org.apache.maven.DefaultMaven.doExecute (DefaultMaven.java:305)
    at org.apache.maven.DefaultMaven.doExecute (DefaultMaven.java:192)
    at org.apache.maven.DefaultMaven.execute (DefaultMaven.java:105)
    at org.apache.maven.cli.MavenCli.execute (MavenCli.java:956)
    at org.apache.maven.cli.MavenCli.doMain (MavenCli.java:288)
    at org.apache.maven.cli.MavenCli.main (MavenCli.java:192)
    at jdk.internal.reflect.NativeMethodAccessorImpl.invoke0 (Native Method)
    at jdk.internal.reflect.NativeMethodAccessorImpl.invoke (NativeMethodAccessorImpl.java:62)
    at jdk.internal.reflect.DelegatingMethodAccessorImpl.invoke (DelegatingMethodAccessorImpl.java:43)
    at java.lang.reflect.Method.invoke (Method.java:567)
    at org.codehaus.plexus.classworlds.launcher.Launcher.launchEnhanced (Launcher.java:282)
    at org.codehaus.plexus.classworlds.launcher.Launcher.launch (Launcher.java:225)
    at org.codehaus.plexus.classworlds.launcher.Launcher.mainWithExitCode (Launcher.java:406)
    at org.codehaus.plexus.classworlds.launcher.Launcher.main (Launcher.java:347)
Caused by: org.apache.maven.plugin.MojoFailureException: 11 builds failed. See console output
above for details.
    at org.apache.maven.plugins.invoker.InvokerSession.handleFailures (InvokerSession.java:260)
    at org.apache.maven.plugins.invoker.VerifyMojo.execute (VerifyMojo.java:137)
    at org.apache.maven.plugin.DefaultBuildPluginManager.executeMojo (DefaultBuildPluginManager.java:137)
    at org.apache.maven.lifecycle.internal.MojoExecutor.execute (MojoExecutor.java:210)
    at org.apache.maven.lifecycle.internal.MojoExecutor.execute (MojoExecutor.java:156)
    at org.apache.maven.lifecycle.internal.MojoExecutor.execute (MojoExecutor.java:148)
    at org.apache.maven.lifecycle.internal.LifecycleModuleBuilder.buildProject (LifecycleModuleBuilder.java:117)
    at org.apache.maven.lifecycle.internal.LifecycleModuleBuilder.buildProject (LifecycleModuleBuilder.java:81)
    at org.apache.maven.lifecycle.internal.builder.singlethreaded.SingleThreadedBuilder.build
(SingleThreadedBuilder.java:56)
    at org.apache.maven.lifecycle.internal.LifecycleStarter.execute (LifecycleStarter.java:128)
    at org.apache.maven.DefaultMaven.doExecute (DefaultMaven.java:305)
    at org.apache.maven.DefaultMaven.doExecute (DefaultMaven.java:192)
    at org.apache.maven.DefaultMaven.execute (DefaultMaven.java:105)
    at org.apache.maven.cli.MavenCli.execute (MavenCli.java:956)
    at org.apache.maven.cli.MavenCli.doMain (MavenCli.java:288)
    at org.apache.maven.cli.MavenCli.main (MavenCli.java:192)
    at jdk.internal.reflect.NativeMethodAccessorImpl.invoke0 (Native Method)
    at jdk.internal.reflect.NativeMethodAccessorImpl.invoke (NativeMethodAccessorImpl.java:62)
    at jdk.internal.reflect.DelegatingMethodAccessorImpl.invoke (DelegatingMethodAccessorImpl.java:43)
    at java.lang.reflect.Method.invoke (Method.java:567)
    at org.codehaus.plexus.classworlds.launcher.Launcher.launchEnhanced (Launcher.java:282)
    at org.codehaus.plexus.classworlds.launcher.Launcher.launch (Launcher.java:225)
    at org.codehaus.plexus.classworlds.launcher.Launcher.mainWithExitCode (Launcher.java:406)
    at org.codehaus.plexus.classworlds.launcher.Launcher.main (Launcher.java:347)
[ERROR] 
[ERROR] Re-run Maven using the -X switch to enable full debug logging.
[ERROR] 
[ERROR] For more information about the errors and possible solutions, please read the following
articles:
[ERROR] [Help 1] http://cwiki.apache.org/confluence/display/MAVEN/MojoFailureException
[Pipeline] }
[Pipeline] // dir
[Pipeline] }
[withMaven] junitPublisher - Archive test results for Maven artifact org.apache.maven.plugins:maven-compiler-plugin:maven-plugin:3.8.1-SNAPSHOT
generated by maven-surefire-plugin:test (default-test): windows-jdk14-m3.6.x_build\target\surefire-reports\*.xml
Recording test results
[withMaven] openTasksPublisher - Scan Tasks for Maven artifact org.apache.maven.plugins:maven-compiler-plugin:maven-plugin:3.8.1-SNAPSHOT
in source directory windows-jdk14-m3.6.x_build\src\main\java
[TASKS] Scanning folder 'f:\jenkins\jenkins-slave\workspace\box_maven-compiler-plugin_it_fix@2'
for files matching the pattern 'windows-jdk14-m3.6.x_build\src\main\java\**\*' - excludes:
null
[TASKS] Found 9 files to scan for tasks
[TASKS] Found 6 open tasks.
Skipping warnings blame since pipelines do not have an SCM link.%n
[TASKS] Computing warning deltas based on reference build #8
[withMaven] invokerPublisher - Archive invoker results for Maven artifact MavenArtifact{org.apache.maven.plugins:maven-compiler-plugin:maven-plugin:3.8.1-SNAPSHOT(version:
3.8.1-SNAPSHOT, snapshot:false) } generated by PluginInvocation{org.apache.maven.plugins:maven-invoker-plugin:3.1.0@integration-test
 integration-test}: windows-jdk14-m3.6.x_build\target\invoker-reports\*.xml
[withMaven] Publishers: Generated Artifacts Publisher: 15 ms, Junit Publisher: 66 ms, Open
Task Scanner Publisher: 101 ms, Dependencies Fingerprint Publisher: 27 ms, Invoker Publisher:
23508 ms, Pipeline Graph Publisher: 2 ms
[Pipeline] // withMaven
[Pipeline] cleanWs
[WS-CLEANUP] Deleting project workspace...
[WS-CLEANUP] Deferred wipeout is used...
[WS-CLEANUP] done
[Pipeline] cleanWs
[WS-CLEANUP] Deleting project workspace...
[WS-CLEANUP] Deferred wipeout is used...
[WS-CLEANUP] done
[Pipeline] }
[Pipeline] // stage
[Pipeline] }
[Pipeline] // ws
[Pipeline] }
[Pipeline] // node
[Pipeline] }
Failed in branch windows-jdk14-m3.6.x_build
[Pipeline] // parallel
[Pipeline] stage
[Pipeline] { (Notifications)
[Pipeline] echo
Build result: FAILURE
[Pipeline] jiraIssueSelector
[Pipeline] echo
The authors of changes [].
[Pipeline] echo
Sending email ...
[Pipeline] emailext
Mime
  • Unnamed multipart/mixed (inline, None, 0 bytes)
View raw message