maven-notifications mailing list archives

Site index · List index
Message view « Date » · « Thread »
Top « Date » · « Thread »
From Apache Jenkins Server <jenk...@builds.apache.org>
Subject Build failed in Jenkins: Maven TLP » maven-checkstyle-plugin » MCHECKSTYLE-289 #19
Date Wed, 01 Jan 2020 20:30:21 GMT
See https://builds.apache.org/job/maven-box/job/maven-checkstyle-plugin/job/MCHECKSTYLE-289/19/

No changes.

All tests passed

Build log:
[...truncated 7045 lines...]
[Pipeline] cleanWs
[WS-CLEANUP] Deleting project workspace...
[WS-CLEANUP] Deferred wipeout is used...
[WS-CLEANUP] done
[Pipeline] cleanWs
[WS-CLEANUP] Deleting project workspace...
[WS-CLEANUP] Deferred wipeout is used...
[WS-CLEANUP] done
[Pipeline] }
[Pipeline] // stage
[Pipeline] }
[Pipeline] // ws
[Pipeline] }
[Pipeline] // node
[Pipeline] }
Failed in branch windows-jdk11-m3.6.x_build
[INFO] run post-build script verify.groovy
[INFO]           check-tests-only\pom.xml ......................... SUCCESS (5.1 s)
[INFO] Building: checkstyle-goal\pom.xml
[INFO] run post-build script verify.groovy
[INFO]           checkstyle-goal\pom.xml .......................... SUCCESS (5.9 s)
[INFO] Building: checkstyle-report\pom.xml
[INFO] run post-build script verify.groovy
[INFO]           checkstyle-report\pom.xml ........................ SUCCESS (16.3 s)
[INFO] Building: inlinerules\pom.xml
[INFO] run post-build script verify.groovy
[INFO]           inlinerules\pom.xml .............................. SUCCESS (5.6 s)
[INFO] Building: MCHECKSTYLE-129\pom.xml
[INFO]           MCHECKSTYLE-129\pom.xml .......................... SUCCESS (15.6 s)
[INFO] Building: MCHECKSTYLE-131\pom.xml
[INFO]           MCHECKSTYLE-131\pom.xml .......................... SUCCESS (5.7 s)
[INFO] Building: MCHECKSTYLE-137\pom.xml
[INFO]           MCHECKSTYLE-137\pom.xml .......................... SUCCESS (5.7 s)
[INFO] Building: MCHECKSTYLE-163\pom.xml
[INFO]           MCHECKSTYLE-163\pom.xml .......................... SUCCESS (4.9 s)
[INFO] Building: MCHECKSTYLE-169\pom.xml
[INFO] run post-build script verify.groovy
[INFO]           MCHECKSTYLE-169\pom.xml .......................... SUCCESS (5.2 s)
[INFO] Building: MCHECKSTYLE-172\pom.xml
[INFO] run post-build script verify.groovy
[INFO]           MCHECKSTYLE-172\pom.xml .......................... SUCCESS (6.8 s)
[INFO] Building: MCHECKSTYLE-173-with-charset\pom.xml
[INFO]           MCHECKSTYLE-173-with-charset\pom.xml ............. SUCCESS (7.6 s)
[INFO] Building: MCHECKSTYLE-173-without-charset\pom.xml
[INFO]           MCHECKSTYLE-173-without-charset\pom.xml .......... SUCCESS (7.8 s)
[INFO] Building: MCHECKSTYLE-193\pom.xml
[INFO]           MCHECKSTYLE-193\pom.xml .......................... SUCCESS (5.3 s)
[INFO] Building: MCHECKSTYLE-214-basedir-resource\pom.xml
[INFO] run post-build script verify.groovy
[INFO]           MCHECKSTYLE-214-basedir-resource\pom.xml ......... SUCCESS (4.6 s)
[INFO] Building: MCHECKSTYLE-219-no-license_failure\pom.xml
[INFO] run post-build script verify.groovy
[INFO]           MCHECKSTYLE-219-no-license_failure\pom.xml ....... SUCCESS (5.5 s)
[INFO] Building: MCHECKSTYLE-219-no-license_success\pom.xml
[INFO] run post-build script verify.groovy
[INFO]           MCHECKSTYLE-219-no-license_success\pom.xml ....... SUCCESS (5.5 s)
[INFO] Building: MCHECKSTYLE-220\pom.xml
[INFO] run post-build script verify.groovy
[INFO]           MCHECKSTYLE-220\pom.xml .......................... SUCCESS (6.5 s)
[INFO] Building: MCHECKSTYLE-222-no-resources\pom.xml
[INFO] run post-build script verify.groovy
[INFO]           MCHECKSTYLE-222-no-resources\pom.xml ............. SUCCESS (3.2 s)
[INFO] Building: MCHECKSTYLE-222-resources\pom.xml
[INFO] run post-build script verify.groovy
[INFO]           MCHECKSTYLE-222-resources\pom.xml ................ SUCCESS (4.4 s)
[INFO] Building: MCHECKSTYLE-222-testResources\pom.xml
[INFO] run post-build script verify.groovy
[INFO]           MCHECKSTYLE-222-testResources\pom.xml ............ SUCCESS (5.3 s)
[INFO] Building: MCHECKSTYLE-224\pom.xml
[INFO] run post-build script verify.groovy
[INFO]           MCHECKSTYLE-224\pom.xml .......................... SUCCESS (10.4 s)
[INFO] Building: MCHECKSTYLE-225-customHeader\pom.xml
[INFO] run post-build script verify.groovy
[INFO]           MCHECKSTYLE-225-customHeader\pom.xml ............. SUCCESS (6.8 s)
[INFO] Building: MCHECKSTYLE-225-LICENSE.txt\pom.xml
[INFO] run post-build script verify.groovy
[INFO]           MCHECKSTYLE-225-LICENSE.txt\pom.xml .............. SUCCESS (6.0 s)
[INFO] Building: MCHECKSTYLE-225-pluginManagement\pom.xml
[INFO] run post-build script verify.groovy
[INFO]           MCHECKSTYLE-225-pluginManagement\pom.xml ......... SUCCESS (6.4 s)
[INFO] Building: MCHECKSTYLE-253-jdk8\pom.xml
[INFO] run post-build script verify.groovy
[INFO]           MCHECKSTYLE-253-jdk8\pom.xml ..................... SUCCESS (5.5 s)
[INFO] Building: MCHECKSTYLE-260-sourceDirectories\pom.xml
[INFO] run post-build script verify.groovy
[INFO]           MCHECKSTYLE-260-sourceDirectories\pom.xml ........ SUCCESS (8.9 s)
[INFO] Building: MCHECKSTYLE-260-testSourceDirectories\pom.xml
[INFO] run post-build script verify.groovy
[INFO]           MCHECKSTYLE-260-testSourceDirectories\pom.xml .... SUCCESS (8.0 s)
[INFO] Building: MCHECKSTYLE-268\pom.xml
[INFO] run post-build script verify.groovy
[INFO]           MCHECKSTYLE-268\pom.xml .......................... SUCCESS (6.0 s)
[INFO] Building: MCHECKSTYLE-289\pom.xml
[INFO] run post-build script verify.groovy
[INFO]           MCHECKSTYLE-289\pom.xml .......................... FAILED (9.5 s)
[INFO]   The post-build script did not succeed. f:\jenkins\jenkins-slave\workspace\heckstyle-plugin_MCHECKSTYLE-289@2\windows-jdk12-m3.6.x_build\target\it\MCHECKSTYLE-289\target\site\checkstyle.html
(The system cannot find the path specified)
[INFO] Building: MCHECKSTYLE-295\pom.xml
[INFO] run post-build script verify.groovy
[INFO]           MCHECKSTYLE-295\pom.xml .......................... SUCCESS (6.2 s)
[INFO] Building: MCHECKSTYLE-332_cache-checker\pom.xml
[INFO] run post-build script verify.groovy
[INFO]           MCHECKSTYLE-332_cache-checker\pom.xml ............ SUCCESS (6.8 s)
[INFO] Building: MCHECKSTYLE-337\pom.xml
[INFO] run post-build script verify.groovy
[INFO]           MCHECKSTYLE-337\pom.xml .......................... SUCCESS (7.5 s)
[INFO] Building: MCHECKSTYLE-338\pom.xml
[INFO] run post-build script verify.groovy
[INFO]           MCHECKSTYLE-338\pom.xml .......................... SUCCESS (10.2 s)
[INFO] Building: MCHECKSTYLE-347\pom.xml
[INFO] run post-build script verify.groovy
[INFO]           MCHECKSTYLE-347\pom.xml .......................... SUCCESS (4.9 s)
[INFO] Building: MCHECKSTYLE-357\pom.xml
[INFO] run post-build script verify.groovy
[INFO]           MCHECKSTYLE-357\pom.xml .......................... SUCCESS (8.8 s)
[INFO] Building: MCHECKSTYLE-357-with-header-override\pom.xml
[INFO] run post-build script verify.groovy
[INFO]           MCHECKSTYLE-357-with-header-override\pom.xml ..... SUCCESS (11.0 s)
[INFO] Building: MCHECKSTYLE-365\pom.xml
[INFO] run post-build script verify.groovy
[INFO]           MCHECKSTYLE-365\pom.xml .......................... SUCCESS (9.4 s)
[INFO] Building: MCHECKSTYLE-54\pom.xml
[INFO]           MCHECKSTYLE-54\pom.xml ........................... SUCCESS (6.4 s)
[INFO] Building: MCHECKSTYLE-70-multi-sourcefolder\pom.xml
[INFO] run post-build script verify.groovy
[INFO]           MCHECKSTYLE-70-multi-sourcefolder\pom.xml ........ SUCCESS (8.6 s)
[INFO] Building: minimal-pom\pom.xml
[INFO] run post-build script verify.bsh
[INFO]           minimal-pom\pom.xml .............................. SUCCESS (8.7 s)
[INFO] Building: multi-modules\pom.xml
[INFO]           multi-modules\pom.xml ............................ SUCCESS (8.2 s)
[INFO] Building: multi-modules-aggregate\pom.xml
[INFO] run post-build script verify.groovy
[INFO]           multi-modules-aggregate\pom.xml .................. SUCCESS (7.3 s)
[INFO] Building: multimoduleproject\pom.xml
[INFO]           multimoduleproject\pom.xml ....................... SUCCESS (5.8 s)
[INFO] 
[INFO] --- maven-checkstyle-plugin:3.0.0:check (checkstyle-check) @ maven-checkstyle-plugin
---
[INFO] There is 1 error reported by Checkstyle 6.18 with config/maven_checks.xml ruleset.
[INFO] Ignored 1 error, 0 violation remaining.
[INFO] 
[INFO] --- maven-invoker-plugin:3.1.0:verify (integration-test) @ maven-checkstyle-plugin
---
[INFO] -------------------------------------------------
[INFO] Build Summary:
[INFO]   Passed: 44, Failed: 1, Errors: 0, Skipped: 0
[INFO] -------------------------------------------------
[ERROR] The following builds failed:
[ERROR] *  MCHECKSTYLE-289\pom.xml
[INFO] -------------------------------------------------
[INFO] ------------------------------------------------------------------------
[INFO] BUILD FAILURE
[INFO] ------------------------------------------------------------------------
[INFO] Total time:  06:16 min
[INFO] Finished at: 2020-01-01T12:30:02-08:00
[INFO] ------------------------------------------------------------------------
[INFO] [jenkins-event-spy] Generated F:\jenkins\jenkins-slave\workspace\heckstyle-plugin_MCHECKSTYLE-289@2@tmp\withMaven5152b2d4\maven-spy-20200101-122345-71816586405987364267614.log
[ERROR] Failed to execute goal org.apache.maven.plugins:maven-invoker-plugin:3.1.0:verify
(integration-test) on project maven-checkstyle-plugin: 1 build failed. See console output
above for details. -> [Help 1]
org.apache.maven.lifecycle.LifecycleExecutionException: Failed to execute goal org.apache.maven.plugins:maven-invoker-plugin:3.1.0:verify
(integration-test) on project maven-checkstyle-plugin: 1 build failed. See console output
above for details.
    at org.apache.maven.lifecycle.internal.MojoExecutor.execute (MojoExecutor.java:215)
    at org.apache.maven.lifecycle.internal.MojoExecutor.execute (MojoExecutor.java:156)
    at org.apache.maven.lifecycle.internal.MojoExecutor.execute (MojoExecutor.java:148)
    at org.apache.maven.lifecycle.internal.LifecycleModuleBuilder.buildProject (LifecycleModuleBuilder.java:117)
    at org.apache.maven.lifecycle.internal.LifecycleModuleBuilder.buildProject (LifecycleModuleBuilder.java:81)
    at org.apache.maven.lifecycle.internal.builder.singlethreaded.SingleThreadedBuilder.build
(SingleThreadedBuilder.java:56)
    at org.apache.maven.lifecycle.internal.LifecycleStarter.execute (LifecycleStarter.java:128)
    at org.apache.maven.DefaultMaven.doExecute (DefaultMaven.java:305)
    at org.apache.maven.DefaultMaven.doExecute (DefaultMaven.java:192)
    at org.apache.maven.DefaultMaven.execute (DefaultMaven.java:105)
    at org.apache.maven.cli.MavenCli.execute (MavenCli.java:956)
    at org.apache.maven.cli.MavenCli.doMain (MavenCli.java:288)
    at org.apache.maven.cli.MavenCli.main (MavenCli.java:192)
    at jdk.internal.reflect.NativeMethodAccessorImpl.invoke0 (Native Method)
    at jdk.internal.reflect.NativeMethodAccessorImpl.invoke (NativeMethodAccessorImpl.java:62)
    at jdk.internal.reflect.DelegatingMethodAccessorImpl.invoke (DelegatingMethodAccessorImpl.java:43)
    at java.lang.reflect.Method.invoke (Method.java:567)
    at org.codehaus.plexus.classworlds.launcher.Launcher.launchEnhanced (Launcher.java:282)
    at org.codehaus.plexus.classworlds.launcher.Launcher.launch (Launcher.java:225)
    at org.codehaus.plexus.classworlds.launcher.Launcher.mainWithExitCode (Launcher.java:406)
    at org.codehaus.plexus.classworlds.launcher.Launcher.main (Launcher.java:347)
Caused by: org.apache.maven.plugin.MojoFailureException: 1 build failed. See console output
above for details.
    at org.apache.maven.plugins.invoker.InvokerSession.handleFailures (InvokerSession.java:260)
    at org.apache.maven.plugins.invoker.VerifyMojo.execute (VerifyMojo.java:137)
    at org.apache.maven.plugin.DefaultBuildPluginManager.executeMojo (DefaultBuildPluginManager.java:137)
    at org.apache.maven.lifecycle.internal.MojoExecutor.execute (MojoExecutor.java:210)
    at org.apache.maven.lifecycle.internal.MojoExecutor.execute (MojoExecutor.java:156)
    at org.apache.maven.lifecycle.internal.MojoExecutor.execute (MojoExecutor.java:148)
    at org.apache.maven.lifecycle.internal.LifecycleModuleBuilder.buildProject (LifecycleModuleBuilder.java:117)
    at org.apache.maven.lifecycle.internal.LifecycleModuleBuilder.buildProject (LifecycleModuleBuilder.java:81)
    at org.apache.maven.lifecycle.internal.builder.singlethreaded.SingleThreadedBuilder.build
(SingleThreadedBuilder.java:56)
    at org.apache.maven.lifecycle.internal.LifecycleStarter.execute (LifecycleStarter.java:128)
    at org.apache.maven.DefaultMaven.doExecute (DefaultMaven.java:305)
    at org.apache.maven.DefaultMaven.doExecute (DefaultMaven.java:192)
    at org.apache.maven.DefaultMaven.execute (DefaultMaven.java:105)
    at org.apache.maven.cli.MavenCli.execute (MavenCli.java:956)
    at org.apache.maven.cli.MavenCli.doMain (MavenCli.java:288)
    at org.apache.maven.cli.MavenCli.main (MavenCli.java:192)
    at jdk.internal.reflect.NativeMethodAccessorImpl.invoke0 (Native Method)
    at jdk.internal.reflect.NativeMethodAccessorImpl.invoke (NativeMethodAccessorImpl.java:62)
    at jdk.internal.reflect.DelegatingMethodAccessorImpl.invoke (DelegatingMethodAccessorImpl.java:43)
    at java.lang.reflect.Method.invoke (Method.java:567)
    at org.codehaus.plexus.classworlds.launcher.Launcher.launchEnhanced (Launcher.java:282)
    at org.codehaus.plexus.classworlds.launcher.Launcher.launch (Launcher.java:225)
    at org.codehaus.plexus.classworlds.launcher.Launcher.mainWithExitCode (Launcher.java:406)
    at org.codehaus.plexus.classworlds.launcher.Launcher.main (Launcher.java:347)
[ERROR] 
[ERROR] Re-run Maven using the -X switch to enable full debug logging.
[ERROR] 
[ERROR] For more information about the errors and possible solutions, please read the following
articles:
[ERROR] [Help 1] http://cwiki.apache.org/confluence/display/MAVEN/MojoFailureException
[Pipeline] }
[Pipeline] // dir
[Pipeline] }
[withMaven] junitPublisher - Archive test results for Maven artifact org.apache.maven.plugins:maven-checkstyle-plugin:maven-plugin:3.1.0-SNAPSHOT
generated by maven-surefire-plugin:test (default-test): windows-jdk12-m3.6.x_build\target\surefire-reports\*.xml
Recording test results
[withMaven] openTasksPublisher - Scan Tasks for Maven artifact org.apache.maven.plugins:maven-checkstyle-plugin:maven-plugin:3.1.0-SNAPSHOT
in source directory windows-jdk12-m3.6.x_build\src\main\java
[TASKS] Scanning folder 'f:\jenkins\jenkins-slave\workspace\heckstyle-plugin_MCHECKSTYLE-289@2'
for files matching the pattern 'windows-jdk12-m3.6.x_build\src\main\java\**\*' - excludes:
null
[TASKS] Found 21 files to scan for tasks
[TASKS] Found 5 open tasks.
Skipping warnings blame since pipelines do not have an SCM link.%n
[TASKS] Computing warning deltas based on reference build #4
[withMaven] invokerPublisher - Archive invoker results for Maven artifact MavenArtifact{org.apache.maven.plugins:maven-checkstyle-plugin:maven-plugin:3.1.0-SNAPSHOT(version:
3.1.0-SNAPSHOT, snapshot:false) } generated by PluginInvocation{org.apache.maven.plugins:maven-invoker-plugin:3.1.0@integration-test
 integration-test}: windows-jdk12-m3.6.x_build\target\invoker-reports\*.xml
[withMaven] Publishers: Generated Artifacts Publisher: 14 ms, Junit Publisher: 202 ms, Open
Task Scanner Publisher: 145 ms, Invoker Publisher: 17234 ms
[Pipeline] // withMaven
[Pipeline] cleanWs
[WS-CLEANUP] Deleting project workspace...
[WS-CLEANUP] Deferred wipeout is used...
[WS-CLEANUP] done
[Pipeline] cleanWs
[WS-CLEANUP] Deleting project workspace...
[WS-CLEANUP] Deferred wipeout is used...
[WS-CLEANUP] done
[Pipeline] }
[Pipeline] // stage
[Pipeline] }
[Pipeline] // ws
[Pipeline] }
[Pipeline] // node
[Pipeline] }
Failed in branch windows-jdk12-m3.6.x_build
[Pipeline] // parallel
[Pipeline] stage
[Pipeline] { (Notifications)
[Pipeline] echo
Build result: FAILURE
[Pipeline] jiraIssueSelector
[Pipeline] echo
The authors of changes [].
[Pipeline] echo
Sending email ...
[Pipeline] emailext
Mime
  • Unnamed multipart/mixed (inline, None, 0 bytes)
View raw message