maven-notifications mailing list archives

Site index · List index
Message view « Date » · « Thread »
Top « Date » · « Thread »
From Apache Jenkins Server <jenk...@builds.apache.org>
Subject Build failed in Jenkins: Maven TLP » maven-wagon » WAGON-501 #18
Date Wed, 01 Jan 2020 13:45:14 GMT
See https://builds.apache.org/job/maven-box/job/maven-wagon/job/WAGON-501/18/

No changes.

46 tests failed.
FAILED:  org.apache.maven.wagon.providers.scm.ScmSvnExeWagonTest.windows-jdk13 / Build windows-jdk13
/ testWagonPutDirectoryDeepDestination

Error Message:
Error checking out: Unable to commit file. The svn command failed. svn: E180001: Unable to
connect to a repository at URL 'file://2/m/wagon-providers/wagon-scm/target/test-classes/test-repo-svn-test'
svn: E180001: Unable to open an ra_local session to URL
svn: E180001: Unable to open repository 'file://2/m/wagon-providers/wagon-scm/target/test-classes/test-repo-svn-test'


Stack Trace:
org.apache.maven.wagon.TransferFailedException: 
Error checking out: Unable to commit file. The svn command failed. svn: E180001: Unable to
connect to a repository at URL 'file://2/m/wagon-providers/wagon-scm/target/test-classes/test-repo-svn-test'
svn: E180001: Unable to open an ra_local session to URL
svn: E180001: Unable to open repository 'file://2/m/wagon-providers/wagon-scm/target/test-classes/test-repo-svn-test'

Caused by: org.apache.maven.scm.ScmException: 
Unable to commit file. The svn command failed. svn: E180001: Unable to connect to a repository
at URL 'file://2/m/wagon-providers/wagon-scm/target/test-classes/test-repo-svn-test'
svn: E180001: Unable to open an ra_local session to URL
svn: E180001: Unable to open repository 'file://2/m/wagon-providers/wagon-scm/target/test-classes/test-repo-svn-test'



FAILED:  org.apache.maven.wagon.providers.scm.ScmSvnExeWagonTest.windows-jdk13 / Build windows-jdk13
/ testWagonPutDirectoryForDot

Error Message:
Error checking out: Unable to commit file. The svn command failed. svn: E180001: Unable to
connect to a repository at URL 'file://2/m/wagon-providers/wagon-scm/target/test-classes/test-repo-svn-test'
svn: E180001: Unable to open an ra_local session to URL
svn: E180001: Unable to open repository 'file://2/m/wagon-providers/wagon-scm/target/test-classes/test-repo-svn-test'


Stack Trace:
org.apache.maven.wagon.TransferFailedException: 
Error checking out: Unable to commit file. The svn command failed. svn: E180001: Unable to
connect to a repository at URL 'file://2/m/wagon-providers/wagon-scm/target/test-classes/test-repo-svn-test'
svn: E180001: Unable to open an ra_local session to URL
svn: E180001: Unable to open repository 'file://2/m/wagon-providers/wagon-scm/target/test-classes/test-repo-svn-test'

Caused by: org.apache.maven.scm.ScmException: 
Unable to commit file. The svn command failed. svn: E180001: Unable to connect to a repository
at URL 'file://2/m/wagon-providers/wagon-scm/target/test-classes/test-repo-svn-test'
svn: E180001: Unable to open an ra_local session to URL
svn: E180001: Unable to open repository 'file://2/m/wagon-providers/wagon-scm/target/test-classes/test-repo-svn-test'



FAILED:  org.apache.maven.wagon.providers.scm.ScmSvnExeWagonTest.windows-jdk13 / Build windows-jdk13
/ testWagonGetFileList

Error Message:

  Unexpected method call TransferListener.transferError(TransferEvent[GET|ERROR|Repository[scm:svn:file://2/m/wagon-providers/wagon-scm/target/test-classes/test-repo-svn-test]|null|file-list/test-resource.txt[len
= 18; mod = 1577885788007]]):
    TransferListener.transferCompleted(TransferEvent[PUT|COMPLETED|Repository[scm:svn:file://2/m/wagon-providers/wagon-scm/target/test-classes/test-repo-svn-test]|F:\jenkins\jenkins-slave\workspace\maven-box_maven-wagon_WAGON-501@2\m\wagon-providers\wagon-scm\target\test-output\file-list\test-resource.txt|file-list/test-resource.txt[len
= 18; mod = 1577885788007]]): expected: 1, actual: 0

Stack Trace:
java.lang.AssertionError: 

  Unexpected method call TransferListener.transferError(TransferEvent[GET|ERROR|Repository[scm:svn:file://2/m/wagon-providers/wagon-scm/target/test-classes/test-repo-svn-test]|null|file-list/test-resource.txt[len
= 18; mod = 1577885788007]]):
    TransferListener.transferCompleted(TransferEvent[PUT|COMPLETED|Repository[scm:svn:file://2/m/wagon-providers/wagon-scm/target/test-classes/test-repo-svn-test]|F:\jenkins\jenkins-slave\workspace\maven-box_maven-wagon_WAGON-501@2\m\wagon-providers\wagon-scm\target\test-output\file-list\test-resource.txt|file-list/test-resource.txt[len
= 18; mod = 1577885788007]]): expected: 1, actual: 0


FAILED:  org.apache.maven.wagon.providers.scm.ScmSvnExeWagonTest.windows-jdk13 / Build windows-jdk13
/ testWagonPutDirectoryWhenDirectoryAlreadyExists

Error Message:
Error checking out: Unable to commit file. The svn command failed. svn: E180001: Unable to
connect to a repository at URL 'file://2/m/wagon-providers/wagon-scm/target/test-classes/test-repo-svn-test'
svn: E180001: Unable to open an ra_local session to URL
svn: E180001: Unable to open repository 'file://2/m/wagon-providers/wagon-scm/target/test-classes/test-repo-svn-test'


Stack Trace:
org.apache.maven.wagon.TransferFailedException: 
Error checking out: Unable to commit file. The svn command failed. svn: E180001: Unable to
connect to a repository at URL 'file://2/m/wagon-providers/wagon-scm/target/test-classes/test-repo-svn-test'
svn: E180001: Unable to open an ra_local session to URL
svn: E180001: Unable to open repository 'file://2/m/wagon-providers/wagon-scm/target/test-classes/test-repo-svn-test'

Caused by: org.apache.maven.scm.ScmException: 
Unable to commit file. The svn command failed. svn: E180001: Unable to connect to a repository
at URL 'file://2/m/wagon-providers/wagon-scm/target/test-classes/test-repo-svn-test'
svn: E180001: Unable to open an ra_local session to URL
svn: E180001: Unable to open repository 'file://2/m/wagon-providers/wagon-scm/target/test-classes/test-repo-svn-test'



FAILED:  org.apache.maven.wagon.providers.scm.ScmSvnExeWagonTest.windows-jdk13 / Build windows-jdk13
/ testWagonResourceExists

Error Message:

  Unexpected method call TransferListener.transferError(TransferEvent[GET|ERROR|Repository[scm:svn:file://2/m/wagon-providers/wagon-scm/target/test-classes/test-repo-svn-test]|null|test-resource[len
= 18; mod = 1577885789005]]):
    TransferListener.transferCompleted(TransferEvent[PUT|COMPLETED|Repository[scm:svn:file://2/m/wagon-providers/wagon-scm/target/test-classes/test-repo-svn-test]|F:\jenkins\jenkins-slave\workspace\maven-box_maven-wagon_WAGON-501@2\m\wagon-providers\wagon-scm\target\test-output\test-resource|test-resource[len
= 18; mod = 1577885789005]]): expected: 1, actual: 0

Stack Trace:
java.lang.AssertionError: 

  Unexpected method call TransferListener.transferError(TransferEvent[GET|ERROR|Repository[scm:svn:file://2/m/wagon-providers/wagon-scm/target/test-classes/test-repo-svn-test]|null|test-resource[len
= 18; mod = 1577885789005]]):
    TransferListener.transferCompleted(TransferEvent[PUT|COMPLETED|Repository[scm:svn:file://2/m/wagon-providers/wagon-scm/target/test-classes/test-repo-svn-test]|F:\jenkins\jenkins-slave\workspace\maven-box_maven-wagon_WAGON-501@2\m\wagon-providers\wagon-scm\target\test-output\test-resource|test-resource[len
= 18; mod = 1577885789005]]): expected: 1, actual: 0


FAILED:  org.apache.maven.wagon.providers.scm.ScmSvnExeWagonTest.windows-jdk13 / Build windows-jdk13
/ testWagonPutDirectory

Error Message:
Error checking out: Unable to commit file. The svn command failed. svn: E180001: Unable to
connect to a repository at URL 'file://2/m/wagon-providers/wagon-scm/target/test-classes/test-repo-svn-test'
svn: E180001: Unable to open an ra_local session to URL
svn: E180001: Unable to open repository 'file://2/m/wagon-providers/wagon-scm/target/test-classes/test-repo-svn-test'


Stack Trace:
org.apache.maven.wagon.TransferFailedException: 
Error checking out: Unable to commit file. The svn command failed. svn: E180001: Unable to
connect to a repository at URL 'file://2/m/wagon-providers/wagon-scm/target/test-classes/test-repo-svn-test'
svn: E180001: Unable to open an ra_local session to URL
svn: E180001: Unable to open repository 'file://2/m/wagon-providers/wagon-scm/target/test-classes/test-repo-svn-test'

Caused by: org.apache.maven.scm.ScmException: 
Unable to commit file. The svn command failed. svn: E180001: Unable to connect to a repository
at URL 'file://2/m/wagon-providers/wagon-scm/target/test-classes/test-repo-svn-test'
svn: E180001: Unable to open an ra_local session to URL
svn: E180001: Unable to open repository 'file://2/m/wagon-providers/wagon-scm/target/test-classes/test-repo-svn-test'



FAILED:  org.apache.maven.wagon.providers.scm.ScmGitExeWagonTest.linux-jdk8 / Build linux-jdk8
/ testWagonPutDirectoryDeepDestination

Error Message:
Error listing repository: No such command 'list'.

Stack Trace:
org.apache.maven.wagon.TransferFailedException: Error listing repository: No such command
'list'.
Caused by: org.apache.maven.scm.NoSuchCommandScmException: No such command 'list'.


FAILED:  org.apache.maven.wagon.providers.scm.ScmGitExeWagonTest.linux-jdk8 / Build linux-jdk8
/ testWagonGetFileListWhenDirectoryDoesNotExist

Error Message:
Error getting filelist from SCM

Stack Trace:
org.apache.maven.wagon.TransferFailedException: Error getting filelist from SCM
Caused by: org.apache.maven.scm.NoSuchCommandScmException: No such command 'list'.


FAILED:  org.apache.maven.wagon.providers.scm.ScmGitExeWagonTest.linux-jdk8 / Build linux-jdk8
/ testWagonPutDirectoryForDot

Error Message:
Error listing repository: No such command 'list'.

Stack Trace:
org.apache.maven.wagon.TransferFailedException: Error listing repository: No such command
'list'.
Caused by: org.apache.maven.scm.NoSuchCommandScmException: No such command 'list'.


FAILED:  org.apache.maven.wagon.providers.scm.ScmGitExeWagonTest.linux-jdk8 / Build linux-jdk8
/ testWagonPutDirectoryWhenDirectoryAlreadyExists

Error Message:
Error listing repository: No such command 'list'.

Stack Trace:
org.apache.maven.wagon.TransferFailedException: Error listing repository: No such command
'list'.
Caused by: org.apache.maven.scm.NoSuchCommandScmException: No such command 'list'.


FAILED:  org.apache.maven.wagon.providers.scm.ScmGitExeWagonTest.linux-jdk8 / Build linux-jdk8
/ testWagonPutDirectory

Error Message:
Error listing repository: No such command 'list'.

Stack Trace:
org.apache.maven.wagon.TransferFailedException: Error listing repository: No such command
'list'.
Caused by: org.apache.maven.scm.NoSuchCommandScmException: No such command 'list'.


FAILED:  org.apache.maven.wagon.providers.scm.ScmGitExeWagonTest.linux-jdk7 / Build linux-jdk7
/ testWagonPutDirectoryDeepDestination

Error Message:
Error listing repository: No such command 'list'.

Stack Trace:
org.apache.maven.wagon.TransferFailedException: Error listing repository: No such command
'list'.
Caused by: org.apache.maven.scm.NoSuchCommandScmException: No such command 'list'.


FAILED:  org.apache.maven.wagon.providers.scm.ScmGitExeWagonTest.linux-jdk7 / Build linux-jdk7
/ testWagonGetFileListWhenDirectoryDoesNotExist

Error Message:
Error getting filelist from SCM

Stack Trace:
org.apache.maven.wagon.TransferFailedException: Error getting filelist from SCM
Caused by: org.apache.maven.scm.NoSuchCommandScmException: No such command 'list'.


FAILED:  org.apache.maven.wagon.providers.scm.ScmGitExeWagonTest.linux-jdk7 / Build linux-jdk7
/ testWagonPutDirectoryForDot

Error Message:
Error listing repository: No such command 'list'.

Stack Trace:
org.apache.maven.wagon.TransferFailedException: Error listing repository: No such command
'list'.
Caused by: org.apache.maven.scm.NoSuchCommandScmException: No such command 'list'.


FAILED:  org.apache.maven.wagon.providers.scm.ScmGitExeWagonTest.linux-jdk7 / Build linux-jdk7
/ testWagonPutDirectoryWhenDirectoryAlreadyExists

Error Message:
Error listing repository: No such command 'list'.

Stack Trace:
org.apache.maven.wagon.TransferFailedException: Error listing repository: No such command
'list'.
Caused by: org.apache.maven.scm.NoSuchCommandScmException: No such command 'list'.


FAILED:  org.apache.maven.wagon.providers.scm.ScmGitExeWagonTest.linux-jdk7 / Build linux-jdk7
/ testWagonPutDirectory

Error Message:
Error listing repository: No such command 'list'.

Stack Trace:
org.apache.maven.wagon.TransferFailedException: Error listing repository: No such command
'list'.
Caused by: org.apache.maven.scm.NoSuchCommandScmException: No such command 'list'.


FAILED:  org.apache.maven.wagon.providers.scm.ScmGitExeWagonTest.linux-jdk11 / Build linux-jdk11
/ testWagonPutDirectoryDeepDestination

Error Message:
Error listing repository: No such command 'list'.

Stack Trace:
org.apache.maven.wagon.TransferFailedException: Error listing repository: No such command
'list'.
Caused by: org.apache.maven.scm.NoSuchCommandScmException: No such command 'list'.


FAILED:  org.apache.maven.wagon.providers.scm.ScmGitExeWagonTest.linux-jdk11 / Build linux-jdk11
/ testWagonGetFileListWhenDirectoryDoesNotExist

Error Message:
Error getting filelist from SCM

Stack Trace:
org.apache.maven.wagon.TransferFailedException: Error getting filelist from SCM
Caused by: org.apache.maven.scm.NoSuchCommandScmException: No such command 'list'.


FAILED:  org.apache.maven.wagon.providers.scm.ScmGitExeWagonTest.linux-jdk11 / Build linux-jdk11
/ testWagonPutDirectoryForDot

Error Message:
Error listing repository: No such command 'list'.

Stack Trace:
org.apache.maven.wagon.TransferFailedException: Error listing repository: No such command
'list'.
Caused by: org.apache.maven.scm.NoSuchCommandScmException: No such command 'list'.


FAILED:  org.apache.maven.wagon.providers.scm.ScmGitExeWagonTest.linux-jdk11 / Build linux-jdk11
/ testWagonPutDirectoryWhenDirectoryAlreadyExists

Error Message:
Error listing repository: No such command 'list'.

Stack Trace:
org.apache.maven.wagon.TransferFailedException: Error listing repository: No such command
'list'.
Caused by: org.apache.maven.scm.NoSuchCommandScmException: No such command 'list'.


FAILED:  org.apache.maven.wagon.providers.scm.ScmGitExeWagonTest.linux-jdk11 / Build linux-jdk11
/ testWagonPutDirectory

Error Message:
Error listing repository: No such command 'list'.

Stack Trace:
org.apache.maven.wagon.TransferFailedException: Error listing repository: No such command
'list'.
Caused by: org.apache.maven.scm.NoSuchCommandScmException: No such command 'list'.


FAILED:  org.apache.maven.wagon.providers.scm.ScmGitExeWagonTest.linux-jdk14 / Build linux-jdk14
/ testWagonPutDirectoryDeepDestination

Error Message:
Error listing repository: No such command 'list'.

Stack Trace:
org.apache.maven.wagon.TransferFailedException: Error listing repository: No such command
'list'.
Caused by: org.apache.maven.scm.NoSuchCommandScmException: No such command 'list'.


FAILED:  org.apache.maven.wagon.providers.scm.ScmGitExeWagonTest.linux-jdk14 / Build linux-jdk14
/ testWagonGetFileListWhenDirectoryDoesNotExist

Error Message:
Error getting filelist from SCM

Stack Trace:
org.apache.maven.wagon.TransferFailedException: Error getting filelist from SCM
Caused by: org.apache.maven.scm.NoSuchCommandScmException: No such command 'list'.


FAILED:  org.apache.maven.wagon.providers.scm.ScmGitExeWagonTest.linux-jdk14 / Build linux-jdk14
/ testWagonPutDirectoryForDot

Error Message:
Error listing repository: No such command 'list'.

Stack Trace:
org.apache.maven.wagon.TransferFailedException: Error listing repository: No such command
'list'.
Caused by: org.apache.maven.scm.NoSuchCommandScmException: No such command 'list'.


FAILED:  org.apache.maven.wagon.providers.scm.ScmGitExeWagonTest.linux-jdk14 / Build linux-jdk14
/ testWagonPutDirectoryWhenDirectoryAlreadyExists

Error Message:
Error listing repository: No such command 'list'.

Stack Trace:
org.apache.maven.wagon.TransferFailedException: Error listing repository: No such command
'list'.
Caused by: org.apache.maven.scm.NoSuchCommandScmException: No such command 'list'.


FAILED:  org.apache.maven.wagon.providers.scm.ScmGitExeWagonTest.linux-jdk14 / Build linux-jdk14
/ testWagonPutDirectory

Error Message:
Error listing repository: No such command 'list'.

Stack Trace:
org.apache.maven.wagon.TransferFailedException: Error listing repository: No such command
'list'.
Caused by: org.apache.maven.scm.NoSuchCommandScmException: No such command 'list'.


FAILED:  org.apache.maven.wagon.providers.scm.ScmGitExeWagonTest.windows-jdk7 / Build windows-jdk7
/ testWagonPutDirectoryDeepDestination

Error Message:
Error listing repository: No such command 'list'.

Stack Trace:
org.apache.maven.wagon.TransferFailedException: Error listing repository: No such command
'list'.
Caused by: org.apache.maven.scm.NoSuchCommandScmException: No such command 'list'.


FAILED:  org.apache.maven.wagon.providers.scm.ScmGitExeWagonTest.windows-jdk7 / Build windows-jdk7
/ testWagonGetFileListWhenDirectoryDoesNotExist

Error Message:
Error getting filelist from SCM

Stack Trace:
org.apache.maven.wagon.TransferFailedException: Error getting filelist from SCM
Caused by: org.apache.maven.scm.NoSuchCommandScmException: No such command 'list'.


FAILED:  org.apache.maven.wagon.providers.scm.ScmGitExeWagonTest.windows-jdk7 / Build windows-jdk7
/ testWagonPutDirectoryForDot

Error Message:
Error listing repository: No such command 'list'.

Stack Trace:
org.apache.maven.wagon.TransferFailedException: Error listing repository: No such command
'list'.
Caused by: org.apache.maven.scm.NoSuchCommandScmException: No such command 'list'.


FAILED:  org.apache.maven.wagon.providers.scm.ScmGitExeWagonTest.windows-jdk7 / Build windows-jdk7
/ testWagonPutDirectoryWhenDirectoryAlreadyExists

Error Message:
Error listing repository: No such command 'list'.

Stack Trace:
org.apache.maven.wagon.TransferFailedException: Error listing repository: No such command
'list'.
Caused by: org.apache.maven.scm.NoSuchCommandScmException: No such command 'list'.


FAILED:  org.apache.maven.wagon.providers.scm.ScmGitExeWagonTest.windows-jdk7 / Build windows-jdk7
/ testWagonPutDirectory

Error Message:
Error listing repository: No such command 'list'.

Stack Trace:
org.apache.maven.wagon.TransferFailedException: Error listing repository: No such command
'list'.
Caused by: org.apache.maven.scm.NoSuchCommandScmException: No such command 'list'.


FAILED:  org.apache.maven.wagon.providers.scm.ScmGitExeWagonTest.windows-jdk8 / Build windows-jdk8
/ testWagonPutDirectoryDeepDestination

Error Message:
Error listing repository: No such command 'list'.

Stack Trace:
org.apache.maven.wagon.TransferFailedException: Error listing repository: No such command
'list'.
Caused by: org.apache.maven.scm.NoSuchCommandScmException: No such command 'list'.


FAILED:  org.apache.maven.wagon.providers.scm.ScmGitExeWagonTest.windows-jdk8 / Build windows-jdk8
/ testWagonGetFileListWhenDirectoryDoesNotExist

Error Message:
Error getting filelist from SCM

Stack Trace:
org.apache.maven.wagon.TransferFailedException: Error getting filelist from SCM
Caused by: org.apache.maven.scm.NoSuchCommandScmException: No such command 'list'.


FAILED:  org.apache.maven.wagon.providers.scm.ScmGitExeWagonTest.windows-jdk8 / Build windows-jdk8
/ testWagonPutDirectoryForDot

Error Message:
Error listing repository: No such command 'list'.

Stack Trace:
org.apache.maven.wagon.TransferFailedException: Error listing repository: No such command
'list'.
Caused by: org.apache.maven.scm.NoSuchCommandScmException: No such command 'list'.


FAILED:  org.apache.maven.wagon.providers.scm.ScmGitExeWagonTest.windows-jdk8 / Build windows-jdk8
/ testWagonPutDirectoryWhenDirectoryAlreadyExists

Error Message:
Error listing repository: No such command 'list'.

Stack Trace:
org.apache.maven.wagon.TransferFailedException: Error listing repository: No such command
'list'.
Caused by: org.apache.maven.scm.NoSuchCommandScmException: No such command 'list'.


FAILED:  org.apache.maven.wagon.providers.scm.ScmGitExeWagonTest.windows-jdk8 / Build windows-jdk8
/ testWagonPutDirectory

Error Message:
Error listing repository: No such command 'list'.

Stack Trace:
org.apache.maven.wagon.TransferFailedException: Error listing repository: No such command
'list'.
Caused by: org.apache.maven.scm.NoSuchCommandScmException: No such command 'list'.


FAILED:  org.apache.maven.wagon.providers.scm.ScmGitExeWagonTest.windows-jdk13 / Build windows-jdk13
/ testWagonPutDirectoryDeepDestination

Error Message:
Error listing repository: No such command 'list'.

Stack Trace:
org.apache.maven.wagon.TransferFailedException: Error listing repository: No such command
'list'.
Caused by: org.apache.maven.scm.NoSuchCommandScmException: No such command 'list'.


FAILED:  org.apache.maven.wagon.providers.scm.ScmGitExeWagonTest.windows-jdk13 / Build windows-jdk13
/ testWagonGetFileListWhenDirectoryDoesNotExist

Error Message:
Error getting filelist from SCM

Stack Trace:
org.apache.maven.wagon.TransferFailedException: Error getting filelist from SCM
Caused by: org.apache.maven.scm.NoSuchCommandScmException: No such command 'list'.


FAILED:  org.apache.maven.wagon.providers.scm.ScmGitExeWagonTest.windows-jdk13 / Build windows-jdk13
/ testWagonPutDirectoryForDot

Error Message:
Error listing repository: No such command 'list'.

Stack Trace:
org.apache.maven.wagon.TransferFailedException: Error listing repository: No such command
'list'.
Caused by: org.apache.maven.scm.NoSuchCommandScmException: No such command 'list'.


FAILED:  org.apache.maven.wagon.providers.scm.ScmGitExeWagonTest.windows-jdk13 / Build windows-jdk13
/ testWagonPutDirectoryWhenDirectoryAlreadyExists

Error Message:
Error listing repository: No such command 'list'.

Stack Trace:
org.apache.maven.wagon.TransferFailedException: Error listing repository: No such command
'list'.
Caused by: org.apache.maven.scm.NoSuchCommandScmException: No such command 'list'.


FAILED:  org.apache.maven.wagon.providers.scm.ScmGitExeWagonTest.windows-jdk13 / Build windows-jdk13
/ testWagonPutDirectory

Error Message:
Error listing repository: No such command 'list'.

Stack Trace:
org.apache.maven.wagon.TransferFailedException: Error listing repository: No such command
'list'.
Caused by: org.apache.maven.scm.NoSuchCommandScmException: No such command 'list'.


FAILED:  org.apache.maven.wagon.providers.scm.ScmGitExeWagonTest.windows-jdk14 / Build windows-jdk14
/ testWagonPutDirectoryDeepDestination

Error Message:
Error listing repository: No such command 'list'.

Stack Trace:
org.apache.maven.wagon.TransferFailedException: Error listing repository: No such command
'list'.
Caused by: org.apache.maven.scm.NoSuchCommandScmException: No such command 'list'.


FAILED:  org.apache.maven.wagon.providers.scm.ScmGitExeWagonTest.windows-jdk14 / Build windows-jdk14
/ testWagonGetFileListWhenDirectoryDoesNotExist

Error Message:
Error getting filelist from SCM

Stack Trace:
org.apache.maven.wagon.TransferFailedException: Error getting filelist from SCM
Caused by: org.apache.maven.scm.NoSuchCommandScmException: No such command 'list'.


FAILED:  org.apache.maven.wagon.providers.scm.ScmGitExeWagonTest.windows-jdk14 / Build windows-jdk14
/ testWagonPutDirectoryForDot

Error Message:
Error listing repository: No such command 'list'.

Stack Trace:
org.apache.maven.wagon.TransferFailedException: Error listing repository: No such command
'list'.
Caused by: org.apache.maven.scm.NoSuchCommandScmException: No such command 'list'.


FAILED:  org.apache.maven.wagon.providers.scm.ScmGitExeWagonTest.windows-jdk14 / Build windows-jdk14
/ testWagonPutDirectoryWhenDirectoryAlreadyExists

Error Message:
Error listing repository: No such command 'list'.

Stack Trace:
org.apache.maven.wagon.TransferFailedException: Error listing repository: No such command
'list'.
Caused by: org.apache.maven.scm.NoSuchCommandScmException: No such command 'list'.


FAILED:  org.apache.maven.wagon.providers.scm.ScmGitExeWagonTest.windows-jdk14 / Build windows-jdk14
/ testWagonPutDirectory

Error Message:
Error listing repository: No such command 'list'.

Stack Trace:
org.apache.maven.wagon.TransferFailedException: Error listing repository: No such command
'list'.
Caused by: org.apache.maven.scm.NoSuchCommandScmException: No such command 'list'.




Build log:
[...truncated 28399 lines...]
[INFO] Downloaded from central: https://repo.maven.apache.org/maven2/com/jcraft/jsch.agentproxy.pageant/0.0.9/jsch.agentproxy.pageant-0.0.9.jar
(7.8 kB at 24 kB/s)
[INFO] Downloaded from central: https://repo.maven.apache.org/maven2/org/codehaus/plexus/plexus-component-api/1.0-alpha-16/plexus-component-api-1.0-alpha-16.jar
(33 kB at 66 kB/s)
[INFO] 
[INFO] --- maven-clean-plugin:3.0.0:clean (default-clean) @ wagon-ssh ---
[INFO] 
[INFO] --- maven-enforcer-plugin:1.4.1:enforce (enforce-maven-version) @ wagon-ssh ---
[INFO] 
[INFO] --- maven-enforcer-plugin:1.4.1:enforce (enforce-bytecode-version) @ wagon-ssh ---
[INFO] 
[INFO] --- maven-enforcer-plugin:1.4.1:enforce (ban-known-bad-maven-versions) @ wagon-ssh
---
[INFO] 
[INFO] --- maven-enforcer-plugin:1.4.1:enforce (default) @ wagon-ssh ---
[INFO] 
[INFO] --- apache-rat-plugin:0.12:check (rat-check) @ wagon-ssh ---
[INFO] Enabled default license matchers.
[INFO] Will parse SCM ignores for exclusions...
[INFO] Finished adding exclusions from SCM ignore files.
[INFO] 61 implicit excludes (use -debug for more details).
[INFO] Exclude: .checkstyle
[INFO] Exclude: **/*.odg
[INFO] Exclude: src/test/resources/**
[INFO] Exclude: src/main/resources/default-server-root/**
[INFO] Exclude: src/main/resources/ssh-keys/**
[INFO] Exclude: src/test/ssh-keys/**
[INFO] Exclude: .repository/**
[INFO] Exclude: out/**
[INFO] Exclude: .repository/**
[INFO] Exclude: .maven/spy.log
[INFO] Exclude: dependency-reduced-pom.xml
[INFO] Exclude: .java-version
[INFO] 19 resources included (use -debug for more details)
[INFO] Rat check: Summary over all files. Unapproved: 0, unknown: 0, generated: 0, approved:
19 licenses.
[INFO] 
[INFO] --- maven-remote-resources-plugin:1.5:process (process-resource-bundles) @ wagon-ssh
---
[INFO] 
[INFO] --- maven-resources-plugin:3.0.2:resources (default-resources) @ wagon-ssh ---
[INFO] Using 'UTF-8' encoding to copy filtered resources.
[INFO] skip non existing resourceDirectory F:\jenkins\jenkins-slave\workspace\maven-box_maven-wagon_WAGON-501\m\wagon-providers\wagon-ssh\src\main\resources
[INFO] Copying 3 resources
[INFO] 
[INFO] --- maven-compiler-plugin:3.7.0:compile (default-compile) @ wagon-ssh ---
[INFO] Changes detected - recompiling the module!
[INFO] Compiling 7 source files to F:\jenkins\jenkins-slave\workspace\maven-box_maven-wagon_WAGON-501\m\wagon-providers\wagon-ssh\target\classes
[INFO] 
[INFO] --- plexus-component-metadata:1.7.1:generate-metadata (generate) @ wagon-ssh ---
[INFO] Discovered 4 component descriptors(s)
[INFO] 
[INFO] --- animal-sniffer-maven-plugin:1.15:check (check-java-1.7-compat) @ wagon-ssh ---
[INFO] Checking unresolved references to org.codehaus.mojo.signature:java17:1.0
[INFO] 
[INFO] --- maven-resources-plugin:3.0.2:testResources (default-testResources) @ wagon-ssh
---
[INFO] Using 'UTF-8' encoding to copy filtered resources.
[INFO] Copying 6 resources
[INFO] Copying 3 resources
[INFO] 
[INFO] --- maven-compiler-plugin:3.7.0:testCompile (default-testCompile) @ wagon-ssh ---
[INFO] Changes detected - recompiling the module!
[INFO] Compiling 8 source files to F:\jenkins\jenkins-slave\workspace\maven-box_maven-wagon_WAGON-501\m\wagon-providers\wagon-ssh\target\test-classes
[INFO] /F:/jenkins/jenkins-slave/workspace/maven-box_maven-wagon_WAGON-501/m/wagon-providers/wagon-ssh/src/test/java/org/apache/maven/wagon/providers/ssh/jsch/ScpWagonWithSshPrivateKeySearchTest.java:
F:\jenkins\jenkins-slave\workspace\maven-box_maven-wagon_WAGON-501\m\wagon-providers\wagon-ssh\src\test\java\org\apache\maven\wagon\providers\ssh\jsch\ScpWagonWithSshPrivateKeySearchTest.java
uses or overrides a deprecated API.
[INFO] /F:/jenkins/jenkins-slave/workspace/maven-box_maven-wagon_WAGON-501/m/wagon-providers/wagon-ssh/src/test/java/org/apache/maven/wagon/providers/ssh/jsch/ScpWagonWithSshPrivateKeySearchTest.java:
Recompile with -Xlint:deprecation for details.
[INFO] 
[INFO] --- maven-surefire-plugin:2.20:test (default-test) @ wagon-ssh ---
[INFO] 
[INFO] --- maven-jar-plugin:3.0.2:jar (default-jar) @ wagon-ssh ---
[INFO] Building jar: F:\jenkins\jenkins-slave\workspace\maven-box_maven-wagon_WAGON-501\m\wagon-providers\wagon-ssh\target\wagon-ssh-3.1.0-SNAPSHOT.jar
[INFO] 
[INFO] --- maven-site-plugin:3.7:attach-descriptor (attach-descriptor) @ wagon-ssh ---
[INFO] Skipping because packaging 'jar' is not pom.
[INFO] 
[INFO] --- maven-checkstyle-plugin:3.0.0:check (checkstyle-check) @ wagon-ssh ---
[INFO] There is 1 error reported by Checkstyle 6.18 with config/maven_checks.xml ruleset.
[INFO] Ignored 1 error, 0 violation remaining.
[INFO] 
[INFO] -----------< org.apache.maven.wagon:wagon-webdav-jackrabbit >-----------
[INFO] Building Apache Maven Wagon :: Providers :: WebDAV Provider 3.1.0-SNAPSHOT [17/17]
[INFO] --------------------------------[ jar ]---------------------------------
[INFO] Downloading from central: https://repo.maven.apache.org/maven2/org/apache/jackrabbit/jackrabbit-webdav/2.14.4/jackrabbit-webdav-2.14.4.pom
[INFO] Downloaded from central: https://repo.maven.apache.org/maven2/org/apache/jackrabbit/jackrabbit-webdav/2.14.4/jackrabbit-webdav-2.14.4.pom
(4.0 kB at 101 kB/s)
[INFO] Downloading from central: https://repo.maven.apache.org/maven2/org/apache/jackrabbit/jackrabbit-parent/2.14.4/jackrabbit-parent-2.14.4.pom
[INFO] Downloaded from central: https://repo.maven.apache.org/maven2/org/apache/jackrabbit/jackrabbit-parent/2.14.4/jackrabbit-parent-2.14.4.pom
(35 kB at 868 kB/s)
[INFO] Downloading from central: https://repo.maven.apache.org/maven2/it/could/webdav/0.4/webdav-0.4.pom
[INFO] Downloaded from central: https://repo.maven.apache.org/maven2/it/could/webdav/0.4/webdav-0.4.pom
(1.1 kB at 30 kB/s)
[INFO] Downloading from central: https://repo.maven.apache.org/maven2/biz/aQute/bnd/1.50.0/bnd-1.50.0.pom
[INFO] Downloaded from central: https://repo.maven.apache.org/maven2/biz/aQute/bnd/1.50.0/bnd-1.50.0.pom
(1.3 kB at 64 kB/s)
[INFO] Downloading from central: https://repo.maven.apache.org/maven2/org/apache/jackrabbit/jackrabbit-webdav/2.14.4/jackrabbit-webdav-2.14.4.jar
[INFO] Downloading from central: https://repo.maven.apache.org/maven2/biz/aQute/bnd/1.50.0/bnd-1.50.0.jar
[INFO] Downloading from central: https://repo.maven.apache.org/maven2/javax/servlet/servlet-api/2.3/servlet-api-2.3.jar
[INFO] Downloading from central: https://repo.maven.apache.org/maven2/it/could/webdav/0.4/webdav-0.4.jar
[INFO] Downloaded from central: https://repo.maven.apache.org/maven2/javax/servlet/servlet-api/2.3/servlet-api-2.3.jar
(78 kB at 1.6 MB/s)
[INFO] Downloaded from central: https://repo.maven.apache.org/maven2/it/could/webdav/0.4/webdav-0.4.jar
(103 kB at 1.7 MB/s)
[INFO] Downloaded from central: https://repo.maven.apache.org/maven2/org/apache/jackrabbit/jackrabbit-webdav/2.14.4/jackrabbit-webdav-2.14.4.jar
(365 kB at 5.6 MB/s)
[INFO] Downloaded from central: https://repo.maven.apache.org/maven2/biz/aQute/bnd/1.50.0/bnd-1.50.0.jar
(828 kB at 7.6 MB/s)
[INFO] 
[INFO] --- maven-clean-plugin:3.0.0:clean (default-clean) @ wagon-webdav-jackrabbit ---
[INFO] 
[INFO] --- maven-enforcer-plugin:1.4.1:enforce (enforce-maven-version) @ wagon-webdav-jackrabbit
---
[INFO] 
[INFO] --- maven-enforcer-plugin:1.4.1:enforce (enforce-bytecode-version) @ wagon-webdav-jackrabbit
---
[INFO] 
[INFO] --- maven-enforcer-plugin:1.4.1:enforce (ban-known-bad-maven-versions) @ wagon-webdav-jackrabbit
---
[INFO] 
[INFO] --- maven-enforcer-plugin:1.4.1:enforce (default) @ wagon-webdav-jackrabbit ---
[INFO] 
[INFO] --- apache-rat-plugin:0.12:check (rat-check) @ wagon-webdav-jackrabbit ---
[INFO] Enabled default license matchers.
[INFO] Will parse SCM ignores for exclusions...
[INFO] Finished adding exclusions from SCM ignore files.
[INFO] 61 implicit excludes (use -debug for more details).
[INFO] Exclude: .checkstyle
[INFO] Exclude: **/*.odg
[INFO] Exclude: src/test/resources/**
[INFO] Exclude: src/main/resources/default-server-root/**
[INFO] Exclude: src/main/resources/ssh-keys/**
[INFO] Exclude: src/test/ssh-keys/**
[INFO] Exclude: .repository/**
[INFO] Exclude: out/**
[INFO] Exclude: .repository/**
[INFO] Exclude: .maven/spy.log
[INFO] Exclude: dependency-reduced-pom.xml
[INFO] Exclude: .java-version
[INFO] 12 resources included (use -debug for more details)
[INFO] Rat check: Summary over all files. Unapproved: 0, unknown: 0, generated: 0, approved:
12 licenses.
[INFO] 
[INFO] --- maven-remote-resources-plugin:1.5:process (process-resource-bundles) @ wagon-webdav-jackrabbit
---
[INFO] 
[INFO] --- maven-resources-plugin:3.0.2:resources (default-resources) @ wagon-webdav-jackrabbit
---
[INFO] Using 'UTF-8' encoding to copy filtered resources.
[INFO] Copying 1 resource
[INFO] Copying 3 resources
[INFO] 
[INFO] --- maven-compiler-plugin:3.7.0:compile (default-compile) @ wagon-webdav-jackrabbit
---
[INFO] Changes detected - recompiling the module!
[INFO] Compiling 4 source files to F:\jenkins\jenkins-slave\workspace\maven-box_maven-wagon_WAGON-501\m\wagon-providers\wagon-webdav-jackrabbit\target\classes
[INFO] /F:/jenkins/jenkins-slave/workspace/maven-box_maven-wagon_WAGON-501/m/wagon-providers/wagon-webdav-jackrabbit/src/main/java/org/apache/maven/wagon/providers/webdav/WebDavWagon.java:
F:\jenkins\jenkins-slave\workspace\maven-box_maven-wagon_WAGON-501\m\wagon-providers\wagon-webdav-jackrabbit\src\main\java\org\apache\maven\wagon\providers\webdav\WebDavWagon.java
uses or overrides a deprecated API.
[INFO] /F:/jenkins/jenkins-slave/workspace/maven-box_maven-wagon_WAGON-501/m/wagon-providers/wagon-webdav-jackrabbit/src/main/java/org/apache/maven/wagon/providers/webdav/WebDavWagon.java:
Recompile with -Xlint:deprecation for details.
[INFO] 
[INFO] --- plexus-component-metadata:1.7.1:generate-metadata (generate) @ wagon-webdav-jackrabbit
---
[INFO] Discovered 1 component descriptors(s)
[INFO] 
[INFO] --- animal-sniffer-maven-plugin:1.15:check (check-java-1.7-compat) @ wagon-webdav-jackrabbit
---
[INFO] Checking unresolved references to org.codehaus.mojo.signature:java17:1.0
[INFO] 
[INFO] --- maven-resources-plugin:3.0.2:testResources (default-testResources) @ wagon-webdav-jackrabbit
---
[INFO] Using 'UTF-8' encoding to copy filtered resources.
[INFO] Copying 2 resources
[INFO] Copying 3 resources
[INFO] 
[INFO] --- maven-compiler-plugin:3.7.0:testCompile (default-testCompile) @ wagon-webdav-jackrabbit
---
[INFO] Changes detected - recompiling the module!
[INFO] Compiling 4 source files to F:\jenkins\jenkins-slave\workspace\maven-box_maven-wagon_WAGON-501\m\wagon-providers\wagon-webdav-jackrabbit\target\test-classes
[INFO] /F:/jenkins/jenkins-slave/workspace/maven-box_maven-wagon_WAGON-501/m/wagon-providers/wagon-webdav-jackrabbit/src/test/java/org/apache/maven/wagon/providers/webdav/HttpClientWagonTest.java:
F:\jenkins\jenkins-slave\workspace\maven-box_maven-wagon_WAGON-501\m\wagon-providers\wagon-webdav-jackrabbit\src\test\java\org\apache\maven\wagon\providers\webdav\HttpClientWagonTest.java
uses or overrides a deprecated API.
[INFO] /F:/jenkins/jenkins-slave/workspace/maven-box_maven-wagon_WAGON-501/m/wagon-providers/wagon-webdav-jackrabbit/src/test/java/org/apache/maven/wagon/providers/webdav/HttpClientWagonTest.java:
Recompile with -Xlint:deprecation for details.
[INFO] 
[INFO] --- maven-surefire-plugin:2.20:test (default-test) @ wagon-webdav-jackrabbit ---
[INFO] 
[INFO] -------------------------------------------------------
[INFO]  T E S T S
[INFO] -------------------------------------------------------
[INFO] Running org.apache.maven.wagon.providers.webdav.HttpClientWagonTest
[INFO] Tests run: 6, Failures: 0, Errors: 0, Skipped: 0, Time elapsed: 0.706 s - in org.apache.maven.wagon.providers.webdav.HttpClientWagonTest
[INFO] Running org.apache.maven.wagon.providers.webdav.PathNavigatorTest
[INFO] Tests run: 1, Failures: 0, Errors: 0, Skipped: 0, Time elapsed: 0.009 s - in org.apache.maven.wagon.providers.webdav.PathNavigatorTest
[INFO] Running org.apache.maven.wagon.providers.webdav.WebDavsWagonTest
[INFO] Tests run: 69, Failures: 0, Errors: 0, Skipped: 0, Time elapsed: 31.985 s - in org.apache.maven.wagon.providers.webdav.WebDavsWagonTest
[INFO] Running org.apache.maven.wagon.providers.webdav.WebDavWagonTest
[INFO] Tests run: 69, Failures: 0, Errors: 0, Skipped: 0, Time elapsed: 26.414 s - in org.apache.maven.wagon.providers.webdav.WebDavWagonTest
[INFO] 
[INFO] Results:
[INFO] 
[INFO] Tests run: 145, Failures: 0, Errors: 0, Skipped: 0
[INFO] 
[INFO] 
[INFO] --- maven-jar-plugin:3.0.2:jar (default-jar) @ wagon-webdav-jackrabbit ---
[INFO] Building jar: F:\jenkins\jenkins-slave\workspace\maven-box_maven-wagon_WAGON-501\m\wagon-providers\wagon-webdav-jackrabbit\target\wagon-webdav-jackrabbit-3.1.0-SNAPSHOT.jar
[INFO] 
[INFO] --- maven-site-plugin:3.7:attach-descriptor (attach-descriptor) @ wagon-webdav-jackrabbit
---
[INFO] Skipping because packaging 'jar' is not pom.
[INFO] 
[INFO] --- maven-checkstyle-plugin:3.0.0:check (checkstyle-check) @ wagon-webdav-jackrabbit
---
[INFO] ------------------------------------------------------------------------
[INFO] Reactor Summary for Apache Maven Wagon 3.1.0-SNAPSHOT:
[INFO] 
[INFO] Apache Maven Wagon ................................. SUCCESS [ 51.395 s]
[INFO] Apache Maven Wagon :: API .......................... SUCCESS [ 14.240 s]
[INFO] Apache Maven Wagon :: Provider Test ................ SUCCESS [  5.004 s]
[INFO] Apache Maven Wagon :: Providers .................... SUCCESS [  1.135 s]
[INFO] Apache Maven Wagon :: Providers :: File Provider ... SUCCESS [  3.735 s]
[INFO] Apache Maven Wagon :: Providers :: FTP Provider .... SUCCESS [  7.789 s]
[INFO] Apache Maven Wagon :: Providers :: HTTP Shared Library SUCCESS [  5.012 s]
[INFO] Apache Maven Wagon :: Test Compatibility Kits ...... SUCCESS [  0.834 s]
[INFO] Apache Maven Wagon :: HTTP Test Compatibility Kit .. SUCCESS [  3.199 s]
[INFO] Apache Maven Wagon :: Providers :: HTTP Provider ... SUCCESS [04:34 min]
[INFO] Apache Maven Wagon :: Providers :: Lightweight HTTP Provider SUCCESS [02:14 min]
[INFO] Apache Maven Wagon :: Providers :: SCM Provider .... SUCCESS [01:03 min]
[INFO] Apache Maven Wagon :: Providers :: SSH Common Library SUCCESS [  4.852 s]
[INFO] Apache Maven Wagon :: Providers :: SSH Common Tests  SUCCESS [  4.461 s]
[INFO] Apache Maven Wagon :: Providers :: SSH External Provider SUCCESS [  2.915 s]
[INFO] Apache Maven Wagon :: Providers :: SSH Provider .... SUCCESS [  7.373 s]
[INFO] Apache Maven Wagon :: Providers :: WebDAV Provider . SUCCESS [01:04 min]
[INFO] ------------------------------------------------------------------------
[INFO] BUILD SUCCESS
[INFO] ------------------------------------------------------------------------
[INFO] Total time:  10:52 min
[INFO] Finished at: 2020-01-01T05:45:08-08:00
[INFO] ------------------------------------------------------------------------
[WARNING] The requested profile "run-its" could not be activated because it does not exist.
[INFO] [jenkins-event-spy] Generated F:\jenkins\jenkins-slave\workspace\maven-box_maven-wagon_WAGON-501@tmp\withMavene0919c40\maven-spy-20200101-053415-6178549994634507845724.log
[Pipeline] }
[Pipeline] // dir
[Pipeline] }
[withMaven] junitPublisher - Archive test results for Maven artifact org.apache.maven.wagon:wagon-provider-api:jar:3.1.0-SNAPSHOT
generated by maven-surefire-plugin:test (default-test): m\wagon-provider-api\target\surefire-reports\*.xml
[withMaven] junitPublisher - Archive test results for Maven artifact org.apache.maven.wagon:wagon-provider-test:jar:3.1.0-SNAPSHOT
generated by maven-surefire-plugin:test (default-test): m\wagon-provider-test\target\surefire-reports\*.xml
[withMaven] junitPublisher - Archive test results for Maven artifact org.apache.maven.wagon:wagon-file:jar:3.1.0-SNAPSHOT
generated by maven-surefire-plugin:test (default-test): m\wagon-providers\wagon-file\target\surefire-reports\*.xml
[withMaven] junitPublisher - Archive test results for Maven artifact org.apache.maven.wagon:wagon-ftp:jar:3.1.0-SNAPSHOT
generated by maven-surefire-plugin:test (default-test): m\wagon-providers\wagon-ftp\target\surefire-reports\*.xml
[withMaven] junitPublisher - Archive test results for Maven artifact org.apache.maven.wagon:wagon-http-shared:jar:3.1.0-SNAPSHOT
generated by maven-surefire-plugin:test (default-test): m\wagon-providers\wagon-http-shared\target\surefire-reports\*.xml
[withMaven] junitPublisher - Archive test results for Maven artifact org.apache.maven.wagon:wagon-tck-http:jar:3.1.0-SNAPSHOT
generated by maven-surefire-plugin:test (default-test): m\wagon-tcks\wagon-tck-http\target\surefire-reports\*.xml
[withMaven] junitPublisher - Archive test results for Maven artifact org.apache.maven.wagon:wagon-http:jar:3.1.0-SNAPSHOT
generated by maven-surefire-plugin:test (default-test): m\wagon-providers\wagon-http\target\surefire-reports\*.xml
[withMaven] junitPublisher - Archive test results for Maven artifact org.apache.maven.wagon:wagon-http-lightweight:jar:3.1.0-SNAPSHOT
generated by maven-surefire-plugin:test (default-test): m\wagon-providers\wagon-http-lightweight\target\surefire-reports\*.xml
[withMaven] junitPublisher - Archive test results for Maven artifact org.apache.maven.wagon:wagon-scm:jar:3.1.0-SNAPSHOT
generated by maven-surefire-plugin:test (default-test): m\wagon-providers\wagon-scm\target\surefire-reports\*.xml
[withMaven] junitPublisher - Archive test results for Maven artifact org.apache.maven.wagon:wagon-ssh-common:jar:3.1.0-SNAPSHOT
generated by maven-surefire-plugin:test (default-test): m\wagon-providers\wagon-ssh-common\target\surefire-reports\*.xml
[withMaven] junitPublisher - Archive test results for Maven artifact org.apache.maven.wagon:wagon-ssh-common-test:jar:3.1.0-SNAPSHOT
generated by maven-surefire-plugin:test (default-test): m\wagon-providers\wagon-ssh-common-test\target\surefire-reports\*.xml
[withMaven] junitPublisher - Archive test results for Maven artifact org.apache.maven.wagon:wagon-ssh-external:jar:3.1.0-SNAPSHOT
generated by maven-surefire-plugin:test (default-test): m\wagon-providers\wagon-ssh-external\target\surefire-reports\*.xml
[withMaven] junitPublisher - Archive test results for Maven artifact org.apache.maven.wagon:wagon-ssh:jar:3.1.0-SNAPSHOT
generated by maven-surefire-plugin:test (default-test): m\wagon-providers\wagon-ssh\target\surefire-reports\*.xml
[withMaven] junitPublisher - Archive test results for Maven artifact org.apache.maven.wagon:wagon-webdav-jackrabbit:jar:3.1.0-SNAPSHOT
generated by maven-surefire-plugin:test (default-test): m\wagon-providers\wagon-webdav-jackrabbit\target\surefire-reports\*.xml
Recording test results
[withMaven] Publishers: Pipeline Graph Publisher: 12 ms, Invoker Publisher: 1 ms, Junit Publisher:
2868 ms, Concordion Publisher: 1 ms, Dependencies Fingerprint Publisher: 284 ms, JGiven Publisher:
1 ms
[Pipeline] // withMaven
[Pipeline] cleanWs
[WS-CLEANUP] Deleting project workspace...
[WS-CLEANUP] Deferred wipeout is used...
[WS-CLEANUP] done
[Pipeline] }
[Pipeline] // stage
[Pipeline] }
[Pipeline] // node
[Pipeline] }
[Pipeline] // parallel
[Pipeline] echo
[FAILURE-003] AbortException hudson.AbortException: script returned exit code 1
[Pipeline] stage
[Pipeline] { (Notifications)
[Pipeline] echo
Build result: FAILURE
[Pipeline] jiraIssueSelector
[Pipeline] echo
The authors of changes [].
[Pipeline] echo
Sending email ...
[Pipeline] emailext
Mime
  • Unnamed multipart/mixed (inline, None, 0 bytes)
View raw message