maven-notifications mailing list archives

Site index · List index
Message view « Date » · « Thread »
Top « Date » · « Thread »
From Apache Jenkins Server <jenk...@builds.apache.org>
Subject Build unstable in Jenkins: Maven TLP » maven-scm » SCM-877 #18
Date Wed, 01 Jan 2020 03:34:54 GMT
See https://builds.apache.org/job/maven-box/job/maven-scm/job/SCM-877/18/

No changes.

25 tests failed.
FAILED:  org.apache.maven.scm.plugin.CheckoutMojoTest.windows-jdk8 / Build windows-jdk8 / testExcludeInclude

Error Message:
Cannot run checkout command : 

Stack Trace:
org.apache.maven.plugin.MojoExecutionException: Cannot run checkout command : 
	at org.apache.maven.scm.plugin.CheckoutMojoTest.testExcludeInclude(CheckoutMojoTest.java:153)
Caused by: org.apache.maven.scm.ScmException: Can't load the scm provider.
	at org.apache.maven.scm.plugin.CheckoutMojoTest.testExcludeInclude(CheckoutMojoTest.java:153)
Caused by: org.apache.maven.scm.repository.ScmRepositoryException: The scm url is invalid.
	at org.apache.maven.scm.plugin.CheckoutMojoTest.testExcludeInclude(CheckoutMojoTest.java:153)


FAILED:  org.apache.maven.scm.plugin.CheckoutMojoTest.windows-jdk8 / Build windows-jdk8 / testUseExport

Error Message:
Cannot run checkout command : 

Stack Trace:
org.apache.maven.plugin.MojoExecutionException: Cannot run checkout command : 
	at org.apache.maven.scm.plugin.CheckoutMojoTest.testUseExport(CheckoutMojoTest.java:132)
Caused by: org.apache.maven.scm.ScmException: Can't load the scm provider.
	at org.apache.maven.scm.plugin.CheckoutMojoTest.testUseExport(CheckoutMojoTest.java:132)
Caused by: org.apache.maven.scm.repository.ScmRepositoryException: The scm url is invalid.
	at org.apache.maven.scm.plugin.CheckoutMojoTest.testUseExport(CheckoutMojoTest.java:132)


FAILED:  org.apache.maven.scm.plugin.CheckoutMojoTest.windows-jdk7 / Build windows-jdk7 / testExcludeInclude

Error Message:
Cannot run checkout command : 

Stack Trace:
org.apache.maven.plugin.MojoExecutionException: Cannot run checkout command : 
	at org.apache.maven.scm.plugin.CheckoutMojoTest.testExcludeInclude(CheckoutMojoTest.java:153)
Caused by: org.apache.maven.scm.ScmException: Can't load the scm provider.
	at org.apache.maven.scm.plugin.CheckoutMojoTest.testExcludeInclude(CheckoutMojoTest.java:153)
Caused by: org.apache.maven.scm.repository.ScmRepositoryException: The scm url is invalid.
	at org.apache.maven.scm.plugin.CheckoutMojoTest.testExcludeInclude(CheckoutMojoTest.java:153)


FAILED:  org.apache.maven.scm.plugin.CheckoutMojoTest.windows-jdk7 / Build windows-jdk7 / testUseExport

Error Message:
Cannot run checkout command : 

Stack Trace:
org.apache.maven.plugin.MojoExecutionException: Cannot run checkout command : 
	at org.apache.maven.scm.plugin.CheckoutMojoTest.testUseExport(CheckoutMojoTest.java:132)
Caused by: org.apache.maven.scm.ScmException: Can't load the scm provider.
	at org.apache.maven.scm.plugin.CheckoutMojoTest.testUseExport(CheckoutMojoTest.java:132)
Caused by: org.apache.maven.scm.repository.ScmRepositoryException: The scm url is invalid.
	at org.apache.maven.scm.plugin.CheckoutMojoTest.testUseExport(CheckoutMojoTest.java:132)


FAILED:  org.apache.maven.scm.plugin.CheckoutMojoTest.windows-jdk13 / Build windows-jdk13 / testExcludeInclude

Error Message:
Cannot run checkout command : 

Stack Trace:
org.apache.maven.plugin.MojoExecutionException: Cannot run checkout command : 
	at org.apache.maven.scm.plugin.CheckoutMojoTest.testExcludeInclude(CheckoutMojoTest.java:153)
Caused by: org.apache.maven.scm.ScmException: Can't load the scm provider.
	at org.apache.maven.scm.plugin.CheckoutMojoTest.testExcludeInclude(CheckoutMojoTest.java:153)
Caused by: org.apache.maven.scm.repository.ScmRepositoryException: The scm url is invalid.
	at org.apache.maven.scm.plugin.CheckoutMojoTest.testExcludeInclude(CheckoutMojoTest.java:153)


FAILED:  org.apache.maven.scm.plugin.CheckoutMojoTest.windows-jdk13 / Build windows-jdk13 / testUseExport

Error Message:
Cannot run checkout command : 

Stack Trace:
org.apache.maven.plugin.MojoExecutionException: Cannot run checkout command : 
	at org.apache.maven.scm.plugin.CheckoutMojoTest.testUseExport(CheckoutMojoTest.java:132)
Caused by: org.apache.maven.scm.ScmException: Can't load the scm provider.
	at org.apache.maven.scm.plugin.CheckoutMojoTest.testUseExport(CheckoutMojoTest.java:132)
Caused by: org.apache.maven.scm.repository.ScmRepositoryException: The scm url is invalid.
	at org.apache.maven.scm.plugin.CheckoutMojoTest.testUseExport(CheckoutMojoTest.java:132)


FAILED:  org.apache.maven.scm.plugin.CheckoutMojoTest.windows-jdk11 / Build windows-jdk11 / testExcludeInclude

Error Message:
Cannot run checkout command : 

Stack Trace:
org.apache.maven.plugin.MojoExecutionException: Cannot run checkout command : 
	at org.apache.maven.scm.plugin.CheckoutMojoTest.testExcludeInclude(CheckoutMojoTest.java:153)
Caused by: org.apache.maven.scm.ScmException: Can't load the scm provider.
	at org.apache.maven.scm.plugin.CheckoutMojoTest.testExcludeInclude(CheckoutMojoTest.java:153)
Caused by: org.apache.maven.scm.repository.ScmRepositoryException: The scm url is invalid.
	at org.apache.maven.scm.plugin.CheckoutMojoTest.testExcludeInclude(CheckoutMojoTest.java:153)


FAILED:  org.apache.maven.scm.plugin.CheckoutMojoTest.windows-jdk11 / Build windows-jdk11 / testUseExport

Error Message:
Cannot run checkout command : 

Stack Trace:
org.apache.maven.plugin.MojoExecutionException: Cannot run checkout command : 
	at org.apache.maven.scm.plugin.CheckoutMojoTest.testUseExport(CheckoutMojoTest.java:132)
Caused by: org.apache.maven.scm.ScmException: Can't load the scm provider.
	at org.apache.maven.scm.plugin.CheckoutMojoTest.testUseExport(CheckoutMojoTest.java:132)
Caused by: org.apache.maven.scm.repository.ScmRepositoryException: The scm url is invalid.
	at org.apache.maven.scm.plugin.CheckoutMojoTest.testUseExport(CheckoutMojoTest.java:132)


FAILED:  org.apache.maven.scm.plugin.CheckoutMojoTest.windows-jdk14 / Build windows-jdk14 / testExcludeInclude

Error Message:
Cannot run checkout command : 

Stack Trace:
org.apache.maven.plugin.MojoExecutionException: Cannot run checkout command : 
	at org.apache.maven.scm.plugin.CheckoutMojoTest.testExcludeInclude(CheckoutMojoTest.java:153)
Caused by: org.apache.maven.scm.ScmException: Can't load the scm provider.
	at org.apache.maven.scm.plugin.CheckoutMojoTest.testExcludeInclude(CheckoutMojoTest.java:153)
Caused by: org.apache.maven.scm.repository.ScmRepositoryException: The scm url is invalid.
	at org.apache.maven.scm.plugin.CheckoutMojoTest.testExcludeInclude(CheckoutMojoTest.java:153)


FAILED:  org.apache.maven.scm.plugin.CheckoutMojoTest.windows-jdk14 / Build windows-jdk14 / testUseExport

Error Message:
Cannot run checkout command : 

Stack Trace:
org.apache.maven.plugin.MojoExecutionException: Cannot run checkout command : 
	at org.apache.maven.scm.plugin.CheckoutMojoTest.testUseExport(CheckoutMojoTest.java:132)
Caused by: org.apache.maven.scm.ScmException: Can't load the scm provider.
	at org.apache.maven.scm.plugin.CheckoutMojoTest.testUseExport(CheckoutMojoTest.java:132)
Caused by: org.apache.maven.scm.repository.ScmRepositoryException: The scm url is invalid.
	at org.apache.maven.scm.plugin.CheckoutMojoTest.testUseExport(CheckoutMojoTest.java:132)


FAILED:  org.apache.maven.scm.plugin.ExportMojoTest.windows-jdk8 / Build windows-jdk8 / testExcludeInclude

Error Message:
Cannot run export command : 

Stack Trace:
org.apache.maven.plugin.MojoExecutionException: Cannot run export command : 
	at org.apache.maven.scm.plugin.ExportMojoTest.testExcludeInclude(ExportMojoTest.java:90)
Caused by: org.apache.maven.scm.ScmException: Can't load the scm provider.
	at org.apache.maven.scm.plugin.ExportMojoTest.testExcludeInclude(ExportMojoTest.java:90)
Caused by: org.apache.maven.scm.repository.ScmRepositoryException: The scm url is invalid.
	at org.apache.maven.scm.plugin.ExportMojoTest.testExcludeInclude(ExportMojoTest.java:90)


FAILED:  org.apache.maven.scm.plugin.ExportMojoTest.windows-jdk8 / Build windows-jdk8 / testExport

Error Message:
Cannot run export command : 

Stack Trace:
org.apache.maven.plugin.MojoExecutionException: Cannot run export command : 
	at org.apache.maven.scm.plugin.ExportMojoTest.testExport(ExportMojoTest.java:55)
Caused by: org.apache.maven.scm.ScmException: Can't load the scm provider.
	at org.apache.maven.scm.plugin.ExportMojoTest.testExport(ExportMojoTest.java:55)
Caused by: org.apache.maven.scm.repository.ScmRepositoryException: The scm url is invalid.
	at org.apache.maven.scm.plugin.ExportMojoTest.testExport(ExportMojoTest.java:55)


FAILED:  org.apache.maven.scm.plugin.ExportMojoTest.windows-jdk7 / Build windows-jdk7 / testExcludeInclude

Error Message:
Cannot run export command : 

Stack Trace:
org.apache.maven.plugin.MojoExecutionException: Cannot run export command : 
	at org.apache.maven.scm.plugin.ExportMojoTest.testExcludeInclude(ExportMojoTest.java:90)
Caused by: org.apache.maven.scm.ScmException: Can't load the scm provider.
	at org.apache.maven.scm.plugin.ExportMojoTest.testExcludeInclude(ExportMojoTest.java:90)
Caused by: org.apache.maven.scm.repository.ScmRepositoryException: The scm url is invalid.
	at org.apache.maven.scm.plugin.ExportMojoTest.testExcludeInclude(ExportMojoTest.java:90)


FAILED:  org.apache.maven.scm.plugin.ExportMojoTest.windows-jdk7 / Build windows-jdk7 / testExport

Error Message:
Cannot run export command : 

Stack Trace:
org.apache.maven.plugin.MojoExecutionException: Cannot run export command : 
	at org.apache.maven.scm.plugin.ExportMojoTest.testExport(ExportMojoTest.java:55)
Caused by: org.apache.maven.scm.ScmException: Can't load the scm provider.
	at org.apache.maven.scm.plugin.ExportMojoTest.testExport(ExportMojoTest.java:55)
Caused by: org.apache.maven.scm.repository.ScmRepositoryException: The scm url is invalid.
	at org.apache.maven.scm.plugin.ExportMojoTest.testExport(ExportMojoTest.java:55)


FAILED:  org.apache.maven.scm.plugin.ExportMojoTest.windows-jdk13 / Build windows-jdk13 / testExcludeInclude

Error Message:
Cannot run export command : 

Stack Trace:
org.apache.maven.plugin.MojoExecutionException: Cannot run export command : 
	at org.apache.maven.scm.plugin.ExportMojoTest.testExcludeInclude(ExportMojoTest.java:90)
Caused by: org.apache.maven.scm.ScmException: Can't load the scm provider.
	at org.apache.maven.scm.plugin.ExportMojoTest.testExcludeInclude(ExportMojoTest.java:90)
Caused by: org.apache.maven.scm.repository.ScmRepositoryException: The scm url is invalid.
	at org.apache.maven.scm.plugin.ExportMojoTest.testExcludeInclude(ExportMojoTest.java:90)


FAILED:  org.apache.maven.scm.plugin.ExportMojoTest.windows-jdk13 / Build windows-jdk13 / testExport

Error Message:
Cannot run export command : 

Stack Trace:
org.apache.maven.plugin.MojoExecutionException: Cannot run export command : 
	at org.apache.maven.scm.plugin.ExportMojoTest.testExport(ExportMojoTest.java:55)
Caused by: org.apache.maven.scm.ScmException: Can't load the scm provider.
	at org.apache.maven.scm.plugin.ExportMojoTest.testExport(ExportMojoTest.java:55)
Caused by: org.apache.maven.scm.repository.ScmRepositoryException: The scm url is invalid.
	at org.apache.maven.scm.plugin.ExportMojoTest.testExport(ExportMojoTest.java:55)


FAILED:  org.apache.maven.scm.plugin.ExportMojoTest.windows-jdk11 / Build windows-jdk11 / testExcludeInclude

Error Message:
Cannot run export command : 

Stack Trace:
org.apache.maven.plugin.MojoExecutionException: Cannot run export command : 
	at org.apache.maven.scm.plugin.ExportMojoTest.testExcludeInclude(ExportMojoTest.java:90)
Caused by: org.apache.maven.scm.ScmException: Can't load the scm provider.
	at org.apache.maven.scm.plugin.ExportMojoTest.testExcludeInclude(ExportMojoTest.java:90)
Caused by: org.apache.maven.scm.repository.ScmRepositoryException: The scm url is invalid.
	at org.apache.maven.scm.plugin.ExportMojoTest.testExcludeInclude(ExportMojoTest.java:90)


FAILED:  org.apache.maven.scm.plugin.ExportMojoTest.windows-jdk11 / Build windows-jdk11 / testExport

Error Message:
Cannot run export command : 

Stack Trace:
org.apache.maven.plugin.MojoExecutionException: Cannot run export command : 
	at org.apache.maven.scm.plugin.ExportMojoTest.testExport(ExportMojoTest.java:55)
Caused by: org.apache.maven.scm.ScmException: Can't load the scm provider.
	at org.apache.maven.scm.plugin.ExportMojoTest.testExport(ExportMojoTest.java:55)
Caused by: org.apache.maven.scm.repository.ScmRepositoryException: The scm url is invalid.
	at org.apache.maven.scm.plugin.ExportMojoTest.testExport(ExportMojoTest.java:55)


FAILED:  org.apache.maven.scm.plugin.ExportMojoTest.windows-jdk14 / Build windows-jdk14 / testExcludeInclude

Error Message:
Cannot run export command : 

Stack Trace:
org.apache.maven.plugin.MojoExecutionException: Cannot run export command : 
	at org.apache.maven.scm.plugin.ExportMojoTest.testExcludeInclude(ExportMojoTest.java:90)
Caused by: org.apache.maven.scm.ScmException: Can't load the scm provider.
	at org.apache.maven.scm.plugin.ExportMojoTest.testExcludeInclude(ExportMojoTest.java:90)
Caused by: org.apache.maven.scm.repository.ScmRepositoryException: The scm url is invalid.
	at org.apache.maven.scm.plugin.ExportMojoTest.testExcludeInclude(ExportMojoTest.java:90)


FAILED:  org.apache.maven.scm.plugin.ExportMojoTest.windows-jdk14 / Build windows-jdk14 / testExport

Error Message:
Cannot run export command : 

Stack Trace:
org.apache.maven.plugin.MojoExecutionException: Cannot run export command : 
	at org.apache.maven.scm.plugin.ExportMojoTest.testExport(ExportMojoTest.java:55)
Caused by: org.apache.maven.scm.ScmException: Can't load the scm provider.
	at org.apache.maven.scm.plugin.ExportMojoTest.testExport(ExportMojoTest.java:55)
Caused by: org.apache.maven.scm.repository.ScmRepositoryException: The scm url is invalid.
	at org.apache.maven.scm.plugin.ExportMojoTest.testExport(ExportMojoTest.java:55)


FAILED:  org.apache.maven.scm.plugin.StatusMojoTest.windows-jdk8 / Build windows-jdk8 / testStatusMojo

Error Message:
Cannot run status command : 

Stack Trace:
org.apache.maven.plugin.MojoExecutionException: Cannot run status command : 
	at org.apache.maven.scm.plugin.StatusMojoTest.testStatusMojo(StatusMojoTest.java:49)
Caused by: org.apache.maven.scm.ScmException: Can't load the scm provider.
	at org.apache.maven.scm.plugin.StatusMojoTest.testStatusMojo(StatusMojoTest.java:49)
Caused by: org.apache.maven.scm.repository.ScmRepositoryException: The scm url is invalid.
	at org.apache.maven.scm.plugin.StatusMojoTest.testStatusMojo(StatusMojoTest.java:49)


FAILED:  org.apache.maven.scm.plugin.StatusMojoTest.windows-jdk7 / Build windows-jdk7 / testStatusMojo

Error Message:
Cannot run status command : 

Stack Trace:
org.apache.maven.plugin.MojoExecutionException: Cannot run status command : 
	at org.apache.maven.scm.plugin.StatusMojoTest.testStatusMojo(StatusMojoTest.java:49)
Caused by: org.apache.maven.scm.ScmException: Can't load the scm provider.
	at org.apache.maven.scm.plugin.StatusMojoTest.testStatusMojo(StatusMojoTest.java:49)
Caused by: org.apache.maven.scm.repository.ScmRepositoryException: The scm url is invalid.
	at org.apache.maven.scm.plugin.StatusMojoTest.testStatusMojo(StatusMojoTest.java:49)


FAILED:  org.apache.maven.scm.plugin.StatusMojoTest.windows-jdk13 / Build windows-jdk13 / testStatusMojo

Error Message:
Cannot run status command : 

Stack Trace:
org.apache.maven.plugin.MojoExecutionException: Cannot run status command : 
	at org.apache.maven.scm.plugin.StatusMojoTest.testStatusMojo(StatusMojoTest.java:49)
Caused by: org.apache.maven.scm.ScmException: Can't load the scm provider.
	at org.apache.maven.scm.plugin.StatusMojoTest.testStatusMojo(StatusMojoTest.java:49)
Caused by: org.apache.maven.scm.repository.ScmRepositoryException: The scm url is invalid.
	at org.apache.maven.scm.plugin.StatusMojoTest.testStatusMojo(StatusMojoTest.java:49)


FAILED:  org.apache.maven.scm.plugin.StatusMojoTest.windows-jdk11 / Build windows-jdk11 / testStatusMojo

Error Message:
Cannot run status command : 

Stack Trace:
org.apache.maven.plugin.MojoExecutionException: Cannot run status command : 
	at org.apache.maven.scm.plugin.StatusMojoTest.testStatusMojo(StatusMojoTest.java:49)
Caused by: org.apache.maven.scm.ScmException: Can't load the scm provider.
	at org.apache.maven.scm.plugin.StatusMojoTest.testStatusMojo(StatusMojoTest.java:49)
Caused by: org.apache.maven.scm.repository.ScmRepositoryException: The scm url is invalid.
	at org.apache.maven.scm.plugin.StatusMojoTest.testStatusMojo(StatusMojoTest.java:49)


FAILED:  org.apache.maven.scm.plugin.StatusMojoTest.windows-jdk14 / Build windows-jdk14 / testStatusMojo

Error Message:
Cannot run status command : 

Stack Trace:
org.apache.maven.plugin.MojoExecutionException: Cannot run status command : 
	at org.apache.maven.scm.plugin.StatusMojoTest.testStatusMojo(StatusMojoTest.java:49)
Caused by: org.apache.maven.scm.ScmException: Can't load the scm provider.
	at org.apache.maven.scm.plugin.StatusMojoTest.testStatusMojo(StatusMojoTest.java:49)
Caused by: org.apache.maven.scm.repository.ScmRepositoryException: The scm url is invalid.
	at org.apache.maven.scm.plugin.StatusMojoTest.testStatusMojo(StatusMojoTest.java:49)




Build log:
[...truncated 88822 lines...]
[INFO] Executing: cmd.exe /X /C "svn --non-interactive copy --file C:\Users\jenkins\AppData\Local\Temp\2\maven-scm-724121295.commit --encoding UTF-8 --parents . file:///F:/jenkins/jenkins-slave/workspace/maven-box_maven-scm_SCM-877/m/maven-scm-plugin/target/repository/tags/20191231193435-mytag@"
[INFO] Executing: cmd.exe /X /C "svn --non-interactive copy --file C:\Users\jenkins\AppData\Local\Temp\2\maven-scm-724121295.commit --encoding UTF-8 --parents . file:///F:/jenkins/jenkins-slave/workspace/maven-box_maven-scm_SCM-877/m/maven-scm-plugin/target/repository/tags/20191231193435-mytag@"
[INFO] Working directory: F:\jenkins\jenkins-slave\workspace\maven-box_maven-scm_SCM-877\m\maven-scm-plugin\target\checkout
[INFO] Working directory: F:\jenkins\jenkins-slave\workspace\maven-box_maven-scm_SCM-877\m\maven-scm-plugin\target\checkout
[INFO] Tests run: 2, Failures: 0, Errors: 0, Skipped: 0, Time elapsed: 10.441 s - in org.apache.maven.scm.plugin.TagMojoTest
[INFO] Running org.apache.maven.scm.plugin.UpdateMojoTest
Test command line: cmd.exe /X /C "svnadmin create repository"
[INFO] Removing target\checkout
[INFO] Executing: cmd.exe /X /C "svn --non-interactive checkout file:///F:/jenkins/jenkins-slave/workspace/maven-box_maven-scm_SCM-877/m/maven-scm-plugin/target/repository/trunk@ F:\jenkins\jenkins-slave\workspace\maven-box_maven-scm_SCM-877\m\maven-scm-plugin\target\checkout"
[INFO] Working directory: F:\jenkins\jenkins-slave\workspace\maven-box_maven-scm_SCM-877\m\maven-scm-plugin\target
[INFO] Executing: cmd.exe /X /C "svn --non-interactive update F:\jenkins\jenkins-slave\workspace\maven-box_maven-scm_SCM-877\m\maven-scm-plugin\target\checkout@"
[INFO] Executing: cmd.exe /X /C "svn --non-interactive update F:\jenkins\jenkins-slave\workspace\maven-box_maven-scm_SCM-877\m\maven-scm-plugin\target\checkout@"
[INFO] Working directory: F:\jenkins\jenkins-slave\workspace\maven-box_maven-scm_SCM-877\m\maven-scm-plugin\target\checkout
[INFO] Working directory: F:\jenkins\jenkins-slave\workspace\maven-box_maven-scm_SCM-877\m\maven-scm-plugin\target\checkout
[INFO] Storing revision in 'scm.revision' project property.
[INFO] Project at revision 8
[INFO] Tests run: 1, Failures: 0, Errors: 0, Skipped: 0, Time elapsed: 4.993 s - in org.apache.maven.scm.plugin.UpdateMojoTest
[INFO] Running org.apache.maven.scm.plugin.ValidateMojoTest
[ERROR] Validation of scm url connection (project.scm.connection) failed :
[ERROR] No such provider installed 'unknwonProvider'.
[ERROR] The invalid scm url connection: 'scm:unknwonProvider:http://svn.apache.org/repos/asf/maven/scm/trunk'.
[INFO] project.scm.connection scm connection string is valid.
[INFO] project.scm.developerConnection scm connection string is valid.
[INFO] Tests run: 3, Failures: 0, Errors: 0, Skipped: 0, Time elapsed: 0.12 s - in org.apache.maven.scm.plugin.ValidateMojoTest
[INFO] 
[INFO] Results:
[INFO] 
[ERROR] Errors: 
[ERROR]   CheckoutMojoTest.testExcludeInclude:153 » MojoExecution Cannot run checkout co...
[ERROR]   CheckoutMojoTest.testUseExport:132 » MojoExecution Cannot run checkout command...
[ERROR]   ExportMojoTest.testExcludeInclude:90 » MojoExecution Cannot run export command...
[ERROR]   ExportMojoTest.testExport:55 » MojoExecution Cannot run export command : 
[ERROR]   StatusMojoTest.testStatusMojo:49 » MojoExecution Cannot run status command : 
[INFO] 
[ERROR] Tests run: 22, Failures: 0, Errors: 5, Skipped: 0
[INFO] 
[ERROR] There are test failures.

Please refer to F:\jenkins\jenkins-slave\workspace\maven-box_maven-scm_SCM-877\m\maven-scm-plugin\target\surefire-reports for the individual test results.
Please refer to dump files (if any exist) [date]-jvmRun[N].dump, [date].dumpstream and [date]-jvmRun[N].dumpstream.
[INFO] 
[INFO] --- maven-jar-plugin:3.1.0:jar (default-jar) @ maven-scm-plugin ---
[INFO] Building jar: F:\jenkins\jenkins-slave\workspace\maven-box_maven-scm_SCM-877\m\maven-scm-plugin\target\maven-scm-plugin-1.11.1-SNAPSHOT.jar
[INFO] 
[INFO] --- maven-plugin-plugin:3.2:addPluginArtifactMetadata (default-addPluginArtifactMetadata) @ maven-scm-plugin ---
[INFO] 
[INFO] --- maven-site-plugin:3.7.1:attach-descriptor (attach-descriptor) @ maven-scm-plugin ---
[INFO] Skipping because packaging 'maven-plugin' is not pom.
[INFO] 
[INFO] --- maven-invoker-plugin:3.1.0:install (integration-test) @ maven-scm-plugin ---
[INFO] Downloading from central: https://repo.maven.apache.org/maven2/org/apache/maven/shared/maven-invoker/3.0.1/maven-invoker-3.0.1.pom
[INFO] Downloaded from central: https://repo.maven.apache.org/maven2/org/apache/maven/shared/maven-invoker/3.0.1/maven-invoker-3.0.1.pom (4.9 kB at 121 kB/s)
[INFO] Downloading from central: https://repo.maven.apache.org/maven2/org/apache/maven/shared/maven-shared-components/31/maven-shared-components-31.pom
[INFO] Downloaded from central: https://repo.maven.apache.org/maven2/org/apache/maven/shared/maven-shared-components/31/maven-shared-components-31.pom (5.1 kB at 142 kB/s)
[INFO] Downloading from central: https://repo.maven.apache.org/maven2/org/apache/maven/reporting/maven-reporting-impl/2.4/maven-reporting-impl-2.4.pom
[INFO] Downloaded from central: https://repo.maven.apache.org/maven2/org/apache/maven/reporting/maven-reporting-impl/2.4/maven-reporting-impl-2.4.pom (6.1 kB at 209 kB/s)
[INFO] Downloading from central: https://repo.maven.apache.org/maven2/commons-validator/commons-validator/1.4.1/commons-validator-1.4.1.pom
[INFO] Downloaded from central: https://repo.maven.apache.org/maven2/commons-validator/commons-validator/1.4.1/commons-validator-1.4.1.pom (13 kB at 453 kB/s)
[INFO] Downloading from central: https://repo.maven.apache.org/maven2/org/apache/commons/commons-parent/36/commons-parent-36.pom
[INFO] Downloaded from central: https://repo.maven.apache.org/maven2/org/apache/commons/commons-parent/36/commons-parent-36.pom (58 kB at 1.4 MB/s)
[INFO] Downloading from central: https://repo.maven.apache.org/maven2/commons-beanutils/commons-beanutils/1.8.3/commons-beanutils-1.8.3.pom
[INFO] Downloaded from central: https://repo.maven.apache.org/maven2/commons-beanutils/commons-beanutils/1.8.3/commons-beanutils-1.8.3.pom (11 kB at 415 kB/s)
[INFO] Downloading from central: https://repo.maven.apache.org/maven2/org/apache/commons/commons-parent/14/commons-parent-14.pom
[INFO] Downloaded from central: https://repo.maven.apache.org/maven2/org/apache/commons/commons-parent/14/commons-parent-14.pom (31 kB at 1.0 MB/s)
[INFO] Downloading from central: https://repo.maven.apache.org/maven2/commons-digester/commons-digester/1.8.1/commons-digester-1.8.1.pom
[INFO] Downloaded from central: https://repo.maven.apache.org/maven2/commons-digester/commons-digester/1.8.1/commons-digester-1.8.1.pom (10 kB at 386 kB/s)
[INFO] Downloading from central: https://repo.maven.apache.org/maven2/org/apache/maven/shared/maven-script-interpreter/1.2/maven-script-interpreter-1.2.pom
[INFO] Downloaded from central: https://repo.maven.apache.org/maven2/org/apache/maven/shared/maven-script-interpreter/1.2/maven-script-interpreter-1.2.pom (4.0 kB at 108 kB/s)
[INFO] Downloading from central: https://repo.maven.apache.org/maven2/org/apache/ant/ant/1.8.1/ant-1.8.1.pom
[INFO] Downloaded from central: https://repo.maven.apache.org/maven2/org/apache/ant/ant/1.8.1/ant-1.8.1.pom (8.8 kB at 215 kB/s)
[INFO] Downloading from central: https://repo.maven.apache.org/maven2/org/apache/ant/ant-parent/1.8.1/ant-parent-1.8.1.pom
[INFO] Downloaded from central: https://repo.maven.apache.org/maven2/org/apache/ant/ant-parent/1.8.1/ant-parent-1.8.1.pom (4.3 kB at 119 kB/s)
[INFO] Downloading from central: https://repo.maven.apache.org/maven2/org/apache/maven/shared/maven-artifact-transfer/0.9.1/maven-artifact-transfer-0.9.1.pom
[INFO] Downloaded from central: https://repo.maven.apache.org/maven2/org/apache/maven/shared/maven-artifact-transfer/0.9.1/maven-artifact-transfer-0.9.1.pom (7.6 kB at 211 kB/s)
[INFO] Downloading from central: https://repo.maven.apache.org/maven2/org/apache/maven/doxia/doxia-sink-api/1.7/doxia-sink-api-1.7.pom
[INFO] Downloaded from central: https://repo.maven.apache.org/maven2/org/apache/maven/doxia/doxia-sink-api/1.7/doxia-sink-api-1.7.pom (1.5 kB at 46 kB/s)
[INFO] Downloading from central: https://repo.maven.apache.org/maven2/org/apache/maven/doxia/doxia/1.7/doxia-1.7.pom
[INFO] Downloaded from central: https://repo.maven.apache.org/maven2/org/apache/maven/doxia/doxia/1.7/doxia-1.7.pom (15 kB at 462 kB/s)
[INFO] Downloading from central: https://repo.maven.apache.org/maven2/org/apache/maven/doxia/doxia-logging-api/1.7/doxia-logging-api-1.7.pom
[INFO] Downloaded from central: https://repo.maven.apache.org/maven2/org/apache/maven/doxia/doxia-logging-api/1.7/doxia-logging-api-1.7.pom (1.5 kB at 48 kB/s)
[INFO] Downloading from central: https://repo.maven.apache.org/maven2/org/apache/maven/doxia/doxia-site-renderer/1.7.4/doxia-site-renderer-1.7.4.pom
[INFO] Downloaded from central: https://repo.maven.apache.org/maven2/org/apache/maven/doxia/doxia-site-renderer/1.7.4/doxia-site-renderer-1.7.4.pom (6.7 kB at 216 kB/s)
[INFO] Downloading from central: https://repo.maven.apache.org/maven2/org/apache/maven/doxia/doxia-sitetools/1.7.4/doxia-sitetools-1.7.4.pom
[INFO] Downloaded from central: https://repo.maven.apache.org/maven2/org/apache/maven/doxia/doxia-sitetools/1.7.4/doxia-sitetools-1.7.4.pom (14 kB at 453 kB/s)
[INFO] Downloading from central: https://repo.maven.apache.org/maven2/org/apache/maven/doxia/doxia-core/1.7/doxia-core-1.7.pom
[INFO] Downloaded from central: https://repo.maven.apache.org/maven2/org/apache/maven/doxia/doxia-core/1.7/doxia-core-1.7.pom (4.1 kB at 140 kB/s)
[INFO] Downloading from central: https://repo.maven.apache.org/maven2/org/apache/maven/doxia/doxia-decoration-model/1.7.4/doxia-decoration-model-1.7.4.pom
[INFO] Downloaded from central: https://repo.maven.apache.org/maven2/org/apache/maven/doxia/doxia-decoration-model/1.7.4/doxia-decoration-model-1.7.4.pom (3.4 kB at 117 kB/s)
[INFO] Downloading from central: https://repo.maven.apache.org/maven2/org/apache/maven/doxia/doxia-skin-model/1.7.4/doxia-skin-model-1.7.4.pom
[INFO] Downloaded from central: https://repo.maven.apache.org/maven2/org/apache/maven/doxia/doxia-skin-model/1.7.4/doxia-skin-model-1.7.4.pom (3.0 kB at 108 kB/s)
[INFO] Downloading from central: https://repo.maven.apache.org/maven2/org/apache/maven/doxia/doxia-module-xhtml/1.7/doxia-module-xhtml-1.7.pom
[INFO] Downloaded from central: https://repo.maven.apache.org/maven2/org/apache/maven/doxia/doxia-module-xhtml/1.7/doxia-module-xhtml-1.7.pom (1.6 kB at 53 kB/s)
[INFO] Downloading from central: https://repo.maven.apache.org/maven2/org/apache/maven/doxia/doxia-modules/1.7/doxia-modules-1.7.pom
[INFO] Downloaded from central: https://repo.maven.apache.org/maven2/org/apache/maven/doxia/doxia-modules/1.7/doxia-modules-1.7.pom (2.6 kB at 94 kB/s)
[INFO] Downloading from central: https://repo.maven.apache.org/maven2/org/codehaus/groovy/groovy-all/2.4.8/groovy-all-2.4.8.pom
[INFO] Downloaded from central: https://repo.maven.apache.org/maven2/org/codehaus/groovy/groovy-all/2.4.8/groovy-all-2.4.8.pom (21 kB at 648 kB/s)
[INFO] Downloading from central: https://repo.maven.apache.org/maven2/org/apache/maven/shared/maven-invoker/3.0.1/maven-invoker-3.0.1.jar
[INFO] Downloading from central: https://repo.maven.apache.org/maven2/commons-beanutils/commons-beanutils/1.8.3/commons-beanutils-1.8.3.jar
[INFO] Downloading from central: https://repo.maven.apache.org/maven2/commons-digester/commons-digester/1.8.1/commons-digester-1.8.1.jar
[INFO] Downloading from central: https://repo.maven.apache.org/maven2/commons-validator/commons-validator/1.4.1/commons-validator-1.4.1.jar
[INFO] Downloading from central: https://repo.maven.apache.org/maven2/org/apache/maven/reporting/maven-reporting-impl/2.4/maven-reporting-impl-2.4.jar
[INFO] Downloaded from central: https://repo.maven.apache.org/maven2/org/apache/maven/shared/maven-invoker/3.0.1/maven-invoker-3.0.1.jar (33 kB at 1.1 MB/s)
[INFO] Downloading from central: https://repo.maven.apache.org/maven2/commons-logging/commons-logging/1.2/commons-logging-1.2.jar
[INFO] Downloaded from central: https://repo.maven.apache.org/maven2/commons-digester/commons-digester/1.8.1/commons-digester-1.8.1.jar (146 kB at 3.3 MB/s)
[INFO] Downloading from central: https://repo.maven.apache.org/maven2/org/apache/maven/shared/maven-script-interpreter/1.2/maven-script-interpreter-1.2.jar
[INFO] Downloaded from central: https://repo.maven.apache.org/maven2/commons-beanutils/commons-beanutils/1.8.3/commons-beanutils-1.8.3.jar (232 kB at 5.0 MB/s)
[INFO] Downloading from central: https://repo.maven.apache.org/maven2/org/apache/ant/ant/1.8.1/ant-1.8.1.jar
[INFO] Downloaded from central: https://repo.maven.apache.org/maven2/commons-validator/commons-validator/1.4.1/commons-validator-1.4.1.jar (190 kB at 3.8 MB/s)
[INFO] Downloading from central: https://repo.maven.apache.org/maven2/org/apache/maven/shared/maven-artifact-transfer/0.9.1/maven-artifact-transfer-0.9.1.jar
[INFO] Downloaded from central: https://repo.maven.apache.org/maven2/commons-logging/commons-logging/1.2/commons-logging-1.2.jar (62 kB at 1.0 MB/s)
[INFO] Downloading from central: https://repo.maven.apache.org/maven2/org/apache/maven/doxia/doxia-sink-api/1.7/doxia-sink-api-1.7.jar
[INFO] Downloaded from central: https://repo.maven.apache.org/maven2/org/apache/maven/shared/maven-artifact-transfer/0.9.1/maven-artifact-transfer-0.9.1.jar (123 kB at 1.3 MB/s)
[INFO] Downloading from central: https://repo.maven.apache.org/maven2/org/apache/maven/doxia/doxia-logging-api/1.7/doxia-logging-api-1.7.jar
[INFO] Downloaded from central: https://repo.maven.apache.org/maven2/org/apache/maven/reporting/maven-reporting-impl/2.4/maven-reporting-impl-2.4.jar (20 kB at 153 kB/s)
[INFO] Downloading from central: https://repo.maven.apache.org/maven2/org/apache/maven/doxia/doxia-site-renderer/1.7.4/doxia-site-renderer-1.7.4.jar
[INFO] Downloaded from central: https://repo.maven.apache.org/maven2/org/apache/ant/ant/1.8.1/ant-1.8.1.jar (1.5 MB at 9.0 MB/s)
[INFO] Downloading from central: https://repo.maven.apache.org/maven2/org/apache/maven/doxia/doxia-decoration-model/1.7.4/doxia-decoration-model-1.7.4.jar
[INFO] Downloaded from central: https://repo.maven.apache.org/maven2/org/apache/maven/doxia/doxia-site-renderer/1.7.4/doxia-site-renderer-1.7.4.jar (64 kB at 365 kB/s)
[INFO] Downloading from central: https://repo.maven.apache.org/maven2/org/apache/maven/doxia/doxia-skin-model/1.7.4/doxia-skin-model-1.7.4.jar
[INFO] Downloaded from central: https://repo.maven.apache.org/maven2/org/apache/maven/doxia/doxia-sink-api/1.7/doxia-sink-api-1.7.jar (11 kB at 62 kB/s)
[INFO] Downloading from central: https://repo.maven.apache.org/maven2/org/apache/maven/doxia/doxia-module-xhtml/1.7/doxia-module-xhtml-1.7.jar
[INFO] Downloaded from central: https://repo.maven.apache.org/maven2/org/apache/maven/doxia/doxia-decoration-model/1.7.4/doxia-decoration-model-1.7.4.jar (61 kB at 289 kB/s)
[INFO] Downloading from central: https://repo.maven.apache.org/maven2/org/codehaus/groovy/groovy-all/2.4.8/groovy-all-2.4.8.jar
[INFO] Downloaded from central: https://repo.maven.apache.org/maven2/org/apache/maven/doxia/doxia-logging-api/1.7/doxia-logging-api-1.7.jar (12 kB at 50 kB/s)
[INFO] Downloaded from central: https://repo.maven.apache.org/maven2/org/apache/maven/shared/maven-script-interpreter/1.2/maven-script-interpreter-1.2.jar (22 kB at 95 kB/s)
[INFO] Downloaded from central: https://repo.maven.apache.org/maven2/org/apache/maven/doxia/doxia-module-xhtml/1.7/doxia-module-xhtml-1.7.jar (17 kB at 58 kB/s)
[INFO] Downloaded from central: https://repo.maven.apache.org/maven2/org/apache/maven/doxia/doxia-skin-model/1.7.4/doxia-skin-model-1.7.4.jar (16 kB at 52 kB/s)
[INFO] Downloaded from central: https://repo.maven.apache.org/maven2/org/codehaus/groovy/groovy-all/2.4.8/groovy-all-2.4.8.jar (7.0 MB at 18 MB/s)
[INFO] Installing F:\jenkins\jenkins-slave\workspace\maven-box_maven-scm_SCM-877\m\maven-scm-managers\maven-scm-manager-plexus\pom.xml to F:\jenkins\jenkins-slave\workspace\maven-box_maven-scm_SCM-877\m\maven-scm-plugin\target\local-repo\org\apache\maven\scm\maven-scm-manager-plexus\1.11.1-SNAPSHOT\maven-scm-manager-plexus-1.11.1-SNAPSHOT.pom
[INFO] Installing F:\jenkins\jenkins-slave\workspace\maven-box_maven-scm_SCM-877\m\maven-scm-managers\maven-scm-manager-plexus\target\maven-scm-manager-plexus-1.11.1-SNAPSHOT.jar to F:\jenkins\jenkins-slave\workspace\maven-box_maven-scm_SCM-877\m\maven-scm-plugin\target\local-repo\org\apache\maven\scm\maven-scm-manager-plexus\1.11.1-SNAPSHOT\maven-scm-manager-plexus-1.11.1-SNAPSHOT.jar
[INFO] Installing F:\jenkins\jenkins-slave\workspace\maven-box_maven-scm_SCM-877\m\maven-scm-managers\pom.xml to F:\jenkins\jenkins-slave\workspace\maven-box_maven-scm_SCM-877\m\maven-scm-plugin\target\local-repo\org\apache\maven\scm\maven-scm-managers\1.11.1-SNAPSHOT\maven-scm-managers-1.11.1-SNAPSHOT.pom
[INFO] Installing f:\jenkins\jenkins-slave\workspace\maven-box_maven-scm_SCM-877\m\pom.xml to F:\jenkins\jenkins-slave\workspace\maven-box_maven-scm_SCM-877\m\maven-scm-plugin\target\local-repo\org\apache\maven\scm\maven-scm\1.11.1-SNAPSHOT\maven-scm-1.11.1-SNAPSHOT.pom
[INFO] Installing F:\jenkins\jenkins-slave\workspace\maven-box_maven-scm_SCM-877\m\maven-scm-providers\maven-scm-provider-local\pom.xml to F:\jenkins\jenkins-slave\workspace\maven-box_maven-scm_SCM-877\m\maven-scm-plugin\target\local-repo\org\apache\maven\scm\maven-scm-provider-local\1.11.1-SNAPSHOT\maven-scm-provider-local-1.11.1-SNAPSHOT.pom
[INFO] Installing F:\jenkins\jenkins-slave\workspace\maven-box_maven-scm_SCM-877\m\maven-scm-providers\maven-scm-provider-local\target\maven-scm-provider-local-1.11.1-SNAPSHOT.jar to F:\jenkins\jenkins-slave\workspace\maven-box_maven-scm_SCM-877\m\maven-scm-plugin\target\local-repo\org\apache\maven\scm\maven-scm-provider-local\1.11.1-SNAPSHOT\maven-scm-provider-local-1.11.1-SNAPSHOT.jar
[INFO] Installing F:\jenkins\jenkins-slave\workspace\maven-box_maven-scm_SCM-877\m\maven-scm-providers\pom.xml to F:\jenkins\jenkins-slave\workspace\maven-box_maven-scm_SCM-877\m\maven-scm-plugin\target\local-repo\org\apache\maven\scm\maven-scm-providers\1.11.1-SNAPSHOT\maven-scm-providers-1.11.1-SNAPSHOT.pom
[INFO] Installing F:\jenkins\jenkins-slave\workspace\maven-box_maven-scm_SCM-877\m\maven-scm-providers\maven-scm-providers-svn\maven-scm-provider-svn-commons\pom.xml to F:\jenkins\jenkins-slave\workspace\maven-box_maven-scm_SCM-877\m\maven-scm-plugin\target\local-repo\org\apache\maven\scm\maven-scm-provider-svn-commons\1.11.1-SNAPSHOT\maven-scm-provider-svn-commons-1.11.1-SNAPSHOT.pom
[INFO] Installing F:\jenkins\jenkins-slave\workspace\maven-box_maven-scm_SCM-877\m\maven-scm-providers\maven-scm-providers-svn\maven-scm-provider-svn-commons\target\maven-scm-provider-svn-commons-1.11.1-SNAPSHOT.jar to F:\jenkins\jenkins-slave\workspace\maven-box_maven-scm_SCM-877\m\maven-scm-plugin\target\local-repo\org\apache\maven\scm\maven-scm-provider-svn-commons\1.11.1-SNAPSHOT\maven-scm-provider-svn-commons-1.11.1-SNAPSHOT.jar
[INFO] Installing F:\jenkins\jenkins-slave\workspace\maven-box_maven-scm_SCM-877\m\maven-scm-providers\maven-scm-providers-svn\pom.xml to F:\jenkins\jenkins-slave\workspace\maven-box_maven-scm_SCM-877\m\maven-scm-plugin\target\local-repo\org\apache\maven\scm\maven-scm-providers-svn\1.11.1-SNAPSHOT\maven-scm-providers-svn-1.11.1-SNAPSHOT.pom
[INFO] Installing F:\jenkins\jenkins-slave\workspace\maven-box_maven-scm_SCM-877\m\maven-scm-providers\maven-scm-providers-svn\maven-scm-provider-svntest\pom.xml to F:\jenkins\jenkins-slave\workspace\maven-box_maven-scm_SCM-877\m\maven-scm-plugin\target\local-repo\org\apache\maven\scm\maven-scm-provider-svntest\1.11.1-SNAPSHOT\maven-scm-provider-svntest-1.11.1-SNAPSHOT.pom
[INFO] Installing F:\jenkins\jenkins-slave\workspace\maven-box_maven-scm_SCM-877\m\maven-scm-providers\maven-scm-providers-svn\maven-scm-provider-svntest\target\maven-scm-provider-svntest-1.11.1-SNAPSHOT.jar to F:\jenkins\jenkins-slave\workspace\maven-box_maven-scm_SCM-877\m\maven-scm-plugin\target\local-repo\org\apache\maven\scm\maven-scm-provider-svntest\1.11.1-SNAPSHOT\maven-scm-provider-svntest-1.11.1-SNAPSHOT.jar
[INFO] Installing F:\jenkins\jenkins-slave\workspace\maven-box_maven-scm_SCM-877\m\maven-scm-providers\maven-scm-providers-standard\pom.xml to F:\jenkins\jenkins-slave\workspace\maven-box_maven-scm_SCM-877\m\maven-scm-plugin\target\local-repo\org\apache\maven\scm\maven-scm-providers-standard\1.11.1-SNAPSHOT\maven-scm-providers-standard-1.11.1-SNAPSHOT.pom
[INFO] Installing F:\jenkins\jenkins-slave\workspace\maven-box_maven-scm_SCM-877\m\maven-scm-plugin\pom.xml to F:\jenkins\jenkins-slave\workspace\maven-box_maven-scm_SCM-877\m\maven-scm-plugin\target\local-repo\org\apache\maven\plugins\maven-scm-plugin\1.11.1-SNAPSHOT\maven-scm-plugin-1.11.1-SNAPSHOT.pom
[INFO] Installing F:\jenkins\jenkins-slave\workspace\maven-box_maven-scm_SCM-877\m\maven-scm-plugin\target\maven-scm-plugin-1.11.1-SNAPSHOT.jar to F:\jenkins\jenkins-slave\workspace\maven-box_maven-scm_SCM-877\m\maven-scm-plugin\target\local-repo\org\apache\maven\plugins\maven-scm-plugin\1.11.1-SNAPSHOT\maven-scm-plugin-1.11.1-SNAPSHOT.jar
[INFO] 
[INFO] --- maven-invoker-plugin:3.1.0:run (integration-test) @ maven-scm-plugin ---
[INFO] No projects were selected for execution.
[INFO] 
[INFO] --- maven-checkstyle-plugin:3.0.0:check (checkstyle-check) @ maven-scm-plugin ---
[INFO] ------------------------------------------------------------------------
[INFO] Reactor Summary for Maven SCM 1.11.1-SNAPSHOT:
[INFO] 
[INFO] Maven SCM .......................................... SUCCESS [01:13 min]
[INFO] Maven SCM API ...................................... SUCCESS [ 24.401 s]
[INFO] Maven SCM Managers ................................. SUCCESS [  0.993 s]
[INFO] Maven SCM Manager for Plexus ....................... SUCCESS [  8.054 s]
[INFO] Maven SCM Test ..................................... SUCCESS [  5.000 s]
[INFO] Maven SCM Providers ................................ SUCCESS [  1.159 s]
[INFO] Maven SCM AccuRev Provider ......................... SUCCESS [ 17.095 s]
[INFO] Maven SCM Bazaar Provider .......................... SUCCESS [  5.828 s]
[INFO] Maven SCM Clearcase Provider ....................... SUCCESS [ 14.213 s]
[INFO] Maven SCM CVS Provider - Parent .................... SUCCESS [  0.833 s]
[INFO] Maven SCM CVS Provider TCK tests ................... SUCCESS [  2.946 s]
[INFO] Maven SCM CVS Provider - Common library ............ SUCCESS [  7.547 s]
[INFO] Maven SCM CVS Provider - CVS Executable Impl. ...... SUCCESS [  5.586 s]
[INFO] Maven SCM CVS Provider - CVS Java Impl. ............ SUCCESS [  5.856 s]
[INFO] Maven SCM Mercurial (Hg) Provider .................. SUCCESS [  5.811 s]
[INFO] Maven SCM Git Provider - Parent .................... SUCCESS [  1.381 s]
[INFO] Maven SCM Git Provider - Common library ............ SUCCESS [  5.530 s]
[INFO] Maven SCM Git Provider TCK Tests ................... SUCCESS [  2.116 s]
[INFO] Maven SCM Git Provider - Git Executable Impl. ...... SUCCESS [ 28.382 s]
[INFO] Maven SCM Git Provider - JGit Impl. ................ SUCCESS [ 57.880 s]
[INFO] Maven SCM Local Provider ........................... SUCCESS [  4.218 s]
[INFO] Maven SCM Perforce Provider ........................ SUCCESS [  5.741 s]
[INFO] Maven SCM Starteam Provider ........................ SUCCESS [  7.134 s]
[INFO] Maven SCM Subversion Provider - Parent ............. SUCCESS [  0.765 s]
[INFO] Maven SCM Subversion Provider - Common library ..... SUCCESS [  4.148 s]
[INFO] Maven SCM Subversion Provider TCK Tests ............ SUCCESS [  1.445 s]
[INFO] Maven SCM Subversion Provider - SVN Executable Impl. SUCCESS [  7.004 s]
[INFO] Maven SCM Synergy Provider ......................... SUCCESS [  4.518 s]
[INFO] Maven SCM Visual Source Safe Provider .............. SUCCESS [  4.442 s]
[INFO] Maven SCM TFS Provider ............................. SUCCESS [  4.702 s]
[INFO] Maven SCM MKS Integrity Provider ................... SUCCESS [  5.223 s]
[INFO] Maven SCM Jazz/Rational Team Concert Provider ...... SUCCESS [  5.268 s]
[INFO] Maven SCM Standard Providers ....................... SUCCESS [  1.380 s]
[INFO] Maven SCM Client ................................... SUCCESS [  4.744 s]
[INFO] Maven SCM Plugin ................................... SUCCESS [01:17 min]
[INFO] ------------------------------------------------------------------------
[INFO] BUILD SUCCESS
[INFO] ------------------------------------------------------------------------
[INFO] Total time:  06:54 min
[INFO] Finished at: 2019-12-31T19:34:46-08:00
[INFO] ------------------------------------------------------------------------
[WARNING] The requested profile "run-its" could not be activated because it does not exist.
[INFO] [jenkins-event-spy] Generated F:\jenkins\jenkins-slave\workspace\maven-box_maven-scm_SCM-877@tmp\withMavenec13ae0a\maven-spy-20191231-192751-78613475431191529979098.log
[Pipeline] }
[Pipeline] // dir
[Pipeline] }
[withMaven] invokerPublisher - Archive invoker results for Maven artifact MavenArtifact{org.apache.maven.plugins:maven-scm-plugin:maven-plugin:1.11.1-SNAPSHOT(version: 1.11.1-SNAPSHOT, snapshot:false) } generated by PluginInvocation{org.apache.maven.plugins:maven-invoker-plugin:3.1.0@run  integration-test}: m\maven-scm-plugin\target\invoker-reports\*.xml
[withMaven] junitPublisher - Archive test results for Maven artifact org.apache.maven.scm:maven-scm-api:jar:1.11.1-SNAPSHOT generated by maven-surefire-plugin:test (default-test): m\maven-scm-api\target\surefire-reports\*.xml
[withMaven] junitPublisher - Archive test results for Maven artifact org.apache.maven.scm:maven-scm-manager-plexus:jar:1.11.1-SNAPSHOT generated by maven-surefire-plugin:test (default-test): m\maven-scm-managers\maven-scm-manager-plexus\target\surefire-reports\*.xml
[withMaven] junitPublisher - Archive test results for Maven artifact org.apache.maven.scm:maven-scm-test:jar:1.11.1-SNAPSHOT generated by maven-surefire-plugin:test (default-test): m\maven-scm-test\target\surefire-reports\*.xml
[withMaven] junitPublisher - Archive test results for Maven artifact org.apache.maven.scm:maven-scm-provider-accurev:jar:1.11.1-SNAPSHOT generated by maven-surefire-plugin:test (default-test): m\maven-scm-providers\maven-scm-provider-accurev\target\surefire-reports\*.xml
[withMaven] junitPublisher - Archive test results for Maven artifact org.apache.maven.scm:maven-scm-provider-bazaar:jar:1.11.1-SNAPSHOT generated by maven-surefire-plugin:test (default-test): m\maven-scm-providers\maven-scm-provider-bazaar\target\surefire-reports\*.xml
[withMaven] junitPublisher - Archive test results for Maven artifact org.apache.maven.scm:maven-scm-provider-clearcase:jar:1.11.1-SNAPSHOT generated by maven-surefire-plugin:test (default-test): m\maven-scm-providers\maven-scm-provider-clearcase\target\surefire-reports\*.xml
[withMaven] junitPublisher - Archive test results for Maven artifact org.apache.maven.scm:maven-scm-provider-cvstest:jar:1.11.1-SNAPSHOT generated by maven-surefire-plugin:test (default-test): m\maven-scm-providers\maven-scm-providers-cvs\maven-scm-provider-cvstest\target\surefire-reports\*.xml
[withMaven] junitPublisher - Archive test results for Maven artifact org.apache.maven.scm:maven-scm-provider-cvs-commons:jar:1.11.1-SNAPSHOT generated by maven-surefire-plugin:test (default-test): m\maven-scm-providers\maven-scm-providers-cvs\maven-scm-provider-cvs-commons\target\surefire-reports\*.xml
[withMaven] junitPublisher - Archive test results for Maven artifact org.apache.maven.scm:maven-scm-provider-cvsexe:jar:1.11.1-SNAPSHOT generated by maven-surefire-plugin:test (default-test): m\maven-scm-providers\maven-scm-providers-cvs\maven-scm-provider-cvsexe\target\surefire-reports\*.xml
[withMaven] junitPublisher - Archive test results for Maven artifact org.apache.maven.scm:maven-scm-provider-cvsjava:jar:1.11.1-SNAPSHOT generated by maven-surefire-plugin:test (default-test): m\maven-scm-providers\maven-scm-providers-cvs\maven-scm-provider-cvsjava\target\surefire-reports\*.xml
[withMaven] junitPublisher - Archive test results for Maven artifact org.apache.maven.scm:maven-scm-provider-hg:jar:1.11.1-SNAPSHOT generated by maven-surefire-plugin:test (default-test): m\maven-scm-providers\maven-scm-provider-hg\target\surefire-reports\*.xml
[withMaven] junitPublisher - Archive test results for Maven artifact org.apache.maven.scm:maven-scm-provider-git-commons:jar:1.11.1-SNAPSHOT generated by maven-surefire-plugin:test (default-test): m\maven-scm-providers\maven-scm-providers-git\maven-scm-provider-git-commons\target\surefire-reports\*.xml
[withMaven] junitPublisher - Archive test results for Maven artifact org.apache.maven.scm:maven-scm-provider-gittest:jar:1.11.1-SNAPSHOT generated by maven-surefire-plugin:test (default-test): m\maven-scm-providers\maven-scm-providers-git\maven-scm-provider-gittest\target\surefire-reports\*.xml
[withMaven] junitPublisher - Archive test results for Maven artifact org.apache.maven.scm:maven-scm-provider-gitexe:jar:1.11.1-SNAPSHOT generated by maven-surefire-plugin:test (default-test): m\maven-scm-providers\maven-scm-providers-git\maven-scm-provider-gitexe\target\surefire-reports\*.xml
[withMaven] junitPublisher - Archive test results for Maven artifact org.apache.maven.scm:maven-scm-provider-jgit:jar:1.11.1-SNAPSHOT generated by maven-surefire-plugin:test (default-test): m\maven-scm-providers\maven-scm-providers-git\maven-scm-provider-jgit\target\surefire-reports\*.xml
[withMaven] junitPublisher - Archive test results for Maven artifact org.apache.maven.scm:maven-scm-provider-local:jar:1.11.1-SNAPSHOT generated by maven-surefire-plugin:test (default-test): m\maven-scm-providers\maven-scm-provider-local\target\surefire-reports\*.xml
[withMaven] junitPublisher - Archive test results for Maven artifact org.apache.maven.scm:maven-scm-provider-perforce:jar:1.11.1-SNAPSHOT generated by maven-surefire-plugin:test (default-test): m\maven-scm-providers\maven-scm-provider-perforce\target\surefire-reports\*.xml
[withMaven] junitPublisher - Archive test results for Maven artifact org.apache.maven.scm:maven-scm-provider-starteam:jar:1.11.1-SNAPSHOT generated by maven-surefire-plugin:test (default-test): m\maven-scm-providers\maven-scm-provider-starteam\target\surefire-reports\*.xml
[withMaven] junitPublisher - Archive test results for Maven artifact org.apache.maven.scm:maven-scm-provider-svn-commons:jar:1.11.1-SNAPSHOT generated by maven-surefire-plugin:test (default-test): m\maven-scm-providers\maven-scm-providers-svn\maven-scm-provider-svn-commons\target\surefire-reports\*.xml
[withMaven] junitPublisher - Archive test results for Maven artifact org.apache.maven.scm:maven-scm-provider-svntest:jar:1.11.1-SNAPSHOT generated by maven-surefire-plugin:test (default-test): m\maven-scm-providers\maven-scm-providers-svn\maven-scm-provider-svntest\target\surefire-reports\*.xml
[withMaven] junitPublisher - Archive test results for Maven artifact org.apache.maven.scm:maven-scm-provider-svnexe:jar:1.11.1-SNAPSHOT generated by maven-surefire-plugin:test (default-test): m\maven-scm-providers\maven-scm-providers-svn\maven-scm-provider-svnexe\target\surefire-reports\*.xml
[withMaven] junitPublisher - Archive test results for Maven artifact org.apache.maven.scm:maven-scm-provider-synergy:jar:1.11.1-SNAPSHOT generated by maven-surefire-plugin:test (default-test): m\maven-scm-providers\maven-scm-provider-synergy\target\surefire-reports\*.xml
[withMaven] junitPublisher - Archive test results for Maven artifact org.apache.maven.scm:maven-scm-provider-vss:jar:1.11.1-SNAPSHOT generated by maven-surefire-plugin:test (default-test): m\maven-scm-providers\maven-scm-provider-vss\target\surefire-reports\*.xml
[withMaven] junitPublisher - Archive test results for Maven artifact org.apache.maven.scm:maven-scm-provider-tfs:jar:1.11.1-SNAPSHOT generated by maven-surefire-plugin:test (default-test): m\maven-scm-providers\maven-scm-provider-tfs\target\surefire-reports\*.xml
[withMaven] junitPublisher - Archive test results for Maven artifact org.apache.maven.scm:maven-scm-provider-integrity:jar:1.11.1-SNAPSHOT generated by maven-surefire-plugin:test (default-test): m\maven-scm-providers\maven-scm-provider-integrity\target\surefire-reports\*.xml
[withMaven] junitPublisher - Archive test results for Maven artifact org.apache.maven.scm:maven-scm-provider-jazz:jar:1.11.1-SNAPSHOT generated by maven-surefire-plugin:test (default-test): m\maven-scm-providers\maven-scm-provider-jazz\target\surefire-reports\*.xml
[withMaven] junitPublisher - Archive test results for Maven artifact org.apache.maven.scm:maven-scm-client:jar:1.11.1-SNAPSHOT generated by maven-surefire-plugin:test (default-test): m\maven-scm-client\target\surefire-reports\*.xml
[withMaven] junitPublisher - Archive test results for Maven artifact org.apache.maven.plugins:maven-scm-plugin:maven-plugin:1.11.1-SNAPSHOT generated by maven-surefire-plugin:test (default-test): m\maven-scm-plugin\target\surefire-reports\*.xml
Recording test results
[withMaven] Publishers: Pipeline Graph Publisher: 19 ms, Invoker Publisher: 621 ms, Junit Publisher: 5498 ms, Concordion Publisher: 1 ms, Dependencies Fingerprint Publisher: 973 ms, JGiven Publisher: 1 ms
[Pipeline] // withMaven
[Pipeline] cleanWs
[WS-CLEANUP] Deleting project workspace...
[WS-CLEANUP] Deferred wipeout is used...
[WS-CLEANUP] done
[Pipeline] }
[Pipeline] // stage
[Pipeline] }
[Pipeline] // node
[Pipeline] }
[Pipeline] // parallel
[Pipeline] stage
[Pipeline] { (Notifications)
[Pipeline] echo
Build result: UNSTABLE
[Pipeline] jiraIssueSelector
[Pipeline] echo
The authors of changes [].
[Pipeline] echo
Sending email ...
[Pipeline] emailext
Mime
  • Unnamed multipart/mixed (inline, None, 0 bytes)
View raw message