maven-notifications mailing list archives

Site index · List index
Message view « Date » · « Thread »
Top « Date » · « Thread »
From Apache Jenkins Server <jenk...@builds.apache.org>
Subject Build failed in Jenkins: Maven TLP » maven-enforcer » MENFORCER-294 #42
Date Wed, 01 Jan 2020 03:55:21 GMT
See https://builds.apache.org/job/maven-box/job/maven-enforcer/job/MENFORCER-294/42/

No changes.

All tests passed

Build log:
[...truncated 22580 lines...]
[INFO] Building: require-upper-bound-deps_failure\pom.xml
[INFO]           require-upper-bound-dependencies-managed_success\pom.xml SUCCESS (4.0 s)
[INFO] Building: require-upper-bound-dependencies-unique_failure\pom.xml
[INFO] run post-build script verify.groovy
[INFO]           require-upper-bound-deps_failure\pom.xml ......... SUCCESS (4.1 s)
[INFO] Building: require-upper-bound-deps_ignored\pom.xml
[INFO]           require-plugin-versions-plugin-with-extensions\pom.xml SUCCESS (8.2 s)
[INFO] Building: require-plugin-versions-plugin-with-integration-test-lifecycle\pom.xml
[INFO] snapshot org.apache.maven.plugins.enforcer.its:menforcer134_project:1.0-SNAPSHOT: checking
for updates from apache-snapshots
[INFO] snapshot org.apache.maven.plugins.enforcer.its:menforcer134_project:1.0-SNAPSHOT: checking
for updates from Nexus
[INFO] artifact org.apache.maven.plugins.enforcer.its.menforcer134_project:1.0-SNAPSHOT: checking
for updates from central
[INFO] org.apache.maven.plugins.enforcer.its.menforcer134_project.1.0-SNAPSHOT: checking for
updates from central
[INFO] snapshot org.apache.maven.plugins.enforcer.its:menforcer134_modelbuilder:1.0-SNAPSHOT:
checking for updates from apache-snapshots
[INFO] snapshot org.apache.maven.plugins.enforcer.its:menforcer134_modelbuilder:1.0-SNAPSHOT:
checking for updates from Nexus
[INFO] artifact org.apache.maven.plugins.enforcer.its.menforcer134_modelbuilder:1.0-SNAPSHOT:
checking for updates from central
[INFO] org.apache.maven.plugins.enforcer.its.menforcer134_modelbuilder.1.0-SNAPSHOT: checking
for updates from central
[INFO] snapshot org.apache.maven.plugins.enforcer.its:menforcer134_model:1.0-SNAPSHOT: checking
for updates from apache-snapshots
[INFO] snapshot org.apache.maven.plugins.enforcer.its:menforcer134_model:1.0-SNAPSHOT: checking
for updates from Nexus
[INFO] artifact org.apache.maven.plugins.enforcer.its.menforcer134_model:1.0-SNAPSHOT: checking
for updates from central
[INFO] org.apache.maven.plugins.enforcer.its.menforcer134_model.1.0-SNAPSHOT: checking for
updates from central
[INFO] run post-build script verify.groovy
[INFO]           require-upper-bound-deps_ignored\pom.xml ......... SUCCESS (3.8 s)
[INFO] Building: require-upper-bound-deps_success\pom.xml
[INFO] run post-build script verify.groovy
[INFO]           require-upper-bound-dependencies-unique_failure\pom.xml SUCCESS (5.7 s)
[INFO] Building: require-upper-bound-dependencies-unique_success\pom.xml
[INFO]           require-upper-bound-dependencies-unique_success\pom.xml SUCCESS (4.5 s)
[INFO] Building: require-upper-bound-deps_failure\pom.xml
[INFO]           require-upper-bound-deps_success\pom.xml ......... SUCCESS (5.2 s)
[INFO] Building: resolve_collect_dependencies\pom.xml
[INFO] run post-build script verify.groovy
[INFO]           require-upper-bound-deps_failure\pom.xml ......... SUCCESS (4.7 s)
[INFO] Building: require-upper-bound-deps_ignored\pom.xml
[INFO] run post-build script verify.groovy
[INFO]           require-upper-bound-deps_ignored\pom.xml ......... SUCCESS (4.1 s)
[INFO] Building: require-upper-bound-deps_success\pom.xml
[INFO] run post-build script verify.groovy
[INFO]           resolve_collect_dependencies\pom.xml ............. SUCCESS (8.3 s)
[INFO] -------------------------------------------------
[INFO] Build Summary:
[INFO]   Passed: 68, Failed: 0, Errors: 0, Skipped: 0
[INFO] -------------------------------------------------
[INFO] 
[INFO] --- mrm-maven-plugin:1.0.0:stop (default) @ maven-enforcer-plugin ---
[INFO] Stopping Mock Repository Manager on http://localhost:57537
[INFO] Mock Repository Manager http://localhost:57537 is stopped.
[INFO] 
[INFO] --- maven-checkstyle-plugin:3.0.0:check (checkstyle-check) @ maven-enforcer-plugin
---
[INFO] ------------------------------------------------------------------------
[INFO] Reactor Summary for Apache Maven Enforcer 3.0.0-SNAPSHOT:
[INFO] 
[INFO] Apache Maven Enforcer .............................. SUCCESS [ 37.724 s]
[INFO] Apache Maven Enforcer API .......................... SUCCESS [  5.648 s]
[INFO] Apache Maven Enforcer Built-In Rules ............... SUCCESS [ 14.195 s]
[INFO] Apache Maven Enforcer Plugin ....................... SUCCESS [05:20 min]
[INFO] ------------------------------------------------------------------------
[INFO] BUILD SUCCESS
[INFO] ------------------------------------------------------------------------
[INFO] Total time:  06:18 min
[INFO] Finished at: 2019-12-31T19:53:31-08:00
[INFO] ------------------------------------------------------------------------
[INFO] [jenkins-event-spy] Generated F:\jenkins\jenkins-slave\workspace\box_maven-enforcer_MENFORCER-294@tmp\withMaven932d2483\maven-spy-20191231-194712-4557884306422386395364.log
Picked up JAVA_TOOL_OPTIONS: -Dmaven.ext.class.path="f:\jenkins\jenkins-slave\workspace\box_maven-enforcer_MENFORCER-294@tmp\withMaven932d2483\pipeline-maven-spy.jar"
-Dorg.jenkinsci.plugins.pipeline.maven.reportsFolder="f:\jenkins\jenkins-slave\workspace\box_maven-enforcer_MENFORCER-294@tmp\withMaven932d2483"

[Pipeline] }
[Pipeline] // dir
[Pipeline] }
[withMaven] invokerPublisher - Archive invoker results for Maven artifact MavenArtifact{org.apache.maven.plugins:maven-enforcer-plugin:maven-plugin:3.0.0-SNAPSHOT(version:
3.0.0-SNAPSHOT, snapshot:false) } generated by PluginInvocation{org.apache.maven.plugins:maven-invoker-plugin:3.0.1@run
 integration-test}: m\maven-enforcer-plugin\target\invoker-reports\*.xml
[INFO]           require-upper-bound-deps_success\pom.xml ......... SUCCESS (3.4 s)
[INFO] Building: resolve_collect_dependencies\pom.xml
[INFO]           require-plugin-versions-plugin-with-integration-test-lifecycle\pom.xml SUCCESS
(19.3 s)
[INFO] Building: require-plugin-versions-projectGAVexpressions\pom.xml
[INFO]           require-plugin-versions-projectGAVexpressions\pom.xml SUCCESS (4.0 s)
[INFO] Building: require-profile-ids-exist_failure\pom.xml
[INFO] run post-build script verify.groovy
[INFO]           require-profile-ids-exist_failure\pom.xml ........ SUCCESS (4.1 s)
[INFO] Building: require-profile-ids-exist_success\pom.xml
[INFO] run post-build script verify.groovy
[INFO]           resolve_collect_dependencies\pom.xml ............. SUCCESS (8.6 s)
[INFO] -------------------------------------------------
[INFO] Build Summary:
[INFO]   Passed: 68, Failed: 0, Errors: 0, Skipped: 0
[INFO] -------------------------------------------------
[INFO] 
[INFO] --- mrm-maven-plugin:1.0.0:stop (default) @ maven-enforcer-plugin ---
[INFO] Stopping Mock Repository Manager on http://localhost:51414
[INFO] Mock Repository Manager http://localhost:51414 is stopped.
[INFO] 
[INFO] --- maven-checkstyle-plugin:3.0.0:check (checkstyle-check) @ maven-enforcer-plugin
---
[INFO] ------------------------------------------------------------------------
[INFO] Reactor Summary for Apache Maven Enforcer 3.0.0-SNAPSHOT:
[INFO] 
[INFO] Apache Maven Enforcer .............................. SUCCESS [ 46.313 s]
[INFO] Apache Maven Enforcer API .......................... SUCCESS [  7.202 s]
[INFO] Apache Maven Enforcer Built-In Rules ............... SUCCESS [ 20.367 s]
[INFO] Apache Maven Enforcer Plugin ....................... SUCCESS [06:04 min]
[INFO] ------------------------------------------------------------------------
[INFO] BUILD SUCCESS
[INFO] ------------------------------------------------------------------------
[INFO] Total time:  07:20 min
[INFO] Finished at: 2019-12-31T19:53:43-08:00
[INFO] ------------------------------------------------------------------------
[INFO] [jenkins-event-spy] Generated F:\jenkins\jenkins-slave\workspace\box_maven-enforcer_MENFORCER-294@tmp\withMaven36b8ca71\maven-spy-20191231-194623-5134879572030366460800.log
Picked up JAVA_TOOL_OPTIONS: -Dmaven.ext.class.path="f:\jenkins\jenkins-slave\workspace\box_maven-enforcer_MENFORCER-294@tmp\withMaven36b8ca71\pipeline-maven-spy.jar"
-Dorg.jenkinsci.plugins.pipeline.maven.reportsFolder="f:\jenkins\jenkins-slave\workspace\box_maven-enforcer_MENFORCER-294@tmp\withMaven36b8ca71"

[Pipeline] }
[Pipeline] // dir
[Pipeline] }
[withMaven] invokerPublisher - Archive invoker results for Maven artifact MavenArtifact{org.apache.maven.plugins:maven-enforcer-plugin:maven-plugin:3.0.0-SNAPSHOT(version:
3.0.0-SNAPSHOT, snapshot:false) } generated by PluginInvocation{org.apache.maven.plugins:maven-invoker-plugin:3.0.1@run
 integration-test}: m\maven-enforcer-plugin\target\invoker-reports\*.xml
[INFO]           require-profile-ids-exist_success\pom.xml ........ SUCCESS (3.8 s)
[INFO] Building: require-property\pom.xml
[INFO]           require-property\pom.xml ......................... SUCCESS (3.7 s)
[INFO] Building: require-release-dependencies\pom.xml
[INFO]           require-release-dependencies\pom.xml ............. SUCCESS (3.9 s)
[INFO] Building: require-release-dependencies-excludes\pom.xml
[INFO] snapshot org.apache.maven.plugins.enforcer.its:menforcer85_api:1.0-SNAPSHOT: checking
for updates from apache-snapshots
[INFO] snapshot org.apache.maven.plugins.enforcer.its:menforcer85_api:1.0-SNAPSHOT: checking
for updates from Nexus
[INFO] artifact org.apache.maven.plugins.enforcer.its.menforcer85_api:1.0-SNAPSHOT: checking
for updates from central
[INFO] org.apache.maven.plugins.enforcer.its.menforcer85_api.1.0-SNAPSHOT: checking for updates
from central
[withMaven] junitPublisher - Archive test results for Maven artifact org.apache.maven.enforcer:enforcer-api:jar:3.0.0-SNAPSHOT
generated by maven-surefire-plugin:test (default-test): m\enforcer-api\target\surefire-reports\*.xml
[withMaven] junitPublisher - Archive test results for Maven artifact org.apache.maven.enforcer:enforcer-rules:jar:3.0.0-SNAPSHOT
generated by maven-surefire-plugin:test (default-test): m\enforcer-rules\target\surefire-reports\*.xml
[withMaven] junitPublisher - Archive test results for Maven artifact org.apache.maven.plugins:maven-enforcer-plugin:maven-plugin:3.0.0-SNAPSHOT
generated by maven-surefire-plugin:test (default-test): m\maven-enforcer-plugin\target\surefire-reports\*.xml
Recording test results
[INFO]           require-release-dependencies-excludes\pom.xml .... SUCCESS (4.3 s)
[INFO] Building: require-release-dependencies-excludes_failure\pom.xml
[withMaven] Publishers: Pipeline Graph Publisher: 4 ms, Invoker Publisher: 25756 ms, Junit
Publisher: 773 ms, Dependencies Fingerprint Publisher: 53 ms
[Pipeline] // withMaven
[Pipeline] cleanWs
[WS-CLEANUP] Deleting project workspace...
[WS-CLEANUP] Deferred wipeout is used...
[WS-CLEANUP] done
[Pipeline] }
[Pipeline] // stage
[Pipeline] }
[Pipeline] // node
[Pipeline] }
[INFO]           require-release-dependencies-excludes_failure\pom.xml SUCCESS (4.5 s)
[INFO] Building: require-release-version\pom.xml
[INFO]           require-release-version\pom.xml .................. SUCCESS (3.8 s)
[INFO] Building: require-same-versions_failure\pom.xml
[withMaven] junitPublisher - Archive test results for Maven artifact org.apache.maven.enforcer:enforcer-api:jar:3.0.0-SNAPSHOT
generated by maven-surefire-plugin:test (default-test): m\enforcer-api\target\surefire-reports\*.xml
[withMaven] junitPublisher - Archive test results for Maven artifact org.apache.maven.enforcer:enforcer-rules:jar:3.0.0-SNAPSHOT
generated by maven-surefire-plugin:test (default-test): m\enforcer-rules\target\surefire-reports\*.xml
[withMaven] junitPublisher - Archive test results for Maven artifact org.apache.maven.plugins:maven-enforcer-plugin:maven-plugin:3.0.0-SNAPSHOT
generated by maven-surefire-plugin:test (default-test): m\maven-enforcer-plugin\target\surefire-reports\*.xml
Recording test results
[withMaven] Publishers: Pipeline Graph Publisher: 2 ms, Invoker Publisher: 21366 ms, Junit
Publisher: 727 ms, Dependencies Fingerprint Publisher: 50 ms
[Pipeline] // withMaven
[Pipeline] cleanWs
[WS-CLEANUP] Deleting project workspace...
[WS-CLEANUP] Deferred wipeout is used...
[WS-CLEANUP] done
[Pipeline] }
[Pipeline] // stage
[Pipeline] }
[Pipeline] // node
[Pipeline] }
[INFO]           require-same-versions_failure\pom.xml ............ SUCCESS (3.4 s)
[INFO] Building: require-same-versions_success\pom.xml
[INFO]           require-same-versions_success\pom.xml ............ SUCCESS (3.3 s)
[INFO] Building: require-snapshot-version_failure\pom.xml
[INFO]           require-snapshot-version_failure\pom.xml ......... SUCCESS (3.4 s)
[INFO] Building: require-snapshot-version_success\pom.xml
[INFO]           require-snapshot-version_success\pom.xml ......... SUCCESS (3.2 s)
[INFO] Building: require-upper-bound-dependencies-managed_failure\pom.xml
[INFO] run post-build script verify.groovy
[INFO]           require-upper-bound-dependencies-managed_failure\pom.xml SUCCESS (4.0 s)
[INFO] Building: require-upper-bound-dependencies-managed_success\pom.xml
[INFO]           require-upper-bound-dependencies-managed_success\pom.xml SUCCESS (4.2 s)
[INFO] Building: require-upper-bound-dependencies-unique_failure\pom.xml
[INFO] snapshot org.apache.maven.plugins.enforcer.its:menforcer134_project:1.0-SNAPSHOT: checking
for updates from apache-snapshots
[INFO] snapshot org.apache.maven.plugins.enforcer.its:menforcer134_project:1.0-SNAPSHOT: checking
for updates from Nexus
[INFO] artifact org.apache.maven.plugins.enforcer.its.menforcer134_project:1.0-SNAPSHOT: checking
for updates from central
[INFO] org.apache.maven.plugins.enforcer.its.menforcer134_project.1.0-SNAPSHOT: checking for
updates from central
[INFO] snapshot org.apache.maven.plugins.enforcer.its:menforcer134_modelbuilder:1.0-SNAPSHOT:
checking for updates from apache-snapshots
[INFO] snapshot org.apache.maven.plugins.enforcer.its:menforcer134_modelbuilder:1.0-SNAPSHOT:
checking for updates from Nexus
[INFO] artifact org.apache.maven.plugins.enforcer.its.menforcer134_modelbuilder:1.0-SNAPSHOT:
checking for updates from central
[INFO] org.apache.maven.plugins.enforcer.its.menforcer134_modelbuilder.1.0-SNAPSHOT: checking
for updates from central
[INFO] snapshot org.apache.maven.plugins.enforcer.its:menforcer134_model:1.0-SNAPSHOT: checking
for updates from apache-snapshots
[INFO] snapshot org.apache.maven.plugins.enforcer.its:menforcer134_model:1.0-SNAPSHOT: checking
for updates from Nexus
[INFO] artifact org.apache.maven.plugins.enforcer.its.menforcer134_model:1.0-SNAPSHOT: checking
for updates from central
[INFO] org.apache.maven.plugins.enforcer.its.menforcer134_model.1.0-SNAPSHOT: checking for
updates from central
[INFO] run post-build script verify.groovy
[INFO]           require-upper-bound-dependencies-unique_failure\pom.xml SUCCESS (6.4 s)
[INFO] Building: require-upper-bound-dependencies-unique_success\pom.xml
[INFO]           require-upper-bound-dependencies-unique_success\pom.xml SUCCESS (4.5 s)
[INFO] Building: require-upper-bound-deps_failure\pom.xml
[INFO] run post-build script verify.groovy
[INFO]           require-upper-bound-deps_failure\pom.xml ......... SUCCESS (3.9 s)
[INFO] Building: require-upper-bound-deps_ignored\pom.xml
[INFO] run post-build script verify.groovy
[INFO]           require-upper-bound-deps_ignored\pom.xml ......... SUCCESS (3.2 s)
[INFO] Building: require-upper-bound-deps_success\pom.xml
[INFO]           require-upper-bound-deps_success\pom.xml ......... SUCCESS (3.9 s)
[INFO] Building: resolve_collect_dependencies\pom.xml
[INFO] run post-build script verify.groovy
[INFO]           resolve_collect_dependencies\pom.xml ............. SUCCESS (8.3 s)
[INFO] -------------------------------------------------
[INFO] Build Summary:
[INFO]   Passed: 68, Failed: 0, Errors: 0, Skipped: 0
[INFO] -------------------------------------------------
[INFO] 
[INFO] --- mrm-maven-plugin:1.0.0:stop (default) @ maven-enforcer-plugin ---
[INFO] Stopping Mock Repository Manager on http://localhost:57644
[INFO] Mock Repository Manager http://localhost:57644 is stopped.
[INFO] 
[INFO] --- maven-checkstyle-plugin:3.0.0:check (checkstyle-check) @ maven-enforcer-plugin
---
[INFO] ------------------------------------------------------------------------
[INFO] Reactor Summary for Apache Maven Enforcer 3.0.0-SNAPSHOT:
[INFO] 
[INFO] Apache Maven Enforcer .............................. SUCCESS [ 40.029 s]
[INFO] Apache Maven Enforcer API .......................... SUCCESS [  6.101 s]
[INFO] Apache Maven Enforcer Built-In Rules ............... SUCCESS [ 15.653 s]
[INFO] Apache Maven Enforcer Plugin ....................... SUCCESS [05:20 min]
[INFO] ------------------------------------------------------------------------
[INFO] BUILD SUCCESS
[INFO] ------------------------------------------------------------------------
[INFO] Total time:  06:23 min
[INFO] Finished at: 2019-12-31T19:54:57-08:00
[INFO] ------------------------------------------------------------------------
[INFO] [jenkins-event-spy] Generated F:\jenkins\jenkins-slave\workspace\box_maven-enforcer_MENFORCER-294@2@tmp\withMavene6cdc105\maven-spy-20191231-194834-50915511593946968958467.log
[Pipeline] }
[Pipeline] // dir
[Pipeline] }
[withMaven] invokerPublisher - Archive invoker results for Maven artifact MavenArtifact{org.apache.maven.plugins:maven-enforcer-plugin:maven-plugin:3.0.0-SNAPSHOT(version:
3.0.0-SNAPSHOT, snapshot:false) } generated by PluginInvocation{org.apache.maven.plugins:maven-invoker-plugin:3.0.1@run
 integration-test}: m\maven-enforcer-plugin\target\invoker-reports\*.xml
[withMaven] junitPublisher - Archive test results for Maven artifact org.apache.maven.enforcer:enforcer-api:jar:3.0.0-SNAPSHOT
generated by maven-surefire-plugin:test (default-test): m\enforcer-api\target\surefire-reports\*.xml
[withMaven] junitPublisher - Archive test results for Maven artifact org.apache.maven.enforcer:enforcer-rules:jar:3.0.0-SNAPSHOT
generated by maven-surefire-plugin:test (default-test): m\enforcer-rules\target\surefire-reports\*.xml
[withMaven] junitPublisher - Archive test results for Maven artifact org.apache.maven.plugins:maven-enforcer-plugin:maven-plugin:3.0.0-SNAPSHOT
generated by maven-surefire-plugin:test (default-test): m\maven-enforcer-plugin\target\surefire-reports\*.xml
Recording test results
[withMaven] Publishers: Pipeline Graph Publisher: 2 ms, Invoker Publisher: 21386 ms, Junit
Publisher: 742 ms, Dependencies Fingerprint Publisher: 50 ms
[Pipeline] // withMaven
[Pipeline] cleanWs
[WS-CLEANUP] Deleting project workspace...
[WS-CLEANUP] Deferred wipeout is used...
[WS-CLEANUP] done
[Pipeline] }
[Pipeline] // stage
[Pipeline] }
[Pipeline] // node
[Pipeline] }
[Pipeline] // parallel
[Pipeline] echo
[FAILURE-003] AbortException hudson.AbortException: script returned exit code 1
[Pipeline] stage
[Pipeline] { (Notifications)
[Pipeline] echo
Build result: FAILURE
[Pipeline] jiraIssueSelector
[Pipeline] echo
The authors of changes [].
[Pipeline] echo
Sending email ...
[Pipeline] emailext
Mime
  • Unnamed multipart/mixed (inline, None, 0 bytes)
View raw message