maven-notifications mailing list archives

Site index · List index
Message view « Date » · « Thread »
Top « Date » · « Thread »
From Apache Jenkins Server <jenk...@builds.apache.org>
Subject Build failed in Jenkins: Maven TLP » maven-scm » SCM-877 #19
Date Sun, 12 Jan 2020 17:58:05 GMT
See https://builds.apache.org/job/maven-box/job/maven-scm/job/SCM-877/19/

Changes:

* H30 is having issues

25 tests failed.
FAILED:  org.apache.maven.scm.plugin.CheckoutMojoTest.windows-jdk7 / Build windows-jdk7 / testExcludeInclude

Error Message:
Cannot run checkout command : 

Stack Trace:
org.apache.maven.plugin.MojoExecutionException: Cannot run checkout command : 
	at org.apache.maven.scm.plugin.CheckoutMojoTest.testExcludeInclude(CheckoutMojoTest.java:153)
Caused by: org.apache.maven.scm.ScmException: Can't load the scm provider.
	at org.apache.maven.scm.plugin.CheckoutMojoTest.testExcludeInclude(CheckoutMojoTest.java:153)
Caused by: org.apache.maven.scm.repository.ScmRepositoryException: The scm url is invalid.
	at org.apache.maven.scm.plugin.CheckoutMojoTest.testExcludeInclude(CheckoutMojoTest.java:153)


FAILED:  org.apache.maven.scm.plugin.CheckoutMojoTest.windows-jdk7 / Build windows-jdk7 / testUseExport

Error Message:
Cannot run checkout command : 

Stack Trace:
org.apache.maven.plugin.MojoExecutionException: Cannot run checkout command : 
	at org.apache.maven.scm.plugin.CheckoutMojoTest.testUseExport(CheckoutMojoTest.java:132)
Caused by: org.apache.maven.scm.ScmException: Can't load the scm provider.
	at org.apache.maven.scm.plugin.CheckoutMojoTest.testUseExport(CheckoutMojoTest.java:132)
Caused by: org.apache.maven.scm.repository.ScmRepositoryException: The scm url is invalid.
	at org.apache.maven.scm.plugin.CheckoutMojoTest.testUseExport(CheckoutMojoTest.java:132)


FAILED:  org.apache.maven.scm.plugin.CheckoutMojoTest.windows-jdk8 / Build windows-jdk8 / testExcludeInclude

Error Message:
Cannot run checkout command : 

Stack Trace:
org.apache.maven.plugin.MojoExecutionException: Cannot run checkout command : 
	at org.apache.maven.scm.plugin.CheckoutMojoTest.testExcludeInclude(CheckoutMojoTest.java:153)
Caused by: org.apache.maven.scm.ScmException: Can't load the scm provider.
	at org.apache.maven.scm.plugin.CheckoutMojoTest.testExcludeInclude(CheckoutMojoTest.java:153)
Caused by: org.apache.maven.scm.repository.ScmRepositoryException: The scm url is invalid.
	at org.apache.maven.scm.plugin.CheckoutMojoTest.testExcludeInclude(CheckoutMojoTest.java:153)


FAILED:  org.apache.maven.scm.plugin.CheckoutMojoTest.windows-jdk8 / Build windows-jdk8 / testUseExport

Error Message:
Cannot run checkout command : 

Stack Trace:
org.apache.maven.plugin.MojoExecutionException: Cannot run checkout command : 
	at org.apache.maven.scm.plugin.CheckoutMojoTest.testUseExport(CheckoutMojoTest.java:132)
Caused by: org.apache.maven.scm.ScmException: Can't load the scm provider.
	at org.apache.maven.scm.plugin.CheckoutMojoTest.testUseExport(CheckoutMojoTest.java:132)
Caused by: org.apache.maven.scm.repository.ScmRepositoryException: The scm url is invalid.
	at org.apache.maven.scm.plugin.CheckoutMojoTest.testUseExport(CheckoutMojoTest.java:132)


FAILED:  org.apache.maven.scm.plugin.CheckoutMojoTest.windows-jdk11 / Build windows-jdk11 / testExcludeInclude

Error Message:
Cannot run checkout command : 

Stack Trace:
org.apache.maven.plugin.MojoExecutionException: Cannot run checkout command : 
	at org.apache.maven.scm.plugin.CheckoutMojoTest.testExcludeInclude(CheckoutMojoTest.java:153)
Caused by: org.apache.maven.scm.ScmException: Can't load the scm provider.
	at org.apache.maven.scm.plugin.CheckoutMojoTest.testExcludeInclude(CheckoutMojoTest.java:153)
Caused by: org.apache.maven.scm.repository.ScmRepositoryException: The scm url is invalid.
	at org.apache.maven.scm.plugin.CheckoutMojoTest.testExcludeInclude(CheckoutMojoTest.java:153)


FAILED:  org.apache.maven.scm.plugin.CheckoutMojoTest.windows-jdk11 / Build windows-jdk11 / testUseExport

Error Message:
Cannot run checkout command : 

Stack Trace:
org.apache.maven.plugin.MojoExecutionException: Cannot run checkout command : 
	at org.apache.maven.scm.plugin.CheckoutMojoTest.testUseExport(CheckoutMojoTest.java:132)
Caused by: org.apache.maven.scm.ScmException: Can't load the scm provider.
	at org.apache.maven.scm.plugin.CheckoutMojoTest.testUseExport(CheckoutMojoTest.java:132)
Caused by: org.apache.maven.scm.repository.ScmRepositoryException: The scm url is invalid.
	at org.apache.maven.scm.plugin.CheckoutMojoTest.testUseExport(CheckoutMojoTest.java:132)


FAILED:  org.apache.maven.scm.plugin.CheckoutMojoTest.windows-jdk13 / Build windows-jdk13 / testExcludeInclude

Error Message:
Cannot run checkout command : 

Stack Trace:
org.apache.maven.plugin.MojoExecutionException: Cannot run checkout command : 
	at org.apache.maven.scm.plugin.CheckoutMojoTest.testExcludeInclude(CheckoutMojoTest.java:153)
Caused by: org.apache.maven.scm.ScmException: Can't load the scm provider.
	at org.apache.maven.scm.plugin.CheckoutMojoTest.testExcludeInclude(CheckoutMojoTest.java:153)
Caused by: org.apache.maven.scm.repository.ScmRepositoryException: The scm url is invalid.
	at org.apache.maven.scm.plugin.CheckoutMojoTest.testExcludeInclude(CheckoutMojoTest.java:153)


FAILED:  org.apache.maven.scm.plugin.CheckoutMojoTest.windows-jdk13 / Build windows-jdk13 / testUseExport

Error Message:
Cannot run checkout command : 

Stack Trace:
org.apache.maven.plugin.MojoExecutionException: Cannot run checkout command : 
	at org.apache.maven.scm.plugin.CheckoutMojoTest.testUseExport(CheckoutMojoTest.java:132)
Caused by: org.apache.maven.scm.ScmException: Can't load the scm provider.
	at org.apache.maven.scm.plugin.CheckoutMojoTest.testUseExport(CheckoutMojoTest.java:132)
Caused by: org.apache.maven.scm.repository.ScmRepositoryException: The scm url is invalid.
	at org.apache.maven.scm.plugin.CheckoutMojoTest.testUseExport(CheckoutMojoTest.java:132)


FAILED:  org.apache.maven.scm.plugin.CheckoutMojoTest.windows-jdk14 / Build windows-jdk14 / testExcludeInclude

Error Message:
Cannot run checkout command : 

Stack Trace:
org.apache.maven.plugin.MojoExecutionException: Cannot run checkout command : 
	at org.apache.maven.scm.plugin.CheckoutMojoTest.testExcludeInclude(CheckoutMojoTest.java:153)
Caused by: org.apache.maven.scm.ScmException: Can't load the scm provider.
	at org.apache.maven.scm.plugin.CheckoutMojoTest.testExcludeInclude(CheckoutMojoTest.java:153)
Caused by: org.apache.maven.scm.repository.ScmRepositoryException: The scm url is invalid.
	at org.apache.maven.scm.plugin.CheckoutMojoTest.testExcludeInclude(CheckoutMojoTest.java:153)


FAILED:  org.apache.maven.scm.plugin.CheckoutMojoTest.windows-jdk14 / Build windows-jdk14 / testUseExport

Error Message:
Cannot run checkout command : 

Stack Trace:
org.apache.maven.plugin.MojoExecutionException: Cannot run checkout command : 
	at org.apache.maven.scm.plugin.CheckoutMojoTest.testUseExport(CheckoutMojoTest.java:132)
Caused by: org.apache.maven.scm.ScmException: Can't load the scm provider.
	at org.apache.maven.scm.plugin.CheckoutMojoTest.testUseExport(CheckoutMojoTest.java:132)
Caused by: org.apache.maven.scm.repository.ScmRepositoryException: The scm url is invalid.
	at org.apache.maven.scm.plugin.CheckoutMojoTest.testUseExport(CheckoutMojoTest.java:132)


FAILED:  org.apache.maven.scm.plugin.ExportMojoTest.windows-jdk7 / Build windows-jdk7 / testExcludeInclude

Error Message:
Cannot run export command : 

Stack Trace:
org.apache.maven.plugin.MojoExecutionException: Cannot run export command : 
	at org.apache.maven.scm.plugin.ExportMojoTest.testExcludeInclude(ExportMojoTest.java:90)
Caused by: org.apache.maven.scm.ScmException: Can't load the scm provider.
	at org.apache.maven.scm.plugin.ExportMojoTest.testExcludeInclude(ExportMojoTest.java:90)
Caused by: org.apache.maven.scm.repository.ScmRepositoryException: The scm url is invalid.
	at org.apache.maven.scm.plugin.ExportMojoTest.testExcludeInclude(ExportMojoTest.java:90)


FAILED:  org.apache.maven.scm.plugin.ExportMojoTest.windows-jdk7 / Build windows-jdk7 / testExport

Error Message:
Cannot run export command : 

Stack Trace:
org.apache.maven.plugin.MojoExecutionException: Cannot run export command : 
	at org.apache.maven.scm.plugin.ExportMojoTest.testExport(ExportMojoTest.java:55)
Caused by: org.apache.maven.scm.ScmException: Can't load the scm provider.
	at org.apache.maven.scm.plugin.ExportMojoTest.testExport(ExportMojoTest.java:55)
Caused by: org.apache.maven.scm.repository.ScmRepositoryException: The scm url is invalid.
	at org.apache.maven.scm.plugin.ExportMojoTest.testExport(ExportMojoTest.java:55)


FAILED:  org.apache.maven.scm.plugin.ExportMojoTest.windows-jdk8 / Build windows-jdk8 / testExcludeInclude

Error Message:
Cannot run export command : 

Stack Trace:
org.apache.maven.plugin.MojoExecutionException: Cannot run export command : 
	at org.apache.maven.scm.plugin.ExportMojoTest.testExcludeInclude(ExportMojoTest.java:90)
Caused by: org.apache.maven.scm.ScmException: Can't load the scm provider.
	at org.apache.maven.scm.plugin.ExportMojoTest.testExcludeInclude(ExportMojoTest.java:90)
Caused by: org.apache.maven.scm.repository.ScmRepositoryException: The scm url is invalid.
	at org.apache.maven.scm.plugin.ExportMojoTest.testExcludeInclude(ExportMojoTest.java:90)


FAILED:  org.apache.maven.scm.plugin.ExportMojoTest.windows-jdk8 / Build windows-jdk8 / testExport

Error Message:
Cannot run export command : 

Stack Trace:
org.apache.maven.plugin.MojoExecutionException: Cannot run export command : 
	at org.apache.maven.scm.plugin.ExportMojoTest.testExport(ExportMojoTest.java:55)
Caused by: org.apache.maven.scm.ScmException: Can't load the scm provider.
	at org.apache.maven.scm.plugin.ExportMojoTest.testExport(ExportMojoTest.java:55)
Caused by: org.apache.maven.scm.repository.ScmRepositoryException: The scm url is invalid.
	at org.apache.maven.scm.plugin.ExportMojoTest.testExport(ExportMojoTest.java:55)


FAILED:  org.apache.maven.scm.plugin.ExportMojoTest.windows-jdk11 / Build windows-jdk11 / testExcludeInclude

Error Message:
Cannot run export command : 

Stack Trace:
org.apache.maven.plugin.MojoExecutionException: Cannot run export command : 
	at org.apache.maven.scm.plugin.ExportMojoTest.testExcludeInclude(ExportMojoTest.java:90)
Caused by: org.apache.maven.scm.ScmException: Can't load the scm provider.
	at org.apache.maven.scm.plugin.ExportMojoTest.testExcludeInclude(ExportMojoTest.java:90)
Caused by: org.apache.maven.scm.repository.ScmRepositoryException: The scm url is invalid.
	at org.apache.maven.scm.plugin.ExportMojoTest.testExcludeInclude(ExportMojoTest.java:90)


FAILED:  org.apache.maven.scm.plugin.ExportMojoTest.windows-jdk11 / Build windows-jdk11 / testExport

Error Message:
Cannot run export command : 

Stack Trace:
org.apache.maven.plugin.MojoExecutionException: Cannot run export command : 
	at org.apache.maven.scm.plugin.ExportMojoTest.testExport(ExportMojoTest.java:55)
Caused by: org.apache.maven.scm.ScmException: Can't load the scm provider.
	at org.apache.maven.scm.plugin.ExportMojoTest.testExport(ExportMojoTest.java:55)
Caused by: org.apache.maven.scm.repository.ScmRepositoryException: The scm url is invalid.
	at org.apache.maven.scm.plugin.ExportMojoTest.testExport(ExportMojoTest.java:55)


FAILED:  org.apache.maven.scm.plugin.ExportMojoTest.windows-jdk13 / Build windows-jdk13 / testExcludeInclude

Error Message:
Cannot run export command : 

Stack Trace:
org.apache.maven.plugin.MojoExecutionException: Cannot run export command : 
	at org.apache.maven.scm.plugin.ExportMojoTest.testExcludeInclude(ExportMojoTest.java:90)
Caused by: org.apache.maven.scm.ScmException: Can't load the scm provider.
	at org.apache.maven.scm.plugin.ExportMojoTest.testExcludeInclude(ExportMojoTest.java:90)
Caused by: org.apache.maven.scm.repository.ScmRepositoryException: The scm url is invalid.
	at org.apache.maven.scm.plugin.ExportMojoTest.testExcludeInclude(ExportMojoTest.java:90)


FAILED:  org.apache.maven.scm.plugin.ExportMojoTest.windows-jdk13 / Build windows-jdk13 / testExport

Error Message:
Cannot run export command : 

Stack Trace:
org.apache.maven.plugin.MojoExecutionException: Cannot run export command : 
	at org.apache.maven.scm.plugin.ExportMojoTest.testExport(ExportMojoTest.java:55)
Caused by: org.apache.maven.scm.ScmException: Can't load the scm provider.
	at org.apache.maven.scm.plugin.ExportMojoTest.testExport(ExportMojoTest.java:55)
Caused by: org.apache.maven.scm.repository.ScmRepositoryException: The scm url is invalid.
	at org.apache.maven.scm.plugin.ExportMojoTest.testExport(ExportMojoTest.java:55)


FAILED:  org.apache.maven.scm.plugin.ExportMojoTest.windows-jdk14 / Build windows-jdk14 / testExcludeInclude

Error Message:
Cannot run export command : 

Stack Trace:
org.apache.maven.plugin.MojoExecutionException: Cannot run export command : 
	at org.apache.maven.scm.plugin.ExportMojoTest.testExcludeInclude(ExportMojoTest.java:90)
Caused by: org.apache.maven.scm.ScmException: Can't load the scm provider.
	at org.apache.maven.scm.plugin.ExportMojoTest.testExcludeInclude(ExportMojoTest.java:90)
Caused by: org.apache.maven.scm.repository.ScmRepositoryException: The scm url is invalid.
	at org.apache.maven.scm.plugin.ExportMojoTest.testExcludeInclude(ExportMojoTest.java:90)


FAILED:  org.apache.maven.scm.plugin.ExportMojoTest.windows-jdk14 / Build windows-jdk14 / testExport

Error Message:
Cannot run export command : 

Stack Trace:
org.apache.maven.plugin.MojoExecutionException: Cannot run export command : 
	at org.apache.maven.scm.plugin.ExportMojoTest.testExport(ExportMojoTest.java:55)
Caused by: org.apache.maven.scm.ScmException: Can't load the scm provider.
	at org.apache.maven.scm.plugin.ExportMojoTest.testExport(ExportMojoTest.java:55)
Caused by: org.apache.maven.scm.repository.ScmRepositoryException: The scm url is invalid.
	at org.apache.maven.scm.plugin.ExportMojoTest.testExport(ExportMojoTest.java:55)


FAILED:  org.apache.maven.scm.plugin.StatusMojoTest.windows-jdk7 / Build windows-jdk7 / testStatusMojo

Error Message:
Cannot run status command : 

Stack Trace:
org.apache.maven.plugin.MojoExecutionException: Cannot run status command : 
	at org.apache.maven.scm.plugin.StatusMojoTest.testStatusMojo(StatusMojoTest.java:49)
Caused by: org.apache.maven.scm.ScmException: Can't load the scm provider.
	at org.apache.maven.scm.plugin.StatusMojoTest.testStatusMojo(StatusMojoTest.java:49)
Caused by: org.apache.maven.scm.repository.ScmRepositoryException: The scm url is invalid.
	at org.apache.maven.scm.plugin.StatusMojoTest.testStatusMojo(StatusMojoTest.java:49)


FAILED:  org.apache.maven.scm.plugin.StatusMojoTest.windows-jdk8 / Build windows-jdk8 / testStatusMojo

Error Message:
Cannot run status command : 

Stack Trace:
org.apache.maven.plugin.MojoExecutionException: Cannot run status command : 
	at org.apache.maven.scm.plugin.StatusMojoTest.testStatusMojo(StatusMojoTest.java:49)
Caused by: org.apache.maven.scm.ScmException: Can't load the scm provider.
	at org.apache.maven.scm.plugin.StatusMojoTest.testStatusMojo(StatusMojoTest.java:49)
Caused by: org.apache.maven.scm.repository.ScmRepositoryException: The scm url is invalid.
	at org.apache.maven.scm.plugin.StatusMojoTest.testStatusMojo(StatusMojoTest.java:49)


FAILED:  org.apache.maven.scm.plugin.StatusMojoTest.windows-jdk11 / Build windows-jdk11 / testStatusMojo

Error Message:
Cannot run status command : 

Stack Trace:
org.apache.maven.plugin.MojoExecutionException: Cannot run status command : 
	at org.apache.maven.scm.plugin.StatusMojoTest.testStatusMojo(StatusMojoTest.java:49)
Caused by: org.apache.maven.scm.ScmException: Can't load the scm provider.
	at org.apache.maven.scm.plugin.StatusMojoTest.testStatusMojo(StatusMojoTest.java:49)
Caused by: org.apache.maven.scm.repository.ScmRepositoryException: The scm url is invalid.
	at org.apache.maven.scm.plugin.StatusMojoTest.testStatusMojo(StatusMojoTest.java:49)


FAILED:  org.apache.maven.scm.plugin.StatusMojoTest.windows-jdk13 / Build windows-jdk13 / testStatusMojo

Error Message:
Cannot run status command : 

Stack Trace:
org.apache.maven.plugin.MojoExecutionException: Cannot run status command : 
	at org.apache.maven.scm.plugin.StatusMojoTest.testStatusMojo(StatusMojoTest.java:49)
Caused by: org.apache.maven.scm.ScmException: Can't load the scm provider.
	at org.apache.maven.scm.plugin.StatusMojoTest.testStatusMojo(StatusMojoTest.java:49)
Caused by: org.apache.maven.scm.repository.ScmRepositoryException: The scm url is invalid.
	at org.apache.maven.scm.plugin.StatusMojoTest.testStatusMojo(StatusMojoTest.java:49)


FAILED:  org.apache.maven.scm.plugin.StatusMojoTest.windows-jdk14 / Build windows-jdk14 / testStatusMojo

Error Message:
Cannot run status command : 

Stack Trace:
org.apache.maven.plugin.MojoExecutionException: Cannot run status command : 
	at org.apache.maven.scm.plugin.StatusMojoTest.testStatusMojo(StatusMojoTest.java:49)
Caused by: org.apache.maven.scm.ScmException: Can't load the scm provider.
	at org.apache.maven.scm.plugin.StatusMojoTest.testStatusMojo(StatusMojoTest.java:49)
Caused by: org.apache.maven.scm.repository.ScmRepositoryException: The scm url is invalid.
	at org.apache.maven.scm.plugin.StatusMojoTest.testStatusMojo(StatusMojoTest.java:49)




Build log:
[...truncated 71243 lines...]
[INFO] Working directory: F:\jenkins\jenkins-slave\workspace\maven-box_maven-scm_SCM-877@2\m\maven-scm-plugin\target\checkout
[INFO] Working directory: F:\jenkins\jenkins-slave\workspace\maven-box_maven-scm_SCM-877@2\m\maven-scm-plugin\target\checkout
[INFO] Tests run: 2, Failures: 0, Errors: 0, Skipped: 0, Time elapsed: 14.598 s - in org.apache.maven.scm.plugin.TagMojoTest
[INFO] Running org.apache.maven.scm.plugin.UpdateMojoTest
Test command line: cmd.exe /X /C "svnadmin create repository"
[INFO] Removing target\checkout
[INFO] Executing: cmd.exe /X /C "svn --non-interactive checkout file:///F:/jenkins/jenkins-slave/workspace/maven-box_maven-scm_SCM-877@2/m/maven-scm-plugin/target/repository/trunk@ F:\jenkins\jenkins-slave\workspace\maven-box_maven-scm_SCM-877@2\m\maven-scm-plugin\target\checkout"
[INFO] Working directory: F:\jenkins\jenkins-slave\workspace\maven-box_maven-scm_SCM-877@2\m\maven-scm-plugin\target
[INFO] Executing: cmd.exe /X /C "svn --non-interactive update F:\jenkins\jenkins-slave\workspace\maven-box_maven-scm_SCM-877@2\m\maven-scm-plugin\target\checkout@"
[INFO] Executing: cmd.exe /X /C "svn --non-interactive update F:\jenkins\jenkins-slave\workspace\maven-box_maven-scm_SCM-877@2\m\maven-scm-plugin\target\checkout@"
[INFO] Working directory: F:\jenkins\jenkins-slave\workspace\maven-box_maven-scm_SCM-877@2\m\maven-scm-plugin\target\checkout
[INFO] Working directory: F:\jenkins\jenkins-slave\workspace\maven-box_maven-scm_SCM-877@2\m\maven-scm-plugin\target\checkout
[INFO] Storing revision in 'scm.revision' project property.
[INFO] Project at revision 8
[INFO] Tests run: 1, Failures: 0, Errors: 0, Skipped: 0, Time elapsed: 6.775 s - in org.apache.maven.scm.plugin.UpdateMojoTest
[INFO] Running org.apache.maven.scm.plugin.ValidateMojoTest
[ERROR] Validation of scm url connection (project.scm.connection) failed :
[ERROR] No such provider installed 'unknwonProvider'.
[ERROR] The invalid scm url connection: 'scm:unknwonProvider:http://svn.apache.org/repos/asf/maven/scm/trunk'.
[INFO] project.scm.connection scm connection string is valid.
[INFO] project.scm.developerConnection scm connection string is valid.
[INFO] Tests run: 3, Failures: 0, Errors: 0, Skipped: 0, Time elapsed: 0.132 s - in org.apache.maven.scm.plugin.ValidateMojoTest
[INFO] 
[INFO] Results:
[INFO] 
[ERROR] Errors: 
[ERROR]   CheckoutMojoTest.testExcludeInclude:153 » MojoExecution Cannot run checkout co...
[ERROR]   CheckoutMojoTest.testUseExport:132 » MojoExecution Cannot run checkout command...
[ERROR]   ExportMojoTest.testExcludeInclude:90 » MojoExecution Cannot run export command...
[ERROR]   ExportMojoTest.testExport:55 » MojoExecution Cannot run export command : 
[ERROR]   StatusMojoTest.testStatusMojo:49 » MojoExecution Cannot run status command : 
[INFO] 
[ERROR] Tests run: 22, Failures: 0, Errors: 5, Skipped: 0
[INFO] 
[ERROR] There are test failures.

Please refer to F:\jenkins\jenkins-slave\workspace\maven-box_maven-scm_SCM-877@2\m\maven-scm-plugin\target\surefire-reports for the individual test results.
Please refer to dump files (if any exist) [date]-jvmRun[N].dump, [date].dumpstream and [date]-jvmRun[N].dumpstream.
[INFO] 
[INFO] --- maven-jar-plugin:3.1.0:jar (default-jar) @ maven-scm-plugin ---
[INFO] Building jar: F:\jenkins\jenkins-slave\workspace\maven-box_maven-scm_SCM-877@2\m\maven-scm-plugin\target\maven-scm-plugin-1.11.1-SNAPSHOT.jar
[INFO] 
[INFO] --- maven-plugin-plugin:3.2:addPluginArtifactMetadata (default-addPluginArtifactMetadata) @ maven-scm-plugin ---
[INFO] 
[INFO] --- maven-site-plugin:3.7.1:attach-descriptor (attach-descriptor) @ maven-scm-plugin ---
[INFO] Skipping because packaging 'maven-plugin' is not pom.
[INFO] 
[INFO] --- maven-invoker-plugin:3.1.0:install (integration-test) @ maven-scm-plugin ---
[INFO] Downloading from central: https://repo.maven.apache.org/maven2/org/apache/maven/shared/maven-invoker/3.0.1/maven-invoker-3.0.1.pom
[INFO] Downloaded from central: https://repo.maven.apache.org/maven2/org/apache/maven/shared/maven-invoker/3.0.1/maven-invoker-3.0.1.pom (4.9 kB at 38 kB/s)
[INFO] Downloading from central: https://repo.maven.apache.org/maven2/org/apache/maven/shared/maven-shared-components/31/maven-shared-components-31.pom
[INFO] Downloaded from central: https://repo.maven.apache.org/maven2/org/apache/maven/shared/maven-shared-components/31/maven-shared-components-31.pom (5.1 kB at 213 kB/s)
[INFO] Downloading from central: https://repo.maven.apache.org/maven2/org/apache/maven/reporting/maven-reporting-impl/2.4/maven-reporting-impl-2.4.pom
[INFO] Downloaded from central: https://repo.maven.apache.org/maven2/org/apache/maven/reporting/maven-reporting-impl/2.4/maven-reporting-impl-2.4.pom (6.1 kB at 168 kB/s)
[INFO] Downloading from central: https://repo.maven.apache.org/maven2/commons-validator/commons-validator/1.4.1/commons-validator-1.4.1.pom
[INFO] Downloaded from central: https://repo.maven.apache.org/maven2/commons-validator/commons-validator/1.4.1/commons-validator-1.4.1.pom (13 kB at 373 kB/s)
[INFO] Downloading from central: https://repo.maven.apache.org/maven2/org/apache/commons/commons-parent/36/commons-parent-36.pom
[INFO] Downloaded from central: https://repo.maven.apache.org/maven2/org/apache/commons/commons-parent/36/commons-parent-36.pom (58 kB at 1.2 MB/s)
[INFO] Downloading from central: https://repo.maven.apache.org/maven2/commons-beanutils/commons-beanutils/1.8.3/commons-beanutils-1.8.3.pom
[INFO] Downloaded from central: https://repo.maven.apache.org/maven2/commons-beanutils/commons-beanutils/1.8.3/commons-beanutils-1.8.3.pom (11 kB at 373 kB/s)
[INFO] Downloading from central: https://repo.maven.apache.org/maven2/org/apache/commons/commons-parent/14/commons-parent-14.pom
[INFO] Downloaded from central: https://repo.maven.apache.org/maven2/org/apache/commons/commons-parent/14/commons-parent-14.pom (31 kB at 923 kB/s)
[INFO] Downloading from central: https://repo.maven.apache.org/maven2/commons-digester/commons-digester/1.8.1/commons-digester-1.8.1.pom
[INFO] Downloaded from central: https://repo.maven.apache.org/maven2/commons-digester/commons-digester/1.8.1/commons-digester-1.8.1.pom (10 kB at 418 kB/s)
[INFO] Downloading from central: https://repo.maven.apache.org/maven2/org/apache/maven/shared/maven-script-interpreter/1.2/maven-script-interpreter-1.2.pom
[INFO] Downloaded from central: https://repo.maven.apache.org/maven2/org/apache/maven/shared/maven-script-interpreter/1.2/maven-script-interpreter-1.2.pom (4.0 kB at 148 kB/s)
[INFO] Downloading from central: https://repo.maven.apache.org/maven2/org/apache/ant/ant/1.8.1/ant-1.8.1.pom
[INFO] Downloaded from central: https://repo.maven.apache.org/maven2/org/apache/ant/ant/1.8.1/ant-1.8.1.pom (8.8 kB at 352 kB/s)
[INFO] Downloading from central: https://repo.maven.apache.org/maven2/org/apache/ant/ant-parent/1.8.1/ant-parent-1.8.1.pom
[INFO] Downloaded from central: https://repo.maven.apache.org/maven2/org/apache/ant/ant-parent/1.8.1/ant-parent-1.8.1.pom (4.3 kB at 178 kB/s)
[INFO] Downloading from central: https://repo.maven.apache.org/maven2/org/apache/maven/shared/maven-artifact-transfer/0.9.1/maven-artifact-transfer-0.9.1.pom
[INFO] Downloaded from central: https://repo.maven.apache.org/maven2/org/apache/maven/shared/maven-artifact-transfer/0.9.1/maven-artifact-transfer-0.9.1.pom (7.6 kB at 423 kB/s)
[INFO] Downloading from central: https://repo.maven.apache.org/maven2/org/apache/maven/doxia/doxia-sink-api/1.7/doxia-sink-api-1.7.pom
[INFO] Downloaded from central: https://repo.maven.apache.org/maven2/org/apache/maven/doxia/doxia-sink-api/1.7/doxia-sink-api-1.7.pom (1.5 kB at 59 kB/s)
[INFO] Downloading from central: https://repo.maven.apache.org/maven2/org/apache/maven/doxia/doxia/1.7/doxia-1.7.pom
[INFO] Downloaded from central: https://repo.maven.apache.org/maven2/org/apache/maven/doxia/doxia/1.7/doxia-1.7.pom (15 kB at 565 kB/s)
[INFO] Downloading from central: https://repo.maven.apache.org/maven2/org/apache/maven/doxia/doxia-logging-api/1.7/doxia-logging-api-1.7.pom
[INFO] Downloaded from central: https://repo.maven.apache.org/maven2/org/apache/maven/doxia/doxia-logging-api/1.7/doxia-logging-api-1.7.pom (1.5 kB at 77 kB/s)
[INFO] Downloading from central: https://repo.maven.apache.org/maven2/org/apache/maven/doxia/doxia-site-renderer/1.7.4/doxia-site-renderer-1.7.4.pom
[INFO] Downloaded from central: https://repo.maven.apache.org/maven2/org/apache/maven/doxia/doxia-site-renderer/1.7.4/doxia-site-renderer-1.7.4.pom (6.7 kB at 278 kB/s)
[INFO] Downloading from central: https://repo.maven.apache.org/maven2/org/apache/maven/doxia/doxia-sitetools/1.7.4/doxia-sitetools-1.7.4.pom
[INFO] Downloaded from central: https://repo.maven.apache.org/maven2/org/apache/maven/doxia/doxia-sitetools/1.7.4/doxia-sitetools-1.7.4.pom (14 kB at 453 kB/s)
[INFO] Downloading from central: https://repo.maven.apache.org/maven2/org/apache/maven/doxia/doxia-core/1.7/doxia-core-1.7.pom
[INFO] Downloaded from central: https://repo.maven.apache.org/maven2/org/apache/maven/doxia/doxia-core/1.7/doxia-core-1.7.pom (4.1 kB at 119 kB/s)
[INFO] Downloading from central: https://repo.maven.apache.org/maven2/org/apache/maven/doxia/doxia-decoration-model/1.7.4/doxia-decoration-model-1.7.4.pom
[INFO] Downloaded from central: https://repo.maven.apache.org/maven2/org/apache/maven/doxia/doxia-decoration-model/1.7.4/doxia-decoration-model-1.7.4.pom (3.4 kB at 170 kB/s)
[INFO] Downloading from central: https://repo.maven.apache.org/maven2/org/apache/maven/doxia/doxia-skin-model/1.7.4/doxia-skin-model-1.7.4.pom
[INFO] Downloaded from central: https://repo.maven.apache.org/maven2/org/apache/maven/doxia/doxia-skin-model/1.7.4/doxia-skin-model-1.7.4.pom (3.0 kB at 116 kB/s)
[INFO] Downloading from central: https://repo.maven.apache.org/maven2/org/apache/maven/doxia/doxia-module-xhtml/1.7/doxia-module-xhtml-1.7.pom
[INFO] Downloaded from central: https://repo.maven.apache.org/maven2/org/apache/maven/doxia/doxia-module-xhtml/1.7/doxia-module-xhtml-1.7.pom (1.6 kB at 63 kB/s)
[INFO] Downloading from central: https://repo.maven.apache.org/maven2/org/apache/maven/doxia/doxia-modules/1.7/doxia-modules-1.7.pom
[INFO] Downloaded from central: https://repo.maven.apache.org/maven2/org/apache/maven/doxia/doxia-modules/1.7/doxia-modules-1.7.pom (2.6 kB at 131 kB/s)
[INFO] Downloading from central: https://repo.maven.apache.org/maven2/org/codehaus/groovy/groovy-all/2.4.8/groovy-all-2.4.8.pom
[INFO] Downloaded from central: https://repo.maven.apache.org/maven2/org/codehaus/groovy/groovy-all/2.4.8/groovy-all-2.4.8.pom (21 kB at 548 kB/s)
[INFO] Downloading from central: https://repo.maven.apache.org/maven2/org/apache/maven/shared/maven-invoker/3.0.1/maven-invoker-3.0.1.jar
[INFO] Downloading from central: https://repo.maven.apache.org/maven2/commons-digester/commons-digester/1.8.1/commons-digester-1.8.1.jar
[INFO] Downloading from central: https://repo.maven.apache.org/maven2/commons-beanutils/commons-beanutils/1.8.3/commons-beanutils-1.8.3.jar
[INFO] Downloading from central: https://repo.maven.apache.org/maven2/org/apache/maven/reporting/maven-reporting-impl/2.4/maven-reporting-impl-2.4.jar
[INFO] Downloading from central: https://repo.maven.apache.org/maven2/commons-validator/commons-validator/1.4.1/commons-validator-1.4.1.jar
[INFO] Downloaded from central: https://repo.maven.apache.org/maven2/org/apache/maven/shared/maven-invoker/3.0.1/maven-invoker-3.0.1.jar (33 kB at 944 kB/s)
[INFO] Downloading from central: https://repo.maven.apache.org/maven2/commons-logging/commons-logging/1.2/commons-logging-1.2.jar
[INFO] Downloaded from central: https://repo.maven.apache.org/maven2/org/apache/maven/reporting/maven-reporting-impl/2.4/maven-reporting-impl-2.4.jar (20 kB at 398 kB/s)
[INFO] Downloading from central: https://repo.maven.apache.org/maven2/org/apache/maven/shared/maven-script-interpreter/1.2/maven-script-interpreter-1.2.jar
[INFO] Downloaded from central: https://repo.maven.apache.org/maven2/commons-logging/commons-logging/1.2/commons-logging-1.2.jar (62 kB at 951 kB/s)
[INFO] Downloading from central: https://repo.maven.apache.org/maven2/org/apache/ant/ant/1.8.1/ant-1.8.1.jar
[INFO] Downloaded from central: https://repo.maven.apache.org/maven2/org/apache/maven/shared/maven-script-interpreter/1.2/maven-script-interpreter-1.2.jar (22 kB at 294 kB/s)
[INFO] Downloading from central: https://repo.maven.apache.org/maven2/org/apache/maven/shared/maven-artifact-transfer/0.9.1/maven-artifact-transfer-0.9.1.jar
[INFO] Downloaded from central: https://repo.maven.apache.org/maven2/commons-digester/commons-digester/1.8.1/commons-digester-1.8.1.jar (146 kB at 1.7 MB/s)
[INFO] Downloaded from central: https://repo.maven.apache.org/maven2/commons-beanutils/commons-beanutils/1.8.3/commons-beanutils-1.8.3.jar (232 kB at 2.7 MB/s)
[INFO] Downloading from central: https://repo.maven.apache.org/maven2/org/apache/maven/doxia/doxia-sink-api/1.7/doxia-sink-api-1.7.jar
[INFO] Downloading from central: https://repo.maven.apache.org/maven2/org/apache/maven/doxia/doxia-logging-api/1.7/doxia-logging-api-1.7.jar
[INFO] Downloaded from central: https://repo.maven.apache.org/maven2/commons-validator/commons-validator/1.4.1/commons-validator-1.4.1.jar (190 kB at 2.0 MB/s)
[INFO] Downloading from central: https://repo.maven.apache.org/maven2/org/apache/maven/doxia/doxia-site-renderer/1.7.4/doxia-site-renderer-1.7.4.jar
[INFO] Downloaded from central: https://repo.maven.apache.org/maven2/org/apache/maven/shared/maven-artifact-transfer/0.9.1/maven-artifact-transfer-0.9.1.jar (123 kB at 1.0 MB/s)
[INFO] Downloading from central: https://repo.maven.apache.org/maven2/org/apache/maven/doxia/doxia-decoration-model/1.7.4/doxia-decoration-model-1.7.4.jar
[INFO] Downloaded from central: https://repo.maven.apache.org/maven2/org/apache/maven/doxia/doxia-site-renderer/1.7.4/doxia-site-renderer-1.7.4.jar (64 kB at 496 kB/s)
[INFO] Downloading from central: https://repo.maven.apache.org/maven2/org/apache/maven/doxia/doxia-skin-model/1.7.4/doxia-skin-model-1.7.4.jar
[INFO] Downloaded from central: https://repo.maven.apache.org/maven2/org/apache/maven/doxia/doxia-decoration-model/1.7.4/doxia-decoration-model-1.7.4.jar (61 kB at 410 kB/s)
[INFO] Downloading from central: https://repo.maven.apache.org/maven2/org/apache/maven/doxia/doxia-module-xhtml/1.7/doxia-module-xhtml-1.7.jar
[INFO] Downloaded from central: https://repo.maven.apache.org/maven2/org/apache/maven/doxia/doxia-skin-model/1.7.4/doxia-skin-model-1.7.4.jar (16 kB at 99 kB/s)
[INFO] Downloading from central: https://repo.maven.apache.org/maven2/org/codehaus/groovy/groovy-all/2.4.8/groovy-all-2.4.8.jar
[INFO] Downloaded from central: https://repo.maven.apache.org/maven2/org/apache/maven/doxia/doxia-module-xhtml/1.7/doxia-module-xhtml-1.7.jar (17 kB at 101 kB/s)
[INFO] Downloaded from central: https://repo.maven.apache.org/maven2/org/apache/maven/doxia/doxia-sink-api/1.7/doxia-sink-api-1.7.jar (11 kB at 60 kB/s)
[INFO] Downloaded from central: https://repo.maven.apache.org/maven2/org/apache/ant/ant/1.8.1/ant-1.8.1.jar (1.5 MB at 7.6 MB/s)
[INFO] Downloaded from central: https://repo.maven.apache.org/maven2/org/apache/maven/doxia/doxia-logging-api/1.7/doxia-logging-api-1.7.jar (12 kB at 52 kB/s)
[INFO] Downloaded from central: https://repo.maven.apache.org/maven2/org/codehaus/groovy/groovy-all/2.4.8/groovy-all-2.4.8.jar (7.0 MB at 11 MB/s)
[INFO] Installing F:\jenkins\jenkins-slave\workspace\maven-box_maven-scm_SCM-877@2\m\maven-scm-managers\maven-scm-manager-plexus\pom.xml to F:\jenkins\jenkins-slave\workspace\maven-box_maven-scm_SCM-877@2\m\maven-scm-plugin\target\local-repo\org\apache\maven\scm\maven-scm-manager-plexus\1.11.1-SNAPSHOT\maven-scm-manager-plexus-1.11.1-SNAPSHOT.pom
[INFO] Installing F:\jenkins\jenkins-slave\workspace\maven-box_maven-scm_SCM-877@2\m\maven-scm-managers\maven-scm-manager-plexus\target\maven-scm-manager-plexus-1.11.1-SNAPSHOT.jar to F:\jenkins\jenkins-slave\workspace\maven-box_maven-scm_SCM-877@2\m\maven-scm-plugin\target\local-repo\org\apache\maven\scm\maven-scm-manager-plexus\1.11.1-SNAPSHOT\maven-scm-manager-plexus-1.11.1-SNAPSHOT.jar
[INFO] Installing F:\jenkins\jenkins-slave\workspace\maven-box_maven-scm_SCM-877@2\m\maven-scm-managers\pom.xml to F:\jenkins\jenkins-slave\workspace\maven-box_maven-scm_SCM-877@2\m\maven-scm-plugin\target\local-repo\org\apache\maven\scm\maven-scm-managers\1.11.1-SNAPSHOT\maven-scm-managers-1.11.1-SNAPSHOT.pom
[INFO] Installing f:\jenkins\jenkins-slave\workspace\maven-box_maven-scm_SCM-877@2\m\pom.xml to F:\jenkins\jenkins-slave\workspace\maven-box_maven-scm_SCM-877@2\m\maven-scm-plugin\target\local-repo\org\apache\maven\scm\maven-scm\1.11.1-SNAPSHOT\maven-scm-1.11.1-SNAPSHOT.pom
[INFO] Installing F:\jenkins\jenkins-slave\workspace\maven-box_maven-scm_SCM-877@2\m\maven-scm-providers\maven-scm-provider-local\pom.xml to F:\jenkins\jenkins-slave\workspace\maven-box_maven-scm_SCM-877@2\m\maven-scm-plugin\target\local-repo\org\apache\maven\scm\maven-scm-provider-local\1.11.1-SNAPSHOT\maven-scm-provider-local-1.11.1-SNAPSHOT.pom
[INFO] Installing F:\jenkins\jenkins-slave\workspace\maven-box_maven-scm_SCM-877@2\m\maven-scm-providers\maven-scm-provider-local\target\maven-scm-provider-local-1.11.1-SNAPSHOT.jar to F:\jenkins\jenkins-slave\workspace\maven-box_maven-scm_SCM-877@2\m\maven-scm-plugin\target\local-repo\org\apache\maven\scm\maven-scm-provider-local\1.11.1-SNAPSHOT\maven-scm-provider-local-1.11.1-SNAPSHOT.jar
[INFO] Installing F:\jenkins\jenkins-slave\workspace\maven-box_maven-scm_SCM-877@2\m\maven-scm-providers\pom.xml to F:\jenkins\jenkins-slave\workspace\maven-box_maven-scm_SCM-877@2\m\maven-scm-plugin\target\local-repo\org\apache\maven\scm\maven-scm-providers\1.11.1-SNAPSHOT\maven-scm-providers-1.11.1-SNAPSHOT.pom
[INFO] Installing F:\jenkins\jenkins-slave\workspace\maven-box_maven-scm_SCM-877@2\m\maven-scm-providers\maven-scm-providers-svn\maven-scm-provider-svn-commons\pom.xml to F:\jenkins\jenkins-slave\workspace\maven-box_maven-scm_SCM-877@2\m\maven-scm-plugin\target\local-repo\org\apache\maven\scm\maven-scm-provider-svn-commons\1.11.1-SNAPSHOT\maven-scm-provider-svn-commons-1.11.1-SNAPSHOT.pom
[INFO] Installing F:\jenkins\jenkins-slave\workspace\maven-box_maven-scm_SCM-877@2\m\maven-scm-providers\maven-scm-providers-svn\maven-scm-provider-svn-commons\target\maven-scm-provider-svn-commons-1.11.1-SNAPSHOT.jar to F:\jenkins\jenkins-slave\workspace\maven-box_maven-scm_SCM-877@2\m\maven-scm-plugin\target\local-repo\org\apache\maven\scm\maven-scm-provider-svn-commons\1.11.1-SNAPSHOT\maven-scm-provider-svn-commons-1.11.1-SNAPSHOT.jar
[INFO] Installing F:\jenkins\jenkins-slave\workspace\maven-box_maven-scm_SCM-877@2\m\maven-scm-providers\maven-scm-providers-svn\pom.xml to F:\jenkins\jenkins-slave\workspace\maven-box_maven-scm_SCM-877@2\m\maven-scm-plugin\target\local-repo\org\apache\maven\scm\maven-scm-providers-svn\1.11.1-SNAPSHOT\maven-scm-providers-svn-1.11.1-SNAPSHOT.pom
[INFO] Installing F:\jenkins\jenkins-slave\workspace\maven-box_maven-scm_SCM-877@2\m\maven-scm-providers\maven-scm-providers-svn\maven-scm-provider-svntest\pom.xml to F:\jenkins\jenkins-slave\workspace\maven-box_maven-scm_SCM-877@2\m\maven-scm-plugin\target\local-repo\org\apache\maven\scm\maven-scm-provider-svntest\1.11.1-SNAPSHOT\maven-scm-provider-svntest-1.11.1-SNAPSHOT.pom
[INFO] Installing F:\jenkins\jenkins-slave\workspace\maven-box_maven-scm_SCM-877@2\m\maven-scm-providers\maven-scm-providers-svn\maven-scm-provider-svntest\target\maven-scm-provider-svntest-1.11.1-SNAPSHOT.jar to F:\jenkins\jenkins-slave\workspace\maven-box_maven-scm_SCM-877@2\m\maven-scm-plugin\target\local-repo\org\apache\maven\scm\maven-scm-provider-svntest\1.11.1-SNAPSHOT\maven-scm-provider-svntest-1.11.1-SNAPSHOT.jar
[INFO] Installing F:\jenkins\jenkins-slave\workspace\maven-box_maven-scm_SCM-877@2\m\maven-scm-providers\maven-scm-providers-standard\pom.xml to F:\jenkins\jenkins-slave\workspace\maven-box_maven-scm_SCM-877@2\m\maven-scm-plugin\target\local-repo\org\apache\maven\scm\maven-scm-providers-standard\1.11.1-SNAPSHOT\maven-scm-providers-standard-1.11.1-SNAPSHOT.pom
[INFO] Installing F:\jenkins\jenkins-slave\workspace\maven-box_maven-scm_SCM-877@2\m\maven-scm-plugin\pom.xml to F:\jenkins\jenkins-slave\workspace\maven-box_maven-scm_SCM-877@2\m\maven-scm-plugin\target\local-repo\org\apache\maven\plugins\maven-scm-plugin\1.11.1-SNAPSHOT\maven-scm-plugin-1.11.1-SNAPSHOT.pom
[INFO] Installing F:\jenkins\jenkins-slave\workspace\maven-box_maven-scm_SCM-877@2\m\maven-scm-plugin\target\maven-scm-plugin-1.11.1-SNAPSHOT.jar to F:\jenkins\jenkins-slave\workspace\maven-box_maven-scm_SCM-877@2\m\maven-scm-plugin\target\local-repo\org\apache\maven\plugins\maven-scm-plugin\1.11.1-SNAPSHOT\maven-scm-plugin-1.11.1-SNAPSHOT.jar
[INFO] 
[INFO] --- maven-invoker-plugin:3.1.0:run (integration-test) @ maven-scm-plugin ---
[INFO] No projects were selected for execution.
[INFO] 
[INFO] --- maven-checkstyle-plugin:3.0.0:check (checkstyle-check) @ maven-scm-plugin ---
[INFO] ------------------------------------------------------------------------
[INFO] Reactor Summary for Maven SCM 1.11.1-SNAPSHOT:
[INFO] 
[INFO] Maven SCM .......................................... SUCCESS [ 55.565 s]
[INFO] Maven SCM API ...................................... SUCCESS [ 13.087 s]
[INFO] Maven SCM Managers ................................. SUCCESS [  0.576 s]
[INFO] Maven SCM Manager for Plexus ....................... SUCCESS [  3.636 s]
[INFO] Maven SCM Test ..................................... SUCCESS [  4.653 s]
[INFO] Maven SCM Providers ................................ SUCCESS [  0.871 s]
[INFO] Maven SCM AccuRev Provider ......................... SUCCESS [  9.770 s]
[INFO] Maven SCM Bazaar Provider .......................... SUCCESS [  3.737 s]
[INFO] Maven SCM Clearcase Provider ....................... SUCCESS [ 10.416 s]
[INFO] Maven SCM CVS Provider - Parent .................... SUCCESS [  0.952 s]
[INFO] Maven SCM CVS Provider TCK tests ................... SUCCESS [  4.539 s]
[INFO] Maven SCM CVS Provider - Common library ............ SUCCESS [  6.346 s]
[INFO] Maven SCM CVS Provider - CVS Executable Impl. ...... SUCCESS [  4.736 s]
[INFO] Maven SCM CVS Provider - CVS Java Impl. ............ SUCCESS [  3.850 s]
[INFO] Maven SCM Mercurial (Hg) Provider .................. SUCCESS [  4.557 s]
[INFO] Maven SCM Git Provider - Parent .................... SUCCESS [  0.917 s]
[INFO] Maven SCM Git Provider - Common library ............ SUCCESS [  4.259 s]
[INFO] Maven SCM Git Provider TCK Tests ................... SUCCESS [  1.743 s]
[INFO] Maven SCM Git Provider - Git Executable Impl. ...... SUCCESS [ 26.969 s]
[INFO] Maven SCM Git Provider - JGit Impl. ................ SUCCESS [ 55.341 s]
[INFO] Maven SCM Local Provider ........................... SUCCESS [  3.875 s]
[INFO] Maven SCM Perforce Provider ........................ SUCCESS [  6.324 s]
[INFO] Maven SCM Starteam Provider ........................ SUCCESS [  6.795 s]
[INFO] Maven SCM Subversion Provider - Parent ............. SUCCESS [  0.795 s]
[INFO] Maven SCM Subversion Provider - Common library ..... SUCCESS [  4.056 s]
[INFO] Maven SCM Subversion Provider TCK Tests ............ SUCCESS [  1.385 s]
[INFO] Maven SCM Subversion Provider - SVN Executable Impl. SUCCESS [  7.551 s]
[INFO] Maven SCM Synergy Provider ......................... SUCCESS [  4.545 s]
[INFO] Maven SCM Visual Source Safe Provider .............. SUCCESS [  4.148 s]
[INFO] Maven SCM TFS Provider ............................. SUCCESS [  5.868 s]
[INFO] Maven SCM MKS Integrity Provider ................... SUCCESS [  6.372 s]
[INFO] Maven SCM Jazz/Rational Team Concert Provider ...... SUCCESS [  6.230 s]
[INFO] Maven SCM Standard Providers ....................... SUCCESS [  1.418 s]
[INFO] Maven SCM Client ................................... SUCCESS [  5.163 s]
[INFO] Maven SCM Plugin ................................... SUCCESS [02:04 min]
[INFO] ------------------------------------------------------------------------
[INFO] BUILD SUCCESS
[INFO] ------------------------------------------------------------------------
[INFO] Total time:  06:48 min
[INFO] Finished at: 2020-01-12T09:57:57-08:00
[INFO] ------------------------------------------------------------------------
[WARNING] The requested profile "run-its" could not be activated because it does not exist.
[INFO] [jenkins-event-spy] Generated F:\jenkins\jenkins-slave\workspace\maven-box_maven-scm_SCM-877@2@tmp\withMaven9e8f752a\maven-spy-20200112-095108-90518373539643466759353.log
[Pipeline] }
[Pipeline] // dir
[Pipeline] }
[withMaven] invokerPublisher - Archive invoker results for Maven artifact MavenArtifact{org.apache.maven.plugins:maven-scm-plugin:maven-plugin:1.11.1-SNAPSHOT(version: 1.11.1-SNAPSHOT, snapshot:false) } generated by PluginInvocation{org.apache.maven.plugins:maven-invoker-plugin:3.1.0@run  integration-test}: m\maven-scm-plugin\target\invoker-reports\*.xml
[withMaven] junitPublisher - Archive test results for Maven artifact org.apache.maven.scm:maven-scm-api:jar:1.11.1-SNAPSHOT generated by maven-surefire-plugin:test (default-test): m\maven-scm-api\target\surefire-reports\*.xml
[withMaven] junitPublisher - Archive test results for Maven artifact org.apache.maven.scm:maven-scm-manager-plexus:jar:1.11.1-SNAPSHOT generated by maven-surefire-plugin:test (default-test): m\maven-scm-managers\maven-scm-manager-plexus\target\surefire-reports\*.xml
[withMaven] junitPublisher - Archive test results for Maven artifact org.apache.maven.scm:maven-scm-test:jar:1.11.1-SNAPSHOT generated by maven-surefire-plugin:test (default-test): m\maven-scm-test\target\surefire-reports\*.xml
[withMaven] junitPublisher - Archive test results for Maven artifact org.apache.maven.scm:maven-scm-provider-accurev:jar:1.11.1-SNAPSHOT generated by maven-surefire-plugin:test (default-test): m\maven-scm-providers\maven-scm-provider-accurev\target\surefire-reports\*.xml
[withMaven] junitPublisher - Archive test results for Maven artifact org.apache.maven.scm:maven-scm-provider-bazaar:jar:1.11.1-SNAPSHOT generated by maven-surefire-plugin:test (default-test): m\maven-scm-providers\maven-scm-provider-bazaar\target\surefire-reports\*.xml
[withMaven] junitPublisher - Archive test results for Maven artifact org.apache.maven.scm:maven-scm-provider-clearcase:jar:1.11.1-SNAPSHOT generated by maven-surefire-plugin:test (default-test): m\maven-scm-providers\maven-scm-provider-clearcase\target\surefire-reports\*.xml
[withMaven] junitPublisher - Archive test results for Maven artifact org.apache.maven.scm:maven-scm-provider-cvstest:jar:1.11.1-SNAPSHOT generated by maven-surefire-plugin:test (default-test): m\maven-scm-providers\maven-scm-providers-cvs\maven-scm-provider-cvstest\target\surefire-reports\*.xml
[withMaven] junitPublisher - Archive test results for Maven artifact org.apache.maven.scm:maven-scm-provider-cvs-commons:jar:1.11.1-SNAPSHOT generated by maven-surefire-plugin:test (default-test): m\maven-scm-providers\maven-scm-providers-cvs\maven-scm-provider-cvs-commons\target\surefire-reports\*.xml
[withMaven] junitPublisher - Archive test results for Maven artifact org.apache.maven.scm:maven-scm-provider-cvsexe:jar:1.11.1-SNAPSHOT generated by maven-surefire-plugin:test (default-test): m\maven-scm-providers\maven-scm-providers-cvs\maven-scm-provider-cvsexe\target\surefire-reports\*.xml
[withMaven] junitPublisher - Archive test results for Maven artifact org.apache.maven.scm:maven-scm-provider-cvsjava:jar:1.11.1-SNAPSHOT generated by maven-surefire-plugin:test (default-test): m\maven-scm-providers\maven-scm-providers-cvs\maven-scm-provider-cvsjava\target\surefire-reports\*.xml
[withMaven] junitPublisher - Archive test results for Maven artifact org.apache.maven.scm:maven-scm-provider-hg:jar:1.11.1-SNAPSHOT generated by maven-surefire-plugin:test (default-test): m\maven-scm-providers\maven-scm-provider-hg\target\surefire-reports\*.xml
[withMaven] junitPublisher - Archive test results for Maven artifact org.apache.maven.scm:maven-scm-provider-git-commons:jar:1.11.1-SNAPSHOT generated by maven-surefire-plugin:test (default-test): m\maven-scm-providers\maven-scm-providers-git\maven-scm-provider-git-commons\target\surefire-reports\*.xml
[withMaven] junitPublisher - Archive test results for Maven artifact org.apache.maven.scm:maven-scm-provider-gittest:jar:1.11.1-SNAPSHOT generated by maven-surefire-plugin:test (default-test): m\maven-scm-providers\maven-scm-providers-git\maven-scm-provider-gittest\target\surefire-reports\*.xml
[withMaven] junitPublisher - Archive test results for Maven artifact org.apache.maven.scm:maven-scm-provider-gitexe:jar:1.11.1-SNAPSHOT generated by maven-surefire-plugin:test (default-test): m\maven-scm-providers\maven-scm-providers-git\maven-scm-provider-gitexe\target\surefire-reports\*.xml
[withMaven] junitPublisher - Archive test results for Maven artifact org.apache.maven.scm:maven-scm-provider-jgit:jar:1.11.1-SNAPSHOT generated by maven-surefire-plugin:test (default-test): m\maven-scm-providers\maven-scm-providers-git\maven-scm-provider-jgit\target\surefire-reports\*.xml
[withMaven] junitPublisher - Archive test results for Maven artifact org.apache.maven.scm:maven-scm-provider-local:jar:1.11.1-SNAPSHOT generated by maven-surefire-plugin:test (default-test): m\maven-scm-providers\maven-scm-provider-local\target\surefire-reports\*.xml
[withMaven] junitPublisher - Archive test results for Maven artifact org.apache.maven.scm:maven-scm-provider-perforce:jar:1.11.1-SNAPSHOT generated by maven-surefire-plugin:test (default-test): m\maven-scm-providers\maven-scm-provider-perforce\target\surefire-reports\*.xml
[withMaven] junitPublisher - Archive test results for Maven artifact org.apache.maven.scm:maven-scm-provider-starteam:jar:1.11.1-SNAPSHOT generated by maven-surefire-plugin:test (default-test): m\maven-scm-providers\maven-scm-provider-starteam\target\surefire-reports\*.xml
[withMaven] junitPublisher - Archive test results for Maven artifact org.apache.maven.scm:maven-scm-provider-svn-commons:jar:1.11.1-SNAPSHOT generated by maven-surefire-plugin:test (default-test): m\maven-scm-providers\maven-scm-providers-svn\maven-scm-provider-svn-commons\target\surefire-reports\*.xml
[withMaven] junitPublisher - Archive test results for Maven artifact org.apache.maven.scm:maven-scm-provider-svntest:jar:1.11.1-SNAPSHOT generated by maven-surefire-plugin:test (default-test): m\maven-scm-providers\maven-scm-providers-svn\maven-scm-provider-svntest\target\surefire-reports\*.xml
[withMaven] junitPublisher - Archive test results for Maven artifact org.apache.maven.scm:maven-scm-provider-svnexe:jar:1.11.1-SNAPSHOT generated by maven-surefire-plugin:test (default-test): m\maven-scm-providers\maven-scm-providers-svn\maven-scm-provider-svnexe\target\surefire-reports\*.xml
[withMaven] junitPublisher - Archive test results for Maven artifact org.apache.maven.scm:maven-scm-provider-synergy:jar:1.11.1-SNAPSHOT generated by maven-surefire-plugin:test (default-test): m\maven-scm-providers\maven-scm-provider-synergy\target\surefire-reports\*.xml
[withMaven] junitPublisher - Archive test results for Maven artifact org.apache.maven.scm:maven-scm-provider-vss:jar:1.11.1-SNAPSHOT generated by maven-surefire-plugin:test (default-test): m\maven-scm-providers\maven-scm-provider-vss\target\surefire-reports\*.xml
[withMaven] junitPublisher - Archive test results for Maven artifact org.apache.maven.scm:maven-scm-provider-tfs:jar:1.11.1-SNAPSHOT generated by maven-surefire-plugin:test (default-test): m\maven-scm-providers\maven-scm-provider-tfs\target\surefire-reports\*.xml
[withMaven] junitPublisher - Archive test results for Maven artifact org.apache.maven.scm:maven-scm-provider-integrity:jar:1.11.1-SNAPSHOT generated by maven-surefire-plugin:test (default-test): m\maven-scm-providers\maven-scm-provider-integrity\target\surefire-reports\*.xml
[withMaven] junitPublisher - Archive test results for Maven artifact org.apache.maven.scm:maven-scm-provider-jazz:jar:1.11.1-SNAPSHOT generated by maven-surefire-plugin:test (default-test): m\maven-scm-providers\maven-scm-provider-jazz\target\surefire-reports\*.xml
[withMaven] junitPublisher - Archive test results for Maven artifact org.apache.maven.scm:maven-scm-client:jar:1.11.1-SNAPSHOT generated by maven-surefire-plugin:test (default-test): m\maven-scm-client\target\surefire-reports\*.xml
[withMaven] junitPublisher - Archive test results for Maven artifact org.apache.maven.plugins:maven-scm-plugin:maven-plugin:1.11.1-SNAPSHOT generated by maven-surefire-plugin:test (default-test): m\maven-scm-plugin\target\surefire-reports\*.xml
Recording test results
[withMaven] Publishers: Pipeline Graph Publisher: 13 ms, Invoker Publisher: 594 ms, Junit Publisher: 4578 ms, Concordion Publisher: 1 ms, Dependencies Fingerprint Publisher: 999 ms, SpotBugs Publisher: 1 ms
[Pipeline] // withMaven
[Pipeline] cleanWs
[WS-CLEANUP] Deleting project workspace...
[WS-CLEANUP] Deferred wipeout is used...
[WS-CLEANUP] done
[Pipeline] }
[Pipeline] // stage
[Pipeline] }
[Pipeline] // node
[Pipeline] }
[Pipeline] // parallel
[Pipeline] echo
[FAILURE-003] AbortException hudson.AbortException: Error cloning remote repo 'origin'
[Pipeline] stage
[Pipeline] { (Notifications)
[Pipeline] echo
Build result: FAILURE
[Pipeline] jiraIssueSelector
[Pipeline] echo
The authors of changes [rfscholte].
[Pipeline] echo
Sending email ...
[Pipeline] emailext
Mime
  • Unnamed multipart/mixed (inline, None, 0 bytes)
View raw message