maven-notifications mailing list archives

Site index · List index
Message view « Date » · « Thread »
Top « Date » · « Thread »
From Apache Jenkins Server <jenk...@builds.apache.org>
Subject Build failed in Jenkins: Maven TLP » maven-assembly-plugin » master #37
Date Wed, 01 Jan 2020 23:27:50 GMT
See https://builds.apache.org/job/maven-box/job/maven-assembly-plugin/job/master/37/

Changes:

* MASSEMBLY-919 IT for use case
* MASSEMBLY-775 treat a leading / as absolute path
* MASSEMBLY-775 outputDirectory is completely irrelevant for absolute
* MASSEMBLY-775 make isAbsolute() check more general

8 tests failed.
FAILED:  org.apache.maven.plugins.assembly.archive.phase.FileItemAssemblyPhaseTest.windows-jdk7-m3.2.x_build
/ Build windows-jdk7-m3.2.x_build / testExecute_WithOutputDirectory

Error Message:

  Expectation failure on verify:
    error("OS=Windows and the assembly descriptor contains a *nix-specific root-relative reference
(starting with slash): /"): expected: 1, actual: 0

Stack Trace:
java.lang.AssertionError: 

  Expectation failure on verify:
    error("OS=Windows and the assembly descriptor contains a *nix-specific root-relative reference
(starting with slash): /"): expected: 1, actual: 0
	at org.apache.maven.plugins.assembly.archive.phase.FileItemAssemblyPhaseTest.testExecute_WithOutputDirectory(FileItemAssemblyPhaseTest.java:245)


FAILED:  org.apache.maven.plugins.assembly.archive.phase.FileItemAssemblyPhaseTest.windows-jdk8-m3.6.x_build
/ Build windows-jdk8-m3.6.x_build / testExecute_WithOutputDirectory

Error Message:

  Expectation failure on verify:
    error("OS=Windows and the assembly descriptor contains a *nix-specific root-relative reference
(starting with slash): /"): expected: 1, actual: 0

Stack Trace:
java.lang.AssertionError: 

  Expectation failure on verify:
    error("OS=Windows and the assembly descriptor contains a *nix-specific root-relative reference
(starting with slash): /"): expected: 1, actual: 0
	at org.apache.maven.plugins.assembly.archive.phase.FileItemAssemblyPhaseTest.testExecute_WithOutputDirectory(FileItemAssemblyPhaseTest.java:245)


FAILED:  org.apache.maven.plugins.assembly.archive.phase.FileItemAssemblyPhaseTest.windows-jdk7-m3.3.x_build
/ Build windows-jdk7-m3.3.x_build / testExecute_WithOutputDirectory

Error Message:

  Expectation failure on verify:
    error("OS=Windows and the assembly descriptor contains a *nix-specific root-relative reference
(starting with slash): /"): expected: 1, actual: 0

Stack Trace:
java.lang.AssertionError: 

  Expectation failure on verify:
    error("OS=Windows and the assembly descriptor contains a *nix-specific root-relative reference
(starting with slash): /"): expected: 1, actual: 0
	at org.apache.maven.plugins.assembly.archive.phase.FileItemAssemblyPhaseTest.testExecute_WithOutputDirectory(FileItemAssemblyPhaseTest.java:245)


FAILED:  org.apache.maven.plugins.assembly.archive.phase.FileItemAssemblyPhaseTest.windows-jdk11-m3.6.x_build
/ Build windows-jdk11-m3.6.x_build / testExecute_WithOutputDirectory

Error Message:

  Expectation failure on verify:
    error("OS=Windows and the assembly descriptor contains a *nix-specific root-relative reference
(starting with slash): /"): expected: 1, actual: 0

Stack Trace:
java.lang.AssertionError: 

  Expectation failure on verify:
    error("OS=Windows and the assembly descriptor contains a *nix-specific root-relative reference
(starting with slash): /"): expected: 1, actual: 0
	at org.apache.maven.plugins.assembly.archive.phase.FileItemAssemblyPhaseTest.testExecute_WithOutputDirectory(FileItemAssemblyPhaseTest.java:245)


FAILED:  org.apache.maven.plugins.assembly.archive.phase.FileItemAssemblyPhaseTest.windows-jdk7-m3.6.x_build
/ Build windows-jdk7-m3.6.x_build / testExecute_WithOutputDirectory

Error Message:

  Expectation failure on verify:
    error("OS=Windows and the assembly descriptor contains a *nix-specific root-relative reference
(starting with slash): /"): expected: 1, actual: 0

Stack Trace:
java.lang.AssertionError: 

  Expectation failure on verify:
    error("OS=Windows and the assembly descriptor contains a *nix-specific root-relative reference
(starting with slash): /"): expected: 1, actual: 0
	at org.apache.maven.plugins.assembly.archive.phase.FileItemAssemblyPhaseTest.testExecute_WithOutputDirectory(FileItemAssemblyPhaseTest.java:245)


FAILED:  org.apache.maven.plugins.assembly.archive.phase.FileItemAssemblyPhaseTest.windows-jdk13-m3.6.x_build
/ Build windows-jdk13-m3.6.x_build / testExecute_WithOutputDirectory

Error Message:

  Expectation failure on verify:
    error("OS=Windows and the assembly descriptor contains a *nix-specific root-relative reference
(starting with slash): /"): expected: 1, actual: 0

Stack Trace:
java.lang.AssertionError: 

  Expectation failure on verify:
    error("OS=Windows and the assembly descriptor contains a *nix-specific root-relative reference
(starting with slash): /"): expected: 1, actual: 0
	at org.apache.maven.plugins.assembly.archive.phase.FileItemAssemblyPhaseTest.testExecute_WithOutputDirectory(FileItemAssemblyPhaseTest.java:245)


FAILED:  org.apache.maven.plugins.assembly.archive.phase.FileItemAssemblyPhaseTest.windows-jdk7-m3.5.x_build
/ Build windows-jdk7-m3.5.x_build / testExecute_WithOutputDirectory

Error Message:

  Expectation failure on verify:
    error("OS=Windows and the assembly descriptor contains a *nix-specific root-relative reference
(starting with slash): /"): expected: 1, actual: 0

Stack Trace:
java.lang.AssertionError: 

  Expectation failure on verify:
    error("OS=Windows and the assembly descriptor contains a *nix-specific root-relative reference
(starting with slash): /"): expected: 1, actual: 0
	at org.apache.maven.plugins.assembly.archive.phase.FileItemAssemblyPhaseTest.testExecute_WithOutputDirectory(FileItemAssemblyPhaseTest.java:245)


FAILED:  org.apache.maven.plugins.assembly.archive.phase.FileItemAssemblyPhaseTest.windows-jdk14-m3.6.x_build
/ Build windows-jdk14-m3.6.x_build / testExecute_WithOutputDirectory

Error Message:

  Expectation failure on verify:
    error("OS=Windows and the assembly descriptor contains a *nix-specific root-relative reference
(starting with slash): /"): expected: 1, actual: 0

Stack Trace:
java.lang.AssertionError: 

  Expectation failure on verify:
    error("OS=Windows and the assembly descriptor contains a *nix-specific root-relative reference
(starting with slash): /"): expected: 1, actual: 0
	at org.apache.maven.plugins.assembly.archive.phase.FileItemAssemblyPhaseTest.testExecute_WithOutputDirectory(FileItemAssemblyPhaseTest.java:245)




Build log:
[...truncated 12050 lines...]
[INFO] Building: projects\file-sets\include-base-directory\pom.xml
[INFO] run post-build script verify.bsh
[INFO]           projects\file-sets\include-base-directory\pom.xml  SUCCESS (3.8 s)
[INFO] Building: projects\file-sets\include-parent-dir\pom.xml
[INFO] run post-build script verify.bsh
[INFO]           projects\file-sets\include-parent-dir\pom.xml .... SUCCESS (8.0 s)
[INFO] Building: projects\file-sets\massembly-665\pom.xml
[INFO] run post-build script verify.bsh
[INFO]           projects\file-sets\massembly-665\pom.xml ......... FAILED (3.6 s)
[INFO]   The post-build script returned false.
[INFO] Building: projects\file-sets\multimodule-unix-lineEndings\pom.xml
[INFO] run post-build script verify.bsh
[INFO]           projects\file-sets\multimodule-unix-lineEndings\pom.xml SUCCESS (5.4 s)
[INFO] Building: projects\file-sets\multimodule-win-lineEndings\pom.xml
[INFO] run post-build script verify.bsh
[INFO]           projects\file-sets\multimodule-win-lineEndings\pom.xml SUCCESS (5.2 s)
[INFO] Building: projects\file-sets\platformspecific-filesets\pom.xml
[INFO] run post-build script verify.groovy
[INFO]           projects\file-sets\platformspecific-filesets\pom.xml SUCCESS (3.7 s)
[INFO] Building: projects\file-sets\precedence-check\pom.xml
[INFO] run post-build script verify.groovy
[INFO]           projects\file-sets\precedence-check\pom.xml ...... SUCCESS (3.6 s)
[INFO] Building: projects\file-sets\use-default-excludes\pom.xml
[INFO] run post-build script verify.bsh
[INFO]           projects\file-sets\use-default-excludes\pom.xml .. SUCCESS (3.7 s)
[INFO] Building: projects\files\filtered-sysprop\pom.xml
[INFO] run post-build script verify.bsh
[INFO]           projects\files\filtered-sysprop\pom.xml .......... SUCCESS (5.2 s)
[INFO] Building: projects\files\multimodule-relativePath\pom.xml
[INFO] run post-build script verify.bsh
[INFO]           projects\files\multimodule-relativePath\pom.xml .. SUCCESS (4.8 s)
[INFO] Building: projects\filtering-feature\fileset-to-tar-massembly-722\pom.xml
[INFO]           projects\filtering-feature\fileset-to-tar-massembly-722\pom.xml SUCCESS (5.3
s)
[INFO] Building: projects\filtering-feature\filter-comp-descriptor-path\pom.xml
[INFO] run post-build script verify.bsh
[INFO]           projects\filtering-feature\filter-comp-descriptor-path\pom.xml SUCCESS (3.8
s)
[INFO] Building: projects\filtering-feature\filters-defined-in-build\pom.xml
[INFO] run post-build script verify.bsh
[INFO]           projects\filtering-feature\filters-defined-in-build\pom.xml SUCCESS (4.1
s)
[INFO] Building: projects\filtering-feature\filtersDefinedInAssemblyPluginConfig\pom.xml
[INFO] run post-build script verify.bsh
[INFO]           projects\filtering-feature\filtersDefinedInAssemblyPluginConfig\pom.xml SUCCESS
(3.3 s)
[INFO] Building: projects\filtering-feature\massembly-736\pom.xml
[INFO] run post-build script verify.bsh
[INFO]           projects\filtering-feature\massembly-736\pom.xml . SUCCESS (4.0 s)
[INFO] Building: projects\forking-tests\assembly-assembly-with-module-binaries\pom.xml
[INFO] run post-build script verify.bsh
[INFO]           projects\forking-tests\assembly-assembly-with-module-binaries\pom.xml SUCCESS
(9.7 s)
[INFO] Building: projects\forking-tests\assembly-attached-with-module-binaries\pom.xml
[INFO] run post-build script verify.bsh
[INFO]           projects\forking-tests\assembly-attached-with-module-binaries\pom.xml SUCCESS
(9.2 s)
[INFO] Building: projects\mojo-configuration\archiver-ignorePermissions\pom.xml
[INFO] run post-build script verify.bsh
[INFO]           projects\mojo-configuration\archiver-ignorePermissions\pom.xml SUCCESS (7.7
s)
[INFO] Building: projects\mojo-configuration\ignoreDirFormatExtensions\pom.xml
[INFO] run post-build script verify.bsh
[INFO]           projects\mojo-configuration\ignoreDirFormatExtensions\pom.xml SUCCESS (5.8
s)
[INFO] Building: projects\mojo-configuration\manifest-with-customEntry\pom.xml
[INFO] run post-build script verify.bsh
[INFO]           projects\mojo-configuration\manifest-with-customEntry\pom.xml SUCCESS (7.9
s)
[INFO] Building: projects\mojo-configuration\manifest-with-mainClass\pom.xml
[INFO] run post-build script verify.bsh
[INFO]           projects\mojo-configuration\manifest-with-mainClass\pom.xml SUCCESS (7.6
s)
[INFO] Building: projects\mojo-configuration\massembly-291\pom.xml
[INFO] run post-build script verify.bsh
[INFO]           projects\mojo-configuration\massembly-291\pom.xml  SUCCESS (4.6 s)
[INFO] Building: projects\mojo-configuration\massembly-301\pom.xml
[INFO] run post-build script verify.bsh
[INFO]           projects\mojo-configuration\massembly-301\pom.xml  SUCCESS (6.5 s)
[INFO] Building: projects\mojo-configuration\no-appendAssemblyId-no-classifier\pom.xml
[INFO] run post-build script verify.bsh
[INFO]           projects\mojo-configuration\no-appendAssemblyId-no-classifier\pom.xml SUCCESS
(21.8 s)
[INFO] Building: projects\mojo-configuration\skipAssemblyCLIPropertySet\pom.xml
[INFO] run post-build script verify.bsh
[INFO]           projects\mojo-configuration\skipAssemblyCLIPropertySet\pom.xml SUCCESS (3.6
s)
[INFO] Building: projects\mojo-tests\single-in-one-project-hierarchy\pom.xml
[INFO] run post-build script verify.bsh
[INFO]           projects\mojo-tests\single-in-one-project-hierarchy\pom.xml SUCCESS (7.6
s)
[INFO] Building: projects\mojo-tests\single-twice-in-multimodule-hierarchy\pom.xml
[INFO] run post-build script verify.bsh
[INFO]           projects\mojo-tests\single-twice-in-multimodule-hierarchy\pom.xml SUCCESS
(9.9 s)
[INFO] Building: projects\mojo-tests\single-twice-in-one-project-hierarchy\pom.xml
[INFO] run post-build script verify.bsh
[INFO]           projects\mojo-tests\single-twice-in-one-project-hierarchy\pom.xml SUCCESS
(7.8 s)
[INFO] Building: projects\multimodule\massembly-298\pom.xml
[INFO] run post-build script verify.bsh
[INFO]           projects\multimodule\massembly-298\pom.xml ....... SUCCESS (9.7 s)
[INFO] Building: projects\multimodule\massembly-317\pom.xml
[INFO]           projects\multimodule\massembly-317\pom.xml ....... SUCCESS (5.8 s)
[INFO] Building: projects\multimodule\massembly-474\pom.xml
[INFO]           projects\multimodule\massembly-474\pom.xml ....... SUCCESS (7.5 s)
[INFO] Building: projects\multimodule\massembly-619\pom.xml
[INFO] run post-build script verify.bsh
[INFO]           projects\multimodule\massembly-619\pom.xml ....... SUCCESS (6.0 s)
[INFO] Building: projects\multimodule\multimodule-binariesNotSource\pom.xml
[INFO] run post-build script verify.bsh
[INFO]           projects\multimodule\multimodule-binariesNotSource\pom.xml SUCCESS (11.2
s)
[INFO] Building: projects\multimodule\multimodule-filteredFileSet\pom.xml
[INFO] run post-build script verify.bsh
[INFO]           projects\multimodule\multimodule-filteredFileSet\pom.xml SUCCESS (5.5 s)
[INFO] Building: projects\multimodule\multimodule-modulePomPropInterp\pom.xml
[INFO] run post-build script verify.bsh
[INFO]           projects\multimodule\multimodule-modulePomPropInterp\pom.xml SUCCESS (5.8
s)
[INFO] Building: projects\multimodule\multimodule-siblingParent\parent\pom.xml
[INFO] run post-build script verify.bsh
[INFO]           projects\multimodule\multimodule-siblingParent\parent\pom.xml SUCCESS (9.4
s)
[INFO] Building: projects\multimodule\multimodule-sourceNotBinaries\pom.xml
[INFO] run post-build script verify.bsh
[INFO]           projects\multimodule\multimodule-sourceNotBinaries\pom.xml SUCCESS (10.3
s)
[INFO] Building: projects\multimodule\multimodule-wholeReactorFromChild\pom.xml
[INFO] run post-build script verify.bsh
[INFO]           projects\multimodule\multimodule-wholeReactorFromChild\pom.xml SUCCESS (11.7
s)
[INFO] Building: projects\multimodule\two-level-multimodule\pom.xml
[INFO] run post-build script verify.groovy
[INFO]           projects\multimodule\two-level-multimodule\pom.xml SUCCESS (9.4 s)
[INFO] Building: projects\multimodule\two-levels-includeBaseDir-withBin\pom.xml
[INFO] run post-build script verify.groovy
[INFO]           projects\multimodule\two-levels-includeBaseDir-withBin\pom.xml SUCCESS (9.4
s)
[INFO] Building: projects\multimodule\two-levels-includeBaseDir-withSrc\pom.xml
[INFO] run post-build script verify.groovy
[INFO]           projects\multimodule\two-levels-includeBaseDir-withSrc\pom.xml SUCCESS (9.2
s)
[INFO] Building: projects\repositories\basic-repository\pom.xml
[INFO] run post-build script verify.bsh
[INFO]           projects\repositories\basic-repository\pom.xml ... SUCCESS (7.7 s)
[INFO] Building: projects\repositories\massembly-196\pom.xml
[INFO] run post-build script verify.bsh
[INFO]           projects\repositories\massembly-196\pom.xml ...... SUCCESS (13.1 s)
[INFO] Building: projects\repositories\massembly-855\pom.xml
[INFO] run post-build script verify.bsh
[INFO]           projects\repositories\massembly-855\pom.xml ...... SUCCESS (4.3 s)
[INFO] Building: projects\reproducible\pom.xml
[INFO] run post-build script verify.groovy
[INFO]           projects\reproducible\pom.xml .................... SUCCESS (7.3 s)
[INFO] 
[INFO] --- maven-checkstyle-plugin:3.0.0:check (checkstyle-check) @ maven-assembly-plugin
---
[INFO] There are 3 errors reported by Checkstyle 6.18 with config/maven_checks.xml ruleset.
[INFO] Ignored 3 errors, 0 violation remaining.
[INFO] 
[INFO] --- maven-invoker-plugin:3.1.0:verify (integration-test) @ maven-assembly-plugin ---
[INFO] -------------------------------------------------
[INFO] Build Summary:
[INFO]   Passed: 136, Failed: 1, Errors: 0, Skipped: 2
[INFO] -------------------------------------------------
[ERROR] The following builds failed:
[ERROR] *  projects\file-sets\massembly-665\pom.xml
[INFO] -------------------------------------------------
[INFO] ------------------------------------------------------------------------
[INFO] BUILD FAILURE
[INFO] ------------------------------------------------------------------------
[INFO] Total time:  17:14 min
[INFO] Finished at: 2020-01-01T15:25:57-08:00
[INFO] ------------------------------------------------------------------------
[INFO] [jenkins-event-spy] Generated F:\jenkins\jenkins-slave\workspace\box_maven-assembly-plugin_master@2@tmp\withMavenf7f0fe35\maven-spy-20200101-150842-3731033096381230120266.log
[ERROR] Failed to execute goal org.apache.maven.plugins:maven-invoker-plugin:3.1.0:verify
(integration-test) on project maven-assembly-plugin: 1 build failed. See console output above
for details. -> [Help 1]
org.apache.maven.lifecycle.LifecycleExecutionException: Failed to execute goal org.apache.maven.plugins:maven-invoker-plugin:3.1.0:verify
(integration-test) on project maven-assembly-plugin: 1 build failed. See console output above
for details.
    at org.apache.maven.lifecycle.internal.MojoExecutor.execute (MojoExecutor.java:215)
    at org.apache.maven.lifecycle.internal.MojoExecutor.execute (MojoExecutor.java:156)
    at org.apache.maven.lifecycle.internal.MojoExecutor.execute (MojoExecutor.java:148)
    at org.apache.maven.lifecycle.internal.LifecycleModuleBuilder.buildProject (LifecycleModuleBuilder.java:117)
    at org.apache.maven.lifecycle.internal.LifecycleModuleBuilder.buildProject (LifecycleModuleBuilder.java:81)
    at org.apache.maven.lifecycle.internal.builder.singlethreaded.SingleThreadedBuilder.build
(SingleThreadedBuilder.java:56)
    at org.apache.maven.lifecycle.internal.LifecycleStarter.execute (LifecycleStarter.java:128)
    at org.apache.maven.DefaultMaven.doExecute (DefaultMaven.java:305)
    at org.apache.maven.DefaultMaven.doExecute (DefaultMaven.java:192)
    at org.apache.maven.DefaultMaven.execute (DefaultMaven.java:105)
    at org.apache.maven.cli.MavenCli.execute (MavenCli.java:956)
    at org.apache.maven.cli.MavenCli.doMain (MavenCli.java:288)
    at org.apache.maven.cli.MavenCli.main (MavenCli.java:192)
    at jdk.internal.reflect.NativeMethodAccessorImpl.invoke0 (Native Method)
    at jdk.internal.reflect.NativeMethodAccessorImpl.invoke (NativeMethodAccessorImpl.java:62)
    at jdk.internal.reflect.DelegatingMethodAccessorImpl.invoke (DelegatingMethodAccessorImpl.java:43)
    at java.lang.reflect.Method.invoke (Method.java:567)
    at org.codehaus.plexus.classworlds.launcher.Launcher.launchEnhanced (Launcher.java:282)
    at org.codehaus.plexus.classworlds.launcher.Launcher.launch (Launcher.java:225)
    at org.codehaus.plexus.classworlds.launcher.Launcher.mainWithExitCode (Launcher.java:406)
    at org.codehaus.plexus.classworlds.launcher.Launcher.main (Launcher.java:347)
Caused by: org.apache.maven.plugin.MojoFailureException: 1 build failed. See console output
above for details.
    at org.apache.maven.plugins.invoker.InvokerSession.handleFailures (InvokerSession.java:260)
    at org.apache.maven.plugins.invoker.VerifyMojo.execute (VerifyMojo.java:137)
    at org.apache.maven.plugin.DefaultBuildPluginManager.executeMojo (DefaultBuildPluginManager.java:137)
    at org.apache.maven.lifecycle.internal.MojoExecutor.execute (MojoExecutor.java:210)
    at org.apache.maven.lifecycle.internal.MojoExecutor.execute (MojoExecutor.java:156)
    at org.apache.maven.lifecycle.internal.MojoExecutor.execute (MojoExecutor.java:148)
    at org.apache.maven.lifecycle.internal.LifecycleModuleBuilder.buildProject (LifecycleModuleBuilder.java:117)
    at org.apache.maven.lifecycle.internal.LifecycleModuleBuilder.buildProject (LifecycleModuleBuilder.java:81)
    at org.apache.maven.lifecycle.internal.builder.singlethreaded.SingleThreadedBuilder.build
(SingleThreadedBuilder.java:56)
    at org.apache.maven.lifecycle.internal.LifecycleStarter.execute (LifecycleStarter.java:128)
    at org.apache.maven.DefaultMaven.doExecute (DefaultMaven.java:305)
    at org.apache.maven.DefaultMaven.doExecute (DefaultMaven.java:192)
    at org.apache.maven.DefaultMaven.execute (DefaultMaven.java:105)
    at org.apache.maven.cli.MavenCli.execute (MavenCli.java:956)
    at org.apache.maven.cli.MavenCli.doMain (MavenCli.java:288)
    at org.apache.maven.cli.MavenCli.main (MavenCli.java:192)
    at jdk.internal.reflect.NativeMethodAccessorImpl.invoke0 (Native Method)
    at jdk.internal.reflect.NativeMethodAccessorImpl.invoke (NativeMethodAccessorImpl.java:62)
    at jdk.internal.reflect.DelegatingMethodAccessorImpl.invoke (DelegatingMethodAccessorImpl.java:43)
    at java.lang.reflect.Method.invoke (Method.java:567)
    at org.codehaus.plexus.classworlds.launcher.Launcher.launchEnhanced (Launcher.java:282)
    at org.codehaus.plexus.classworlds.launcher.Launcher.launch (Launcher.java:225)
    at org.codehaus.plexus.classworlds.launcher.Launcher.mainWithExitCode (Launcher.java:406)
    at org.codehaus.plexus.classworlds.launcher.Launcher.main (Launcher.java:347)
[ERROR] 
[ERROR] Re-run Maven using the -X switch to enable full debug logging.
[ERROR] 
[ERROR] For more information about the errors and possible solutions, please read the following
articles:
[ERROR] [Help 1] http://cwiki.apache.org/confluence/display/MAVEN/MojoFailureException
[Pipeline] }
[Pipeline] // dir
[Pipeline] }
[withMaven] junitPublisher - Archive test results for Maven artifact org.apache.maven.plugins:maven-assembly-plugin:maven-plugin:3.2.1-SNAPSHOT
generated by maven-surefire-plugin:test (default-test): windows-jdk14-m3.6.x_build\target\surefire-reports\*.xml
Recording test results
[withMaven] openTasksPublisher - Scan Tasks for Maven artifact org.apache.maven.plugins:maven-assembly-plugin:maven-plugin:3.2.1-SNAPSHOT
in source directory windows-jdk14-m3.6.x_build\src\main\java
[TASKS] Scanning folder 'f:\jenkins\jenkins-slave\workspace\box_maven-assembly-plugin_master@2'
for files matching the pattern 'windows-jdk14-m3.6.x_build\src\main\java\**\*' - excludes:
null
[TASKS] Found 71 files to scan for tasks
[TASKS] Found 14 open tasks.
Skipping warnings blame since pipelines do not have an SCM link.%n
[TASKS] Computing warning deltas based on reference build #36
[withMaven] invokerPublisher - Archive invoker results for Maven artifact MavenArtifact{org.apache.maven.plugins:maven-assembly-plugin:maven-plugin:3.2.1-SNAPSHOT(version:
3.2.1-SNAPSHOT, snapshot:false) } generated by PluginInvocation{org.apache.maven.plugins:maven-invoker-plugin:3.1.0@integration-test
 integration-test}: windows-jdk14-m3.6.x_build\target\invoker-reports\*.xml
[withMaven] Publishers: Generated Artifacts Publisher: 15 ms, Junit Publisher: 1260 ms, Open
Task Scanner Publisher: 213 ms, Invoker Publisher: 106995 ms
[Pipeline] // withMaven
[Pipeline] cleanWs
[WS-CLEANUP] Deleting project workspace...
[WS-CLEANUP] Deferred wipeout is used...
[WS-CLEANUP] done
[Pipeline] cleanWs
[WS-CLEANUP] Deleting project workspace...
[WS-CLEANUP] Deferred wipeout is used...
[WS-CLEANUP] done
[Pipeline] }
[Pipeline] // stage
[Pipeline] }
[Pipeline] // ws
[Pipeline] }
[Pipeline] // node
[Pipeline] }
Failed in branch windows-jdk14-m3.6.x_build
[Pipeline] // parallel
[Pipeline] stage
[Pipeline] { (Notifications)
[Pipeline] echo
Build result: FAILURE
[Pipeline] jiraIssueSelector
[Pipeline] jiraComment
[Pipeline] jiraComment
[Pipeline] echo
The authors of changes [struberg].
[Pipeline] echo
Sending email ...
[Pipeline] emailext
Mime
  • Unnamed multipart/mixed (inline, None, 0 bytes)
View raw message