maven-notifications mailing list archives

Site index · List index
Message view « Date » · « Thread »
Top « Date » · « Thread »
From Apache Jenkins Server <jenk...@builds.apache.org>
Subject Build failed in Jenkins: Maven TLP » maven-enforcer » MENFORCER-288 #46
Date Wed, 01 Jan 2020 03:57:50 GMT
See https://builds.apache.org/job/maven-box/job/maven-enforcer/job/MENFORCER-288/46/

No changes.

1 tests failed.
FAILED:  org.apache.maven.plugins.enforcer.TestRequireJavaVersion.windows-jdk11 / Build windows-jdk11
/ settingsTheJavaVersionAsNormalizedVersionShouldNotFail

Error Message:
Detected JDK Version: 9.0.4 is not in the allowed range 11.

Stack Trace:
org.apache.maven.enforcer.rule.api.EnforcerRuleException: Detected JDK Version: 9.0.4 is not
in the allowed range 11.
	at org.apache.maven.plugins.enforcer.TestRequireJavaVersion.settingsTheJavaVersionAsNormalizedVersionShouldNotFail(TestRequireJavaVersion.java:84)




Build log:
[...truncated 22602 lines...]
[INFO]           require-release-dependencies-excludes_failure\pom.xml SUCCESS (4.4 s)
[INFO] Building: require-release-version\pom.xml
[INFO]           require-upper-bound-dependencies-managed_success\pom.xml SUCCESS (3.8 s)
[INFO] Building: require-upper-bound-dependencies-unique_failure\pom.xml
[INFO] run post-build script verify.groovy
[INFO]           require-upper-bound-dependencies-managed_failure\pom.xml SUCCESS (3.8 s)
[INFO] Building: require-upper-bound-dependencies-managed_success\pom.xml
[INFO] snapshot org.apache.maven.plugins.enforcer.its:menforcer134_project:1.0-SNAPSHOT: checking
for updates from apache-snapshots
[INFO]           require-release-version\pom.xml .................. SUCCESS (4.0 s)
[INFO] Building: require-same-versions_failure\pom.xml
[INFO] snapshot org.apache.maven.plugins.enforcer.its:menforcer134_project:1.0-SNAPSHOT: checking
for updates from Nexus
[INFO] artifact org.apache.maven.plugins.enforcer.its.menforcer134_project:1.0-SNAPSHOT: checking
for updates from central
[INFO] org.apache.maven.plugins.enforcer.its.menforcer134_project.1.0-SNAPSHOT: checking for
updates from central
[INFO] snapshot org.apache.maven.plugins.enforcer.its:menforcer134_modelbuilder:1.0-SNAPSHOT:
checking for updates from apache-snapshots
[INFO] snapshot org.apache.maven.plugins.enforcer.its:menforcer134_modelbuilder:1.0-SNAPSHOT:
checking for updates from Nexus
[INFO] artifact org.apache.maven.plugins.enforcer.its.menforcer134_modelbuilder:1.0-SNAPSHOT:
checking for updates from central
[INFO] org.apache.maven.plugins.enforcer.its.menforcer134_modelbuilder.1.0-SNAPSHOT: checking
for updates from central
[INFO] snapshot org.apache.maven.plugins.enforcer.its:menforcer134_model:1.0-SNAPSHOT: checking
for updates from apache-snapshots
[INFO]           require-upper-bound-dependencies-managed_success\pom.xml SUCCESS (3.8 s)
[INFO] Building: require-upper-bound-dependencies-unique_failure\pom.xml
[INFO] snapshot org.apache.maven.plugins.enforcer.its:menforcer134_model:1.0-SNAPSHOT: checking
for updates from Nexus
[INFO] artifact org.apache.maven.plugins.enforcer.its.menforcer134_model:1.0-SNAPSHOT: checking
for updates from central
[INFO] org.apache.maven.plugins.enforcer.its.menforcer134_model.1.0-SNAPSHOT: checking for
updates from central
[INFO] run post-build script verify.groovy
[INFO]           require-upper-bound-dependencies-unique_failure\pom.xml SUCCESS (5.5 s)
[INFO] Building: require-upper-bound-dependencies-unique_success\pom.xml
[INFO] snapshot org.apache.maven.plugins.enforcer.its:menforcer134_project:1.0-SNAPSHOT: checking
for updates from apache-snapshots
[INFO]           require-same-versions_failure\pom.xml ............ SUCCESS (4.3 s)
[INFO] Building: require-same-versions_success\pom.xml
[INFO] snapshot org.apache.maven.plugins.enforcer.its:menforcer134_project:1.0-SNAPSHOT: checking
for updates from Nexus
[INFO] artifact org.apache.maven.plugins.enforcer.its.menforcer134_project:1.0-SNAPSHOT: checking
for updates from central
[INFO] org.apache.maven.plugins.enforcer.its.menforcer134_project.1.0-SNAPSHOT: checking for
updates from central
[INFO] snapshot org.apache.maven.plugins.enforcer.its:menforcer134_modelbuilder:1.0-SNAPSHOT:
checking for updates from apache-snapshots
[INFO] snapshot org.apache.maven.plugins.enforcer.its:menforcer134_modelbuilder:1.0-SNAPSHOT:
checking for updates from Nexus
[INFO] artifact org.apache.maven.plugins.enforcer.its.menforcer134_modelbuilder:1.0-SNAPSHOT:
checking for updates from central
[INFO] org.apache.maven.plugins.enforcer.its.menforcer134_modelbuilder.1.0-SNAPSHOT: checking
for updates from central
[INFO] snapshot org.apache.maven.plugins.enforcer.its:menforcer134_model:1.0-SNAPSHOT: checking
for updates from apache-snapshots
[INFO] snapshot org.apache.maven.plugins.enforcer.its:menforcer134_model:1.0-SNAPSHOT: checking
for updates from Nexus
[INFO] artifact org.apache.maven.plugins.enforcer.its.menforcer134_model:1.0-SNAPSHOT: checking
for updates from central
[INFO] org.apache.maven.plugins.enforcer.its.menforcer134_model.1.0-SNAPSHOT: checking for
updates from central
[INFO] run post-build script verify.groovy
[INFO]           require-upper-bound-dependencies-unique_failure\pom.xml SUCCESS (5.6 s)
[INFO] Building: require-upper-bound-dependencies-unique_success\pom.xml
[INFO]           require-upper-bound-dependencies-unique_success\pom.xml SUCCESS (4.1 s)
[INFO] Building: require-upper-bound-deps_failure\pom.xml
[INFO]           require-same-versions_success\pom.xml ............ SUCCESS (4.2 s)
[INFO] Building: require-snapshot-version_failure\pom.xml
[INFO] run post-build script verify.groovy
[INFO]           require-upper-bound-deps_failure\pom.xml ......... SUCCESS (3.4 s)
[INFO] Building: require-upper-bound-deps_ignored\pom.xml
[INFO]           require-upper-bound-dependencies-unique_success\pom.xml SUCCESS (4.4 s)
[INFO] Building: require-upper-bound-deps_failure\pom.xml
[INFO]           require-snapshot-version_failure\pom.xml ......... SUCCESS (4.4 s)
[INFO] Building: require-snapshot-version_success\pom.xml
[INFO] run post-build script verify.groovy
[INFO]           require-upper-bound-deps_ignored\pom.xml ......... SUCCESS (3.6 s)
[INFO] Building: require-upper-bound-deps_success\pom.xml
[INFO] run post-build script verify.groovy
[INFO]           require-upper-bound-deps_failure\pom.xml ......... SUCCESS (4.1 s)
[INFO] Building: require-upper-bound-deps_ignored\pom.xml
[INFO]           require-snapshot-version_success\pom.xml ......... SUCCESS (4.4 s)
[INFO] Building: require-upper-bound-dependencies-managed_failure\pom.xml
[INFO]           require-upper-bound-deps_success\pom.xml ......... SUCCESS (4.0 s)
[INFO] Building: resolve_collect_dependencies\pom.xml
[INFO] run post-build script verify.groovy
[INFO]           require-upper-bound-deps_ignored\pom.xml ......... SUCCESS (3.8 s)
[INFO] Building: require-upper-bound-deps_success\pom.xml
[INFO] run post-build script verify.groovy
[INFO]           require-upper-bound-dependencies-managed_failure\pom.xml SUCCESS (4.5 s)
[INFO] Building: require-upper-bound-dependencies-managed_success\pom.xml
[INFO]           require-upper-bound-deps_success\pom.xml ......... SUCCESS (3.8 s)
[INFO] Building: resolve_collect_dependencies\pom.xml
[INFO]           require-upper-bound-dependencies-managed_success\pom.xml SUCCESS (4.2 s)
[INFO] Building: require-upper-bound-dependencies-unique_failure\pom.xml
[INFO] run post-build script verify.groovy
[INFO]           resolve_collect_dependencies\pom.xml ............. SUCCESS (7.9 s)
[INFO] -------------------------------------------------
[INFO] Build Summary:
[INFO]   Passed: 68, Failed: 0, Errors: 0, Skipped: 0
[INFO] -------------------------------------------------
[INFO] 
[INFO] --- mrm-maven-plugin:1.0.0:stop (default) @ maven-enforcer-plugin ---
[INFO] Stopping Mock Repository Manager on http://localhost:51332
[INFO] Mock Repository Manager http://localhost:51332 is stopped.
[INFO] 
[INFO] --- maven-checkstyle-plugin:3.0.0:check (checkstyle-check) @ maven-enforcer-plugin
---
[INFO] ------------------------------------------------------------------------
[INFO] Reactor Summary for Apache Maven Enforcer 3.0.0-SNAPSHOT:
[INFO] 
[INFO] Apache Maven Enforcer .............................. SUCCESS [ 50.445 s]
[INFO] Apache Maven Enforcer API .......................... SUCCESS [  5.960 s]
[INFO] Apache Maven Enforcer Built-In Rules ............... SUCCESS [ 15.585 s]
[INFO] Apache Maven Enforcer Plugin ....................... SUCCESS [05:23 min]
[INFO] ------------------------------------------------------------------------
[INFO] BUILD SUCCESS
[INFO] ------------------------------------------------------------------------
[INFO] Total time:  06:37 min
[INFO] Finished at: 2019-12-31T19:56:55-08:00
[INFO] ------------------------------------------------------------------------
[INFO] [jenkins-event-spy] Generated F:\jenkins\jenkins-slave\workspace\box_maven-enforcer_MENFORCER-288@tmp\withMavene6b3e009\maven-spy-20191231-195017-8504618475261636488402.log
Picked up JAVA_TOOL_OPTIONS: -Dmaven.ext.class.path="f:\jenkins\jenkins-slave\workspace\box_maven-enforcer_MENFORCER-288@tmp\withMavene6b3e009\pipeline-maven-spy.jar"
-Dorg.jenkinsci.plugins.pipeline.maven.reportsFolder="f:\jenkins\jenkins-slave\workspace\box_maven-enforcer_MENFORCER-288@tmp\withMavene6b3e009"

[Pipeline] }
[Pipeline] // dir
[Pipeline] }
[withMaven] invokerPublisher - Archive invoker results for Maven artifact MavenArtifact{org.apache.maven.plugins:maven-enforcer-plugin:maven-plugin:3.0.0-SNAPSHOT(version:
3.0.0-SNAPSHOT, snapshot:false) } generated by PluginInvocation{org.apache.maven.plugins:maven-invoker-plugin:3.0.1@run
 integration-test}: m\maven-enforcer-plugin\target\invoker-reports\*.xml
[INFO] snapshot org.apache.maven.plugins.enforcer.its:menforcer134_project:1.0-SNAPSHOT: checking
for updates from apache-snapshots
[INFO] snapshot org.apache.maven.plugins.enforcer.its:menforcer134_project:1.0-SNAPSHOT: checking
for updates from Nexus
[INFO] artifact org.apache.maven.plugins.enforcer.its.menforcer134_project:1.0-SNAPSHOT: checking
for updates from central
[INFO] org.apache.maven.plugins.enforcer.its.menforcer134_project.1.0-SNAPSHOT: checking for
updates from central
[INFO] snapshot org.apache.maven.plugins.enforcer.its:menforcer134_modelbuilder:1.0-SNAPSHOT:
checking for updates from apache-snapshots
[INFO] snapshot org.apache.maven.plugins.enforcer.its:menforcer134_modelbuilder:1.0-SNAPSHOT:
checking for updates from Nexus
[INFO] artifact org.apache.maven.plugins.enforcer.its.menforcer134_modelbuilder:1.0-SNAPSHOT:
checking for updates from central
[INFO] org.apache.maven.plugins.enforcer.its.menforcer134_modelbuilder.1.0-SNAPSHOT: checking
for updates from central
[INFO] snapshot org.apache.maven.plugins.enforcer.its:menforcer134_model:1.0-SNAPSHOT: checking
for updates from apache-snapshots
[INFO] snapshot org.apache.maven.plugins.enforcer.its:menforcer134_model:1.0-SNAPSHOT: checking
for updates from Nexus
[INFO] artifact org.apache.maven.plugins.enforcer.its.menforcer134_model:1.0-SNAPSHOT: checking
for updates from central
[INFO] org.apache.maven.plugins.enforcer.its.menforcer134_model.1.0-SNAPSHOT: checking for
updates from central
[INFO] run post-build script verify.groovy
[INFO]           resolve_collect_dependencies\pom.xml ............. SUCCESS (7.7 s)
[INFO] -------------------------------------------------
[INFO] Build Summary:
[INFO]   Passed: 68, Failed: 0, Errors: 0, Skipped: 0
[INFO] -------------------------------------------------
[INFO] 
[INFO] --- mrm-maven-plugin:1.0.0:stop (default) @ maven-enforcer-plugin ---
[INFO] Stopping Mock Repository Manager on http://localhost:57529
[INFO] Mock Repository Manager http://localhost:57529 is stopped.
[INFO] 
[INFO] --- maven-checkstyle-plugin:3.0.0:check (checkstyle-check) @ maven-enforcer-plugin
---
[INFO] ------------------------------------------------------------------------
[INFO] Reactor Summary for Apache Maven Enforcer 3.0.0-SNAPSHOT:
[INFO] 
[INFO] Apache Maven Enforcer .............................. SUCCESS [ 43.428 s]
[INFO] Apache Maven Enforcer API .......................... SUCCESS [  6.359 s]
[INFO] Apache Maven Enforcer Built-In Rules ............... SUCCESS [ 15.734 s]
[INFO] Apache Maven Enforcer Plugin ....................... SUCCESS [05:17 min]
[INFO] ------------------------------------------------------------------------
[INFO] BUILD SUCCESS
[INFO] ------------------------------------------------------------------------
[INFO] Total time:  06:23 min
[INFO] Finished at: 2019-12-31T19:57:00-08:00
[INFO] ------------------------------------------------------------------------
[INFO] [jenkins-event-spy] Generated F:\jenkins\jenkins-slave\workspace\box_maven-enforcer_MENFORCER-288@2@tmp\withMaven04ebea21\maven-spy-20191231-195036-895455096115781299417.log
[Pipeline] }
[Pipeline] // dir
[Pipeline] }
[withMaven] invokerPublisher - Archive invoker results for Maven artifact MavenArtifact{org.apache.maven.plugins:maven-enforcer-plugin:maven-plugin:3.0.0-SNAPSHOT(version:
3.0.0-SNAPSHOT, snapshot:false) } generated by PluginInvocation{org.apache.maven.plugins:maven-invoker-plugin:3.0.1@run
 integration-test}: m\maven-enforcer-plugin\target\invoker-reports\*.xml
[INFO] run post-build script verify.groovy
[INFO]           require-upper-bound-dependencies-unique_failure\pom.xml SUCCESS (6.2 s)
[INFO] Building: require-upper-bound-dependencies-unique_success\pom.xml
[INFO]           require-upper-bound-dependencies-unique_success\pom.xml SUCCESS (4.0 s)
[INFO] Building: require-upper-bound-deps_failure\pom.xml
[INFO] run post-build script verify.groovy
[INFO]           require-upper-bound-deps_failure\pom.xml ......... SUCCESS (3.7 s)
[INFO] Building: require-upper-bound-deps_ignored\pom.xml
[INFO] run post-build script verify.groovy
[INFO]           require-upper-bound-deps_ignored\pom.xml ......... SUCCESS (3.3 s)
[INFO] Building: require-upper-bound-deps_success\pom.xml
[INFO]           require-upper-bound-deps_success\pom.xml ......... SUCCESS (3.8 s)
[INFO] Building: resolve_collect_dependencies\pom.xml
[withMaven] junitPublisher - Archive test results for Maven artifact org.apache.maven.enforcer:enforcer-api:jar:3.0.0-SNAPSHOT
generated by maven-surefire-plugin:test (default-test): m\enforcer-api\target\surefire-reports\*.xml
[withMaven] junitPublisher - Archive test results for Maven artifact org.apache.maven.enforcer:enforcer-rules:jar:3.0.0-SNAPSHOT
generated by maven-surefire-plugin:test (default-test): m\enforcer-rules\target\surefire-reports\*.xml
[withMaven] junitPublisher - Archive test results for Maven artifact org.apache.maven.plugins:maven-enforcer-plugin:maven-plugin:3.0.0-SNAPSHOT
generated by maven-surefire-plugin:test (default-test): m\maven-enforcer-plugin\target\surefire-reports\*.xml
Recording test results
[withMaven] Publishers: Pipeline Graph Publisher: 3 ms, Invoker Publisher: 22656 ms, Junit
Publisher: 801 ms, Dependencies Fingerprint Publisher: 47 ms
[Pipeline] // withMaven
[Pipeline] cleanWs
[WS-CLEANUP] Deleting project workspace...
[WS-CLEANUP] Deferred wipeout is used...
[WS-CLEANUP] done
[Pipeline] }
[Pipeline] // stage
[Pipeline] }
[Pipeline] // node
[Pipeline] }
[withMaven] junitPublisher - Archive test results for Maven artifact org.apache.maven.enforcer:enforcer-api:jar:3.0.0-SNAPSHOT
generated by maven-surefire-plugin:test (default-test): m\enforcer-api\target\surefire-reports\*.xml
[withMaven] junitPublisher - Archive test results for Maven artifact org.apache.maven.enforcer:enforcer-rules:jar:3.0.0-SNAPSHOT
generated by maven-surefire-plugin:test (default-test): m\enforcer-rules\target\surefire-reports\*.xml
[withMaven] junitPublisher - Archive test results for Maven artifact org.apache.maven.plugins:maven-enforcer-plugin:maven-plugin:3.0.0-SNAPSHOT
generated by maven-surefire-plugin:test (default-test): m\maven-enforcer-plugin\target\surefire-reports\*.xml
Recording test results
[withMaven] Publishers: Pipeline Graph Publisher: 2 ms, Invoker Publisher: 22696 ms, Junit
Publisher: 770 ms, Dependencies Fingerprint Publisher: 60 ms
[Pipeline] // withMaven
[Pipeline] cleanWs
[WS-CLEANUP] Deleting project workspace...
[WS-CLEANUP] Deferred wipeout is used...
[WS-CLEANUP] done
[Pipeline] }
[Pipeline] // stage
[Pipeline] }
[Pipeline] // node
[Pipeline] }
[INFO] run post-build script verify.groovy
[INFO]           resolve_collect_dependencies\pom.xml ............. SUCCESS (7.8 s)
[INFO] -------------------------------------------------
[INFO] Build Summary:
[INFO]   Passed: 68, Failed: 0, Errors: 0, Skipped: 0
[INFO] -------------------------------------------------
[INFO] 
[INFO] --- mrm-maven-plugin:1.0.0:stop (default) @ maven-enforcer-plugin ---
[INFO] Stopping Mock Repository Manager on http://localhost:57509
[INFO] Mock Repository Manager http://localhost:57509 is stopped.
[INFO] 
[INFO] --- maven-checkstyle-plugin:3.0.0:check (checkstyle-check) @ maven-enforcer-plugin
---
[INFO] ------------------------------------------------------------------------
[INFO] Reactor Summary for Apache Maven Enforcer 3.0.0-SNAPSHOT:
[INFO] 
[INFO] Apache Maven Enforcer .............................. SUCCESS [ 46.516 s]
[INFO] Apache Maven Enforcer API .......................... SUCCESS [  8.270 s]
[INFO] Apache Maven Enforcer Built-In Rules ............... SUCCESS [ 17.735 s]
[INFO] Apache Maven Enforcer Plugin ....................... SUCCESS [05:54 min]
[INFO] ------------------------------------------------------------------------
[INFO] BUILD SUCCESS
[INFO] ------------------------------------------------------------------------
[INFO] Total time:  07:08 min
[INFO] Finished at: 2019-12-31T19:57:24-08:00
[INFO] ------------------------------------------------------------------------
[INFO] [jenkins-event-spy] Generated F:\jenkins\jenkins-slave\workspace\box_maven-enforcer_MENFORCER-288@tmp\withMaven3667b7d3\maven-spy-20191231-195013-5888435793059354968482.log
Picked up JAVA_TOOL_OPTIONS: -Dmaven.ext.class.path="f:\jenkins\jenkins-slave\workspace\box_maven-enforcer_MENFORCER-288@tmp\withMaven3667b7d3\pipeline-maven-spy.jar"
-Dorg.jenkinsci.plugins.pipeline.maven.reportsFolder="f:\jenkins\jenkins-slave\workspace\box_maven-enforcer_MENFORCER-288@tmp\withMaven3667b7d3"

[Pipeline] }
[Pipeline] // dir
[Pipeline] }
[withMaven] invokerPublisher - Archive invoker results for Maven artifact MavenArtifact{org.apache.maven.plugins:maven-enforcer-plugin:maven-plugin:3.0.0-SNAPSHOT(version:
3.0.0-SNAPSHOT, snapshot:false) } generated by PluginInvocation{org.apache.maven.plugins:maven-invoker-plugin:3.0.1@run
 integration-test}: m\maven-enforcer-plugin\target\invoker-reports\*.xml
[withMaven] junitPublisher - Archive test results for Maven artifact org.apache.maven.enforcer:enforcer-api:jar:3.0.0-SNAPSHOT
generated by maven-surefire-plugin:test (default-test): m\enforcer-api\target\surefire-reports\*.xml
[withMaven] junitPublisher - Archive test results for Maven artifact org.apache.maven.enforcer:enforcer-rules:jar:3.0.0-SNAPSHOT
generated by maven-surefire-plugin:test (default-test): m\enforcer-rules\target\surefire-reports\*.xml
[withMaven] junitPublisher - Archive test results for Maven artifact org.apache.maven.plugins:maven-enforcer-plugin:maven-plugin:3.0.0-SNAPSHOT
generated by maven-surefire-plugin:test (default-test): m\maven-enforcer-plugin\target\surefire-reports\*.xml
Recording test results
[withMaven] Publishers: Pipeline Graph Publisher: 2 ms, Invoker Publisher: 23977 ms, Junit
Publisher: 750 ms, Dependencies Fingerprint Publisher: 73 ms
[Pipeline] // withMaven
[Pipeline] cleanWs
[WS-CLEANUP] Deleting project workspace...
[WS-CLEANUP] Deferred wipeout is used...
[WS-CLEANUP] done
[Pipeline] }
[Pipeline] // stage
[Pipeline] }
[Pipeline] // node
[Pipeline] }
[Pipeline] // parallel
[Pipeline] echo
[FAILURE-003] AbortException hudson.AbortException: script returned exit code 1
[Pipeline] stage
[Pipeline] { (Notifications)
[Pipeline] echo
Build result: FAILURE
[Pipeline] jiraIssueSelector
[Pipeline] echo
The authors of changes [].
[Pipeline] echo
Sending email ...
[Pipeline] emailext
Mime
  • Unnamed multipart/mixed (inline, None, 0 bytes)
View raw message