maven-notifications mailing list archives

Site index · List index
Message view « Date » · « Thread »
Top « Date » · « Thread »
From Apache Jenkins Server <jenk...@builds.apache.org>
Subject Build failed in Jenkins: Maven TLP » maven-wagon » uri-encoding #6
Date Wed, 01 Jan 2020 12:57:03 GMT
See https://builds.apache.org/job/maven-box/job/maven-wagon/job/uri-encoding/6/

No changes.

All tests passed

Build log:
[...truncated 24044 lines...]
[INFO] Using 'UTF-8' encoding to copy filtered resources.
[INFO] skip non existing resourceDirectory F:\jenkins\jenkins-slave\workspace\ven-box_maven-wagon_uri-encoding\m\wagon-providers\wagon-ftp\src\main\resources
[INFO] Copying 3 resources
[INFO] 
[INFO] --- maven-compiler-plugin:3.7.0:compile (default-compile) @ wagon-ftp ---
[INFO] Changes detected - recompiling the module!
[INFO] Compiling 3 source files to F:\jenkins\jenkins-slave\workspace\ven-box_maven-wagon_uri-encoding\m\wagon-providers\wagon-ftp\target\classes
[INFO] /F:/jenkins/jenkins-slave/workspace/ven-box_maven-wagon_uri-encoding/m/wagon-providers/wagon-ftp/src/main/java/org/apache/maven/wagon/providers/ftp/FtpWagon.java:
F:\jenkins\jenkins-slave\workspace\ven-box_maven-wagon_uri-encoding\m\wagon-providers\wagon-ftp\src\main\java\org\apache\maven\wagon\providers\ftp\FtpWagon.java
uses or overrides a deprecated API.
[INFO] /F:/jenkins/jenkins-slave/workspace/ven-box_maven-wagon_uri-encoding/m/wagon-providers/wagon-ftp/src/main/java/org/apache/maven/wagon/providers/ftp/FtpWagon.java:
Recompile with -Xlint:deprecation for details.
[INFO] 
[INFO] --- plexus-component-metadata:1.7.1:generate-metadata (generate) @ wagon-ftp ---
[INFO] Discovered 3 component descriptors(s)
[INFO] 
[INFO] --- animal-sniffer-maven-plugin:1.15:check (check-java-1.7-compat) @ wagon-ftp ---
[INFO] Checking unresolved references to org.codehaus.mojo.signature:java17:1.0
[INFO] 
[INFO] --- maven-resources-plugin:3.1.0:testResources (default-testResources) @ wagon-ftp
---
[INFO] Using 'UTF-8' encoding to copy filtered resources.
[INFO] Copying 1 resource
[INFO] Copying 3 resources
[INFO] 
[INFO] --- maven-compiler-plugin:3.7.0:testCompile (default-testCompile) @ wagon-ftp ---
[INFO] Changes detected - recompiling the module!
[INFO] Compiling 1 source file to F:\jenkins\jenkins-slave\workspace\ven-box_maven-wagon_uri-encoding\m\wagon-providers\wagon-ftp\target\test-classes
[INFO] 
[INFO] --- maven-surefire-plugin:2.20:test (default-test) @ wagon-ftp ---
[INFO] 
[INFO] -------------------------------------------------------
[INFO]  T E S T S
[INFO] -------------------------------------------------------
[INFO] Running org.apache.maven.wagon.providers.ftp.FtpWagonTest
[INFO] Tests run: 23, Failures: 0, Errors: 0, Skipped: 0, Time elapsed: 2.174 s - in org.apache.maven.wagon.providers.ftp.FtpWagonTest
[INFO] 
[INFO] Results:
[INFO] 
[INFO] Tests run: 23, Failures: 0, Errors: 0, Skipped: 0
[INFO] 
[INFO] 
[INFO] --- maven-jar-plugin:3.1.0:jar (default-jar) @ wagon-ftp ---
[INFO] Building jar: F:\jenkins\jenkins-slave\workspace\ven-box_maven-wagon_uri-encoding\m\wagon-providers\wagon-ftp\target\wagon-ftp-3.3.4-SNAPSHOT.jar
[INFO] 
[INFO] --- maven-site-plugin:3.7.1:attach-descriptor (attach-descriptor) @ wagon-ftp ---
[INFO] Skipping because packaging 'jar' is not pom.
[INFO] 
[INFO] --- maven-checkstyle-plugin:3.0.0:check (checkstyle-check) @ wagon-ftp ---
[INFO] 
[INFO] --------------< org.apache.maven.wagon:wagon-http-shared >--------------
[INFO] Building Apache Maven Wagon :: Providers :: HTTP Shared Library 3.3.4-SNAPSHOT [7/17]
[INFO] --------------------------------[ jar ]---------------------------------
[INFO] Downloading from central: https://repo.maven.apache.org/maven2/org/jsoup/jsoup/1.12.1/jsoup-1.12.1.pom
[INFO] Downloaded from central: https://repo.maven.apache.org/maven2/org/jsoup/jsoup/1.12.1/jsoup-1.12.1.pom
(8.3 kB at 194 kB/s)
[INFO] Downloading from central: https://repo.maven.apache.org/maven2/org/apache/httpcomponents/httpclient/4.5.9/httpclient-4.5.9.pom
[INFO] Downloaded from central: https://repo.maven.apache.org/maven2/org/apache/httpcomponents/httpclient/4.5.9/httpclient-4.5.9.pom
(6.6 kB at 200 kB/s)
[INFO] Downloading from central: https://repo.maven.apache.org/maven2/org/apache/httpcomponents/httpcomponents-client/4.5.9/httpcomponents-client-4.5.9.pom
[INFO] Downloaded from central: https://repo.maven.apache.org/maven2/org/apache/httpcomponents/httpcomponents-client/4.5.9/httpcomponents-client-4.5.9.pom
(16 kB at 546 kB/s)
[INFO] Downloading from central: https://repo.maven.apache.org/maven2/org/apache/httpcomponents/httpcomponents-parent/11/httpcomponents-parent-11.pom
[INFO] Downloaded from central: https://repo.maven.apache.org/maven2/org/apache/httpcomponents/httpcomponents-parent/11/httpcomponents-parent-11.pom
(35 kB at 754 kB/s)
[INFO] Downloading from central: https://repo.maven.apache.org/maven2/org/apache/httpcomponents/httpcore/4.4.11/httpcore-4.4.11.pom
[INFO] Downloaded from central: https://repo.maven.apache.org/maven2/org/apache/httpcomponents/httpcore/4.4.11/httpcore-4.4.11.pom
(5.2 kB at 178 kB/s)
[INFO] Downloading from central: https://repo.maven.apache.org/maven2/org/apache/httpcomponents/httpcomponents-core/4.4.11/httpcomponents-core-4.4.11.pom
[INFO] Downloaded from central: https://repo.maven.apache.org/maven2/org/apache/httpcomponents/httpcomponents-core/4.4.11/httpcomponents-core-4.4.11.pom
(13 kB at 443 kB/s)
[INFO] Downloading from central: https://repo.maven.apache.org/maven2/commons-codec/commons-codec/1.11/commons-codec-1.11.pom
[INFO] Downloaded from central: https://repo.maven.apache.org/maven2/commons-codec/commons-codec/1.11/commons-codec-1.11.pom
(14 kB at 482 kB/s)
[INFO] Downloading from central: https://repo.maven.apache.org/maven2/org/jsoup/jsoup/1.12.1/jsoup-1.12.1.jar
[INFO] Downloading from central: https://repo.maven.apache.org/maven2/org/apache/httpcomponents/httpcore/4.4.11/httpcore-4.4.11.jar
[INFO] Downloading from central: https://repo.maven.apache.org/maven2/commons-codec/commons-codec/1.11/commons-codec-1.11.jar
[INFO] Downloading from central: https://repo.maven.apache.org/maven2/org/apache/httpcomponents/httpclient/4.5.9/httpclient-4.5.9.jar
[INFO] Downloaded from central: https://repo.maven.apache.org/maven2/org/apache/httpcomponents/httpcore/4.4.11/httpcore-4.4.11.jar
(327 kB at 2.4 MB/s)
[INFO] Downloaded from central: https://repo.maven.apache.org/maven2/commons-codec/commons-codec/1.11/commons-codec-1.11.jar
(335 kB at 2.4 MB/s)
[INFO] Downloaded from central: https://repo.maven.apache.org/maven2/org/jsoup/jsoup/1.12.1/jsoup-1.12.1.jar
(397 kB at 2.8 MB/s)
[INFO] Downloaded from central: https://repo.maven.apache.org/maven2/org/apache/httpcomponents/httpclient/4.5.9/httpclient-4.5.9.jar
(774 kB at 5.5 MB/s)
[INFO] 
[INFO] --- maven-clean-plugin:3.1.0:clean (default-clean) @ wagon-http-shared ---
[INFO] 
[INFO] --- maven-enforcer-plugin:3.0.0-M2:enforce (enforce-maven-version) @ wagon-http-shared
---
[INFO] 
[INFO] --- maven-enforcer-plugin:3.0.0-M2:enforce (enforce-bytecode-version) @ wagon-http-shared
---
[INFO] 
[INFO] --- maven-enforcer-plugin:3.0.0-M2:enforce (ban-known-bad-maven-versions) @ wagon-http-shared
---
[INFO] 
[INFO] --- maven-enforcer-plugin:3.0.0-M2:enforce (default) @ wagon-http-shared ---
[INFO] 
[INFO] --- apache-rat-plugin:0.12:check (rat-check) @ wagon-http-shared ---
[INFO] Enabled default license matchers.
[INFO] Will parse SCM ignores for exclusions...
[INFO] Finished adding exclusions from SCM ignore files.
[INFO] 61 implicit excludes (use -debug for more details).
[INFO] Exclude: .checkstyle
[INFO] Exclude: **/*.odg
[INFO] Exclude: src/test/resources/**
[INFO] Exclude: src/main/resources/default-server-root/**
[INFO] Exclude: src/main/resources/ssh-keys/**
[INFO] Exclude: src/test/ssh-keys/**
[INFO] Exclude: .repository/**
[INFO] Exclude: out/**
[INFO] Exclude: .repository/**
[INFO] Exclude: .maven/spy.log
[INFO] Exclude: dependency-reduced-pom.xml
[INFO] Exclude: .java-version
[INFO] 12 resources included (use -debug for more details)
[INFO] Rat check: Summary over all files. Unapproved: 0, unknown: 0, generated: 0, approved:
12 licenses.
[INFO] 
[INFO] --- maven-remote-resources-plugin:1.5:process (process-resource-bundles) @ wagon-http-shared
---
[INFO] 
[INFO] --- maven-resources-plugin:3.1.0:resources (default-resources) @ wagon-http-shared
---
[INFO] Using 'UTF-8' encoding to copy filtered resources.
[INFO] skip non existing resourceDirectory F:\jenkins\jenkins-slave\workspace\ven-box_maven-wagon_uri-encoding\m\wagon-providers\wagon-http-shared\src\main\resources
[INFO] Copying 3 resources
[INFO] 
[INFO] --- maven-compiler-plugin:3.7.0:compile (default-compile) @ wagon-http-shared ---
[INFO] Changes detected - recompiling the module!
[INFO] Compiling 8 source files to F:\jenkins\jenkins-slave\workspace\ven-box_maven-wagon_uri-encoding\m\wagon-providers\wagon-http-shared\target\classes
[INFO] /F:/jenkins/jenkins-slave/workspace/ven-box_maven-wagon_uri-encoding/m/wagon-providers/wagon-http-shared/src/main/java/org/apache/maven/wagon/shared/http/AbstractHttpClientWagon.java:
Some input files use or override a deprecated API.
[INFO] /F:/jenkins/jenkins-slave/workspace/ven-box_maven-wagon_uri-encoding/m/wagon-providers/wagon-http-shared/src/main/java/org/apache/maven/wagon/shared/http/AbstractHttpClientWagon.java:
Recompile with -Xlint:deprecation for details.
[INFO] /F:/jenkins/jenkins-slave/workspace/ven-box_maven-wagon_uri-encoding/m/wagon-providers/wagon-http-shared/src/main/java/org/apache/maven/wagon/shared/http/AbstractHttpClientWagon.java:
F:\jenkins\jenkins-slave\workspace\ven-box_maven-wagon_uri-encoding\m\wagon-providers\wagon-http-shared\src\main\java\org\apache\maven\wagon\shared\http\AbstractHttpClientWagon.java
uses unchecked or unsafe operations.
[INFO] /F:/jenkins/jenkins-slave/workspace/ven-box_maven-wagon_uri-encoding/m/wagon-providers/wagon-http-shared/src/main/java/org/apache/maven/wagon/shared/http/AbstractHttpClientWagon.java:
Recompile with -Xlint:unchecked for details.
[INFO] 
[INFO] --- plexus-component-metadata:1.7.1:generate-metadata (generate) @ wagon-http-shared
---
[INFO] 
[INFO] --- animal-sniffer-maven-plugin:1.15:check (check-java-1.7-compat) @ wagon-http-shared
---
[INFO] Checking unresolved references to org.codehaus.mojo.signature:java17:1.0
[INFO] F:\jenkins\jenkins-slave\workspace\ven-box_maven-wagon_uri-encoding\m\wagon-providers\wagon-http-shared\src\main\java\org\apache\maven\wagon\shared\http\AbstractHttpClientWagon.java:197:
Covariant return type change detected: java.nio.Buffer java.nio.ByteBuffer.flip() has been
changed to java.nio.ByteBuffer java.nio.ByteBuffer.flip()
[INFO] F:\jenkins\jenkins-slave\workspace\ven-box_maven-wagon_uri-encoding\m\wagon-providers\wagon-http-shared\src\main\java\org\apache\maven\wagon\shared\http\AbstractHttpClientWagon.java:200:
Covariant return type change detected: java.nio.Buffer java.nio.ByteBuffer.clear() has been
changed to java.nio.ByteBuffer java.nio.ByteBuffer.clear()
[INFO] F:\jenkins\jenkins-slave\workspace\ven-box_maven-wagon_uri-encoding\m\wagon-providers\wagon-http-shared\src\main\java\org\apache\maven\wagon\shared\http\AbstractHttpClientWagon.java:213:
Covariant return type change detected: java.nio.Buffer java.nio.ByteBuffer.flip() has been
changed to java.nio.ByteBuffer java.nio.ByteBuffer.flip()
[INFO] F:\jenkins\jenkins-slave\workspace\ven-box_maven-wagon_uri-encoding\m\wagon-providers\wagon-http-shared\src\main\java\org\apache\maven\wagon\shared\http\AbstractHttpClientWagon.java:217:
Covariant return type change detected: java.nio.Buffer java.nio.ByteBuffer.clear() has been
changed to java.nio.ByteBuffer java.nio.ByteBuffer.clear()
[INFO] 
[INFO] --- maven-resources-plugin:3.1.0:testResources (default-testResources) @ wagon-http-shared
---
[INFO] Using 'UTF-8' encoding to copy filtered resources.
[INFO] Copying 9 resources
[INFO] Copying 3 resources
[INFO] 
[INFO] --- maven-compiler-plugin:3.7.0:testCompile (default-testCompile) @ wagon-http-shared
---
[INFO] Changes detected - recompiling the module!
[INFO] Compiling 2 source files to F:\jenkins\jenkins-slave\workspace\ven-box_maven-wagon_uri-encoding\m\wagon-providers\wagon-http-shared\target\test-classes
[INFO] 
[INFO] --- maven-surefire-plugin:2.20:test (default-test) @ wagon-http-shared ---
[INFO] 
[INFO] -------------------------------------------------------
[INFO]  T E S T S
[INFO] -------------------------------------------------------
[INFO] Running org.apache.maven.wagon.shared.http.EncodingUtilTest
[INFO] Tests run: 3, Failures: 0, Errors: 0, Skipped: 0, Time elapsed: 0.06 s - in org.apache.maven.wagon.shared.http.EncodingUtilTest
[INFO] Running org.apache.maven.wagon.shared.http.HtmlFileListParserTest
[INFO] Tests run: 10, Failures: 0, Errors: 0, Skipped: 0, Time elapsed: 0.248 s - in org.apache.maven.wagon.shared.http.HtmlFileListParserTest
[INFO] 
[INFO] Results:
[INFO] 
[INFO] Tests run: 13, Failures: 0, Errors: 0, Skipped: 0
[INFO] 
[INFO] 
[INFO] --- maven-jar-plugin:3.1.0:jar (default-jar) @ wagon-http-shared ---
[INFO] Building jar: F:\jenkins\jenkins-slave\workspace\ven-box_maven-wagon_uri-encoding\m\wagon-providers\wagon-http-shared\target\wagon-http-shared-3.3.4-SNAPSHOT.jar
[INFO] 
[INFO] --- maven-site-plugin:3.7.1:attach-descriptor (attach-descriptor) @ wagon-http-shared
---
[INFO] Skipping because packaging 'jar' is not pom.
[INFO] 
[INFO] --- maven-checkstyle-plugin:3.0.0:check (checkstyle-check) @ wagon-http-shared ---
[INFO] There are 13 errors reported by Checkstyle 6.18 with config/maven_checks.xml ruleset.
[ERROR] src\main\java\org\apache\maven\wagon\shared\http\EncodingUtil.java:[96,54] (whitespace)
ParenPad: '(' is not followed by whitespace.
[ERROR] src\main\java\org\apache\maven\wagon\shared\http\EncodingUtil.java:[96,62] (whitespace)
ParenPad: ')' is not preceded with whitespace.
[ERROR] src\main\java\org\apache\maven\wagon\shared\http\EncodingUtil.java:[98] (blocks) NeedBraces:
'if' construct must use '{}'s.
[ERROR] src\main\java\org\apache\maven\wagon\shared\http\EncodingUtil.java:[98,13] (whitespace)
ParenPad: '(' is not followed by whitespace.
[ERROR] src\main\java\org\apache\maven\wagon\shared\http\EncodingUtil.java:[98,37] (whitespace)
ParenPad: '(' is not followed by whitespace.
[ERROR] src\main\java\org\apache\maven\wagon\shared\http\EncodingUtil.java:[98,40] (whitespace)
ParenPad: ')' is not preceded with whitespace.
[ERROR] src\main\java\org\apache\maven\wagon\shared\http\EncodingUtil.java:[98,68] (whitespace)
ParenPad: '(' is not followed by whitespace.
[ERROR] src\main\java\org\apache\maven\wagon\shared\http\EncodingUtil.java:[98,72] (whitespace)
ParenPad: ')' is not preceded with whitespace.
[ERROR] src\main\java\org\apache\maven\wagon\shared\http\EncodingUtil.java:[98,73] (whitespace)
ParenPad: ')' is not preceded with whitespace.
[ERROR] src\main\java\org\apache\maven\wagon\shared\http\EncodingUtil.java:[99,30] (whitespace)
ParenPad: '(' is not followed by whitespace.
[ERROR] src\main\java\org\apache\maven\wagon\shared\http\EncodingUtil.java:[99,46] (whitespace)
ParenPad: ')' is not preceded with whitespace.
[ERROR] src\main\java\org\apache\maven\wagon\shared\http\EncodingUtil.java:[101,20] (whitespace)
ParenPad: '(' is not followed by whitespace.
[ERROR] src\main\java\org\apache\maven\wagon\shared\http\EncodingUtil.java:[101,24] (whitespace)
ParenPad: ')' is not preceded with whitespace.
[INFO] ------------------------------------------------------------------------
[INFO] Reactor Summary for Apache Maven Wagon 3.3.4-SNAPSHOT:
[INFO] 
[INFO] Apache Maven Wagon ................................. SUCCESS [ 44.471 s]
[INFO] Apache Maven Wagon :: API .......................... SUCCESS [ 13.390 s]
[INFO] Apache Maven Wagon :: Provider Test ................ SUCCESS [  4.267 s]
[INFO] Apache Maven Wagon :: Providers .................... SUCCESS [  0.929 s]
[INFO] Apache Maven Wagon :: Providers :: File Provider ... SUCCESS [  3.411 s]
[INFO] Apache Maven Wagon :: Providers :: FTP Provider .... SUCCESS [  6.910 s]
[INFO] Apache Maven Wagon :: Providers :: HTTP Shared Library FAILURE [  4.029 s]
[INFO] Apache Maven Wagon :: Test Compatibility Kits ...... SKIPPED
[INFO] Apache Maven Wagon :: HTTP Test Compatibility Kit .. SKIPPED
[INFO] Apache Maven Wagon :: Providers :: HTTP Provider ... SKIPPED
[INFO] Apache Maven Wagon :: Providers :: Lightweight HTTP Provider SKIPPED
[INFO] Apache Maven Wagon :: Providers :: SCM Provider .... SKIPPED
[INFO] Apache Maven Wagon :: Providers :: SSH Common Library SKIPPED
[INFO] Apache Maven Wagon :: Providers :: SSH Common Tests  SKIPPED
[INFO] Apache Maven Wagon :: Providers :: SSH External Provider SKIPPED
[INFO] Apache Maven Wagon :: Providers :: SSH Provider .... SKIPPED
[INFO] Apache Maven Wagon :: Providers :: WebDAV Provider . SKIPPED
[INFO] ------------------------------------------------------------------------
[INFO] BUILD FAILURE
[INFO] ------------------------------------------------------------------------
[INFO] Total time:  01:19 min
[INFO] Finished at: 2020-01-01T04:57:01-08:00
[INFO] ------------------------------------------------------------------------
[WARNING] The requested profile "run-its" could not be activated because it does not exist.
[INFO] [jenkins-event-spy] Generated F:\jenkins\jenkins-slave\workspace\ven-box_maven-wagon_uri-encoding@tmp\withMaven02e2a5c6\maven-spy-20200101-045541-85415721002546538028370.log
[ERROR] Failed to execute goal org.apache.maven.plugins:maven-checkstyle-plugin:3.0.0:check
(checkstyle-check) on project wagon-http-shared: You have 13 Checkstyle violations. ->
[Help 1]
[ERROR] 
[ERROR] To see the full stack trace of the errors, re-run Maven with the -e switch.
[ERROR] Re-run Maven using the -X switch to enable full debug logging.
[ERROR] 
[ERROR] For more information about the errors and possible solutions, please read the following
articles:
[ERROR] [Help 1] http://cwiki.apache.org/confluence/display/MAVEN/MojoFailureException
[ERROR] 
[ERROR] After correcting the problems, you can resume the build with the command
[ERROR]   mvn <args> -rf :wagon-http-shared
[Pipeline] }
[Pipeline] // dir
[Pipeline] }
[withMaven] junitPublisher - Archive test results for Maven artifact org.apache.maven.wagon:wagon-provider-api:jar:3.3.4-SNAPSHOT
generated by maven-surefire-plugin:test (default-test): m\wagon-provider-api\target\surefire-reports\*.xml
[withMaven] junitPublisher - Archive test results for Maven artifact org.apache.maven.wagon:wagon-provider-test:jar:3.3.4-SNAPSHOT
generated by maven-surefire-plugin:test (default-test): m\wagon-provider-test\target\surefire-reports\*.xml
[withMaven] junitPublisher - Archive test results for Maven artifact org.apache.maven.wagon:wagon-file:jar:3.3.4-SNAPSHOT
generated by maven-surefire-plugin:test (default-test): m\wagon-providers\wagon-file\target\surefire-reports\*.xml
[withMaven] junitPublisher - Archive test results for Maven artifact org.apache.maven.wagon:wagon-ftp:jar:3.3.4-SNAPSHOT
generated by maven-surefire-plugin:test (default-test): m\wagon-providers\wagon-ftp\target\surefire-reports\*.xml
[withMaven] junitPublisher - Archive test results for Maven artifact org.apache.maven.wagon:wagon-http-shared:jar:3.3.4-SNAPSHOT
generated by maven-surefire-plugin:test (default-test): m\wagon-providers\wagon-http-shared\target\surefire-reports\*.xml
Recording test results
[withMaven] Publishers: Pipeline Graph Publisher: 5 ms, Junit Publisher: 684 ms, Dependencies
Fingerprint Publisher: 70 ms
[Pipeline] // withMaven
[Pipeline] echo
[FAILURE-004] hudson.AbortException: script returned exit code 1
[Pipeline] cleanWs
[WS-CLEANUP] Deleting project workspace...
[WS-CLEANUP] Deferred wipeout is used...
[WS-CLEANUP] done
[Pipeline] cleanWs
[WS-CLEANUP] Deleting project workspace...
[WS-CLEANUP] Deferred wipeout is used...
[WS-CLEANUP] done
[Pipeline] }
[Pipeline] // stage
[Pipeline] }
[Pipeline] // node
[Pipeline] }
Failed in branch windows-jdk14
[Pipeline] // parallel
[Pipeline] echo
[FAILURE-003] AbortException hudson.AbortException: script returned exit code 1
[Pipeline] stage
[Pipeline] { (Notifications)
[Pipeline] echo
Build result: FAILURE
[Pipeline] jiraIssueSelector
[Pipeline] echo
The authors of changes [].
[Pipeline] echo
Sending email ...
[Pipeline] emailext
Mime
  • Unnamed multipart/mixed (inline, None, 0 bytes)
View raw message