maven-notifications mailing list archives

Site index · List index
Message view « Date » · « Thread »
Top « Date » · « Thread »
From Apache Jenkins Server <jenk...@builds.apache.org>
Subject Build failed in Jenkins: Maven TLP » maven-surefire » SUREFIRE-1570 #4
Date Thu, 14 May 2020 00:19:07 GMT
See https://builds.apache.org/job/maven-box/job/maven-surefire/job/SUREFIRE-1570/4/

Changes:

* fixed impl and Java9FullApiIT

1 tests failed.
FAILED:  org.apache.maven.surefire.its.jiras.Surefire1712ExtractedModulenameWithoutASMIT.test

Error Message:
org.apache.maven.it.VerificationException: Text not found in log: main module descriptor name:
wtf.g4s8.oot

Stack Trace:
org.apache.maven.surefire.its.fixture.SurefireVerifierException: org.apache.maven.it.VerificationException:
Text not found in log: main module descriptor name: wtf.g4s8.oot
	at org.apache.maven.surefire.its.jiras.Surefire1712ExtractedModulenameWithoutASMIT.test(Surefire1712ExtractedModulenameWithoutASMIT.java:47)
Caused by: org.apache.maven.it.VerificationException: Text not found in log: main module descriptor
name: wtf.g4s8.oot
	at org.apache.maven.surefire.its.jiras.Surefire1712ExtractedModulenameWithoutASMIT.test(Surefire1712ExtractedModulenameWithoutASMIT.java:47)




Build log:
[...truncated 29577 lines...]
[2020-05-14T00:08:21.940Z] [INFO] Tests run: 1, Failures: 0, Errors: 0, Skipped: 0, Time elapsed:
6.326 s - in org.apache.maven.surefire.its.jiras.Surefire674BuildFailingWhenErrorsIT
[2020-05-14T00:08:21.940Z] [INFO] Running org.apache.maven.surefire.its.jiras.Surefire674BuildFailingWhenFailsafeErrorsIT
[2020-05-14T00:08:24.788Z] Zipped 18859 entries.
[2020-05-14T00:08:24.788Z] Archiving C:\Windows\system32\config\systemprofile\AppData\Local\Temp\jenkins-maven-box-maven-surefire-SUREFIRE-1570-4\surefire-its--windows-jdk11-maven3.6.x.zip
[2020-05-14T00:08:24.788Z] [Fast Archiver] No prior successful build to compare, so performing
full copy of artifacts
[Pipeline] archiveArtifacts
[2020-05-14T00:08:26.555Z] Archiving artifacts
[2020-05-14T00:08:26.566Z] [Fast Archiver] No prior successful build to compare, so performing
full copy of artifacts
[Pipeline] cleanWs
[2020-05-14T00:08:28.596Z] [WS-CLEANUP] Deleting project workspace...
[2020-05-14T00:08:28.596Z] [WS-CLEANUP] Deferred wipeout is used...
[2020-05-14T00:08:28.685Z] [INFO] Tests run: 1, Failures: 0, Errors: 0, Skipped: 0, Time elapsed:
5.832 s - in org.apache.maven.surefire.its.jiras.Surefire674BuildFailingWhenFailsafeErrorsIT
[2020-05-14T00:08:28.685Z] [INFO] Running org.apache.maven.surefire.its.jiras.Surefire685CommaSeparatedIncludesIT
[2020-05-14T00:08:28.739Z] [WS-CLEANUP] done
[Pipeline] }
[Pipeline] // ws
[Pipeline] }
[Pipeline] // timestamps
[Pipeline] }
[Pipeline] // node
[Pipeline] }
[2020-05-14T00:08:33.976Z] [INFO] Tests run: 1, Failures: 0, Errors: 0, Skipped: 0, Time elapsed:
6.183 s - in org.apache.maven.surefire.its.jiras.Surefire685CommaSeparatedIncludesIT
[2020-05-14T00:08:33.976Z] [INFO] Running org.apache.maven.surefire.its.jiras.Surefire697NiceSummaryIT
[2020-05-14T00:08:40.479Z] [INFO] Tests run: 1, Failures: 0, Errors: 0, Skipped: 0, Time elapsed:
6.283 s - in org.apache.maven.surefire.its.jiras.Surefire697NiceSummaryIT
[2020-05-14T00:08:40.479Z] [INFO] Running org.apache.maven.surefire.its.jiras.Surefire705ParallelForkTimeoutIT
[2020-05-14T00:08:49.905Z] [INFO] Tests run: 1, Failures: 0, Errors: 0, Skipped: 0, Time elapsed:
9.562 s - in org.apache.maven.surefire.its.jiras.Surefire705ParallelForkTimeoutIT
[2020-05-14T00:08:49.905Z] [INFO] Running org.apache.maven.surefire.its.jiras.Surefire733AllOverrridesCapturedIT
[2020-05-14T00:08:56.461Z] [INFO] Tests run: 1, Failures: 0, Errors: 0, Skipped: 0, Time elapsed:
6.233 s - in org.apache.maven.surefire.its.jiras.Surefire733AllOverrridesCapturedIT
[2020-05-14T00:08:56.461Z] [INFO] Running org.apache.maven.surefire.its.jiras.Surefire735ForkFailWithRedirectConsoleOutputIT
[2020-05-14T00:09:07.622Z] [INFO] Tests run: 2, Failures: 0, Errors: 0, Skipped: 0, Time elapsed:
11.861 s - in org.apache.maven.surefire.its.jiras.Surefire735ForkFailWithRedirectConsoleOutputIT
[2020-05-14T00:09:07.622Z] [INFO] Running org.apache.maven.surefire.its.jiras.Surefire740TruncatedCommaIT
[2020-05-14T00:09:12.909Z] [INFO] Tests run: 1, Failures: 0, Errors: 0, Skipped: 0, Time elapsed:
5.095 s - in org.apache.maven.surefire.its.jiras.Surefire740TruncatedCommaIT
[2020-05-14T00:09:12.909Z] [INFO] Running org.apache.maven.surefire.its.jiras.Surefire747MethodParallelWithSuiteCountIT
[2020-05-14T00:09:37.948Z] [INFO] Tests run: 2, Failures: 0, Errors: 0, Skipped: 0, Time elapsed:
23.882 s - in org.apache.maven.surefire.its.jiras.Surefire747MethodParallelWithSuiteCountIT
[2020-05-14T00:09:37.948Z] [INFO] Running org.apache.maven.surefire.its.jiras.Surefire772BothReportsIT
[2020-05-14T00:09:51.121Z] [INFO] Tests run: 3, Failures: 0, Errors: 0, Skipped: 0, Time elapsed:
12.882 s - in org.apache.maven.surefire.its.jiras.Surefire772BothReportsIT
[2020-05-14T00:09:51.121Z] [INFO] Running org.apache.maven.surefire.its.jiras.Surefire772NoFailsafeReportsIT
[2020-05-14T00:10:09.310Z] [INFO] Tests run: 4, Failures: 0, Errors: 0, Skipped: 0, Time elapsed:
17.613 s - in org.apache.maven.surefire.its.jiras.Surefire772NoFailsafeReportsIT
[2020-05-14T00:10:09.310Z] [INFO] Running org.apache.maven.surefire.its.jiras.Surefire772NoSurefireReportsIT
[2020-05-14T00:10:24.803Z] [INFO] Tests run: 4, Failures: 0, Errors: 0, Skipped: 0, Time elapsed:
17.227 s - in org.apache.maven.surefire.its.jiras.Surefire772NoSurefireReportsIT
[2020-05-14T00:10:24.803Z] [INFO] Running org.apache.maven.surefire.its.jiras.Surefire772SpecifiedReportsIT
[2020-05-14T00:10:37.966Z] [INFO] Tests run: 3, Failures: 0, Errors: 0, Skipped: 0, Time elapsed:
12.46 s - in org.apache.maven.surefire.its.jiras.Surefire772SpecifiedReportsIT
[2020-05-14T00:10:37.966Z] [INFO] Running org.apache.maven.surefire.its.jiras.Surefire801ForkModeNoneClassLoaderIT
[2020-05-14T00:10:43.252Z] [INFO] Tests run: 1, Failures: 0, Errors: 0, Skipped: 0, Time elapsed:
5.646 s - in org.apache.maven.surefire.its.jiras.Surefire801ForkModeNoneClassLoaderIT
[2020-05-14T00:10:43.252Z] [INFO] Running org.apache.maven.surefire.its.jiras.Surefire803MultiFailsafeExecsIT
[2020-05-14T00:11:04.555Z] [INFO] Tests run: 2, Failures: 0, Errors: 0, Skipped: 0, Time elapsed:
21.147 s - in org.apache.maven.surefire.its.jiras.Surefire803MultiFailsafeExecsIT
[2020-05-14T00:11:04.555Z] [INFO] Running org.apache.maven.surefire.its.jiras.Surefire806SpecifiedTestControlsIT
[2020-05-14T00:11:09.854Z] [WARNING] Tests run: 3, Failures: 0, Errors: 0, Skipped: 2, Time
elapsed: 5.764 s - in org.apache.maven.surefire.its.jiras.Surefire806SpecifiedTestControlsIT
[2020-05-14T00:11:09.854Z] [INFO] Running org.apache.maven.surefire.its.jiras.Surefire809GroupExpressionsIT
[2020-05-14T00:11:50.264Z] [INFO] Tests run: 6, Failures: 0, Errors: 0, Skipped: 0, Time elapsed:
38.9 s - in org.apache.maven.surefire.its.jiras.Surefire809GroupExpressionsIT
[2020-05-14T00:11:50.264Z] [INFO] Running org.apache.maven.surefire.its.jiras.Surefire812Log4JClassLoaderIT
[2020-05-14T00:11:55.598Z] [INFO] Tests run: 1, Failures: 0, Errors: 0, Skipped: 0, Time elapsed:
6.453 s - in org.apache.maven.surefire.its.jiras.Surefire812Log4JClassLoaderIT
[2020-05-14T00:11:55.599Z] [INFO] Running org.apache.maven.surefire.its.jiras.Surefire817SystemExitIT
[2020-05-14T00:12:02.108Z] [INFO] Tests run: 1, Failures: 0, Errors: 0, Skipped: 0, Time elapsed:
6.977 s - in org.apache.maven.surefire.its.jiras.Surefire817SystemExitIT
[2020-05-14T00:12:02.108Z] [INFO] Running org.apache.maven.surefire.its.jiras.Surefire818NpeIgnoresTestsIT
[2020-05-14T00:12:09.970Z] [INFO] Tests run: 1, Failures: 0, Errors: 0, Skipped: 0, Time elapsed:
7.115 s - in org.apache.maven.surefire.its.jiras.Surefire818NpeIgnoresTestsIT
[2020-05-14T00:12:09.970Z] [INFO] Running org.apache.maven.surefire.its.jiras.Surefire828EmptyGroupExprIT
[2020-05-14T00:12:39.257Z] [INFO] Tests run: 4, Failures: 0, Errors: 0, Skipped: 0, Time elapsed:
26.906 s - in org.apache.maven.surefire.its.jiras.Surefire828EmptyGroupExprIT
[2020-05-14T00:12:39.257Z] [INFO] Running org.apache.maven.surefire.its.jiras.Surefire832ProviderSelectionIT
[2020-05-14T00:12:42.698Z] [INFO] Tests run: 1, Failures: 0, Errors: 0, Skipped: 0, Time elapsed:
6.596 s - in org.apache.maven.surefire.its.jiras.Surefire832ProviderSelectionIT
[2020-05-14T00:12:42.698Z] [INFO] Running org.apache.maven.surefire.its.jiras.Surefire839TestWithoutCategoriesIT
[2020-05-14T00:12:56.038Z] [INFO] Tests run: 2, Failures: 0, Errors: 0, Skipped: 0, Time elapsed:
13.61 s - in org.apache.maven.surefire.its.jiras.Surefire839TestWithoutCategoriesIT
[2020-05-14T00:12:56.038Z] [INFO] Running org.apache.maven.surefire.its.jiras.Surefire847AdditionalFailureIT
[2020-05-14T00:13:03.910Z] [INFO] Tests run: 1, Failures: 0, Errors: 0, Skipped: 0, Time elapsed:
7.728 s - in org.apache.maven.surefire.its.jiras.Surefire847AdditionalFailureIT
[2020-05-14T00:13:03.910Z] [INFO] Running org.apache.maven.surefire.its.jiras.Surefire855AllowFailsafeUseArtifactFileIT
[2020-05-14T00:13:59.783Z] [INFO] Tests run: 4, Failures: 0, Errors: 0, Skipped: 0, Time elapsed:
51.988 s - in org.apache.maven.surefire.its.jiras.Surefire855AllowFailsafeUseArtifactFileIT
[2020-05-14T00:13:59.783Z] [INFO] Running org.apache.maven.surefire.its.jiras.Surefire901MIssingResultfileWhenNoTestsIT
[2020-05-14T00:14:01.270Z] [INFO] Tests run: 1, Failures: 0, Errors: 0, Skipped: 0, Time elapsed:
5.514 s - in org.apache.maven.surefire.its.jiras.Surefire901MIssingResultfileWhenNoTestsIT
[2020-05-14T00:14:01.270Z] [INFO] Running org.apache.maven.surefire.its.jiras.Surefire907PerThreadWithoutThreadCountIT
[2020-05-14T00:14:06.560Z] [INFO] Tests run: 1, Failures: 0, Errors: 0, Skipped: 0, Time elapsed:
5.242 s - in org.apache.maven.surefire.its.jiras.Surefire907PerThreadWithoutThreadCountIT
[2020-05-14T00:14:06.560Z] [INFO] Running org.apache.maven.surefire.its.jiras.Surefire920TestFailureIgnoreWithTimeoutIT
[2020-05-14T00:14:22.254Z] [INFO] Tests run: 2, Failures: 0, Errors: 0, Skipped: 0, Time elapsed:
15.238 s - in org.apache.maven.surefire.its.jiras.Surefire920TestFailureIgnoreWithTimeoutIT
[2020-05-14T00:14:22.254Z] [INFO] Running org.apache.maven.surefire.its.jiras.Surefire926FailureWith2ProvidersIT
[2020-05-14T00:14:27.542Z] [INFO] Tests run: 1, Failures: 0, Errors: 0, Skipped: 0, Time elapsed:
5.406 s - in org.apache.maven.surefire.its.jiras.Surefire926FailureWith2ProvidersIT
[2020-05-14T00:14:27.542Z] [INFO] Running org.apache.maven.surefire.its.jiras.Surefire930TestNgSuiteXmlIT
[2020-05-14T00:14:35.401Z] [INFO] Tests run: 1, Failures: 0, Errors: 0, Skipped: 0, Time elapsed:
8.269 s - in org.apache.maven.surefire.its.jiras.Surefire930TestNgSuiteXmlIT
[2020-05-14T00:14:35.401Z] [INFO] Running org.apache.maven.surefire.its.jiras.Surefire943ReportContentIT
[2020-05-14T00:15:09.753Z] [INFO] Tests run: 2, Failures: 0, Errors: 0, Skipped: 0, Time elapsed:
29.625 s - in org.apache.maven.surefire.its.jiras.Surefire943ReportContentIT
[2020-05-14T00:15:09.753Z] [INFO] Running org.apache.maven.surefire.its.jiras.Surefire946KillMainProcessInReusableForkIT
[2020-05-14T00:17:12.717Z] [INFO] Tests run: 6, Failures: 0, Errors: 0, Skipped: 0, Time elapsed:
120.135 s - in org.apache.maven.surefire.its.jiras.Surefire946KillMainProcessInReusableForkIT
[2020-05-14T00:17:12.717Z] [INFO] Running org.apache.maven.surefire.its.jiras.Surefire972BizarreNoClassDefIT
[2020-05-14T00:17:15.976Z] [INFO] Tests run: 1, Failures: 0, Errors: 0, Skipped: 0, Time elapsed:
9.896 s - in org.apache.maven.surefire.its.jiras.Surefire972BizarreNoClassDefIT
[2020-05-14T00:17:15.976Z] [INFO] Running org.apache.maven.surefire.its.jiras.Surefire975DefaultVMEncodingIT
[2020-05-14T00:17:22.482Z] [INFO] Tests run: 1, Failures: 0, Errors: 0, Skipped: 0, Time elapsed:
6.628 s - in org.apache.maven.surefire.its.jiras.Surefire975DefaultVMEncodingIT
[2020-05-14T00:17:22.482Z] [INFO] Running org.apache.maven.surefire.its.jiras.Surefire979WrongClassLoaderIT
[2020-05-14T00:17:30.344Z] [INFO] Tests run: 1, Failures: 0, Errors: 0, Skipped: 0, Time elapsed:
7.661 s - in org.apache.maven.surefire.its.jiras.Surefire979WrongClassLoaderIT
[2020-05-14T00:17:30.344Z] [INFO] Running org.apache.maven.surefire.its.jiras.Surefire985ParameterizedRunnerAndCategoriesIT
[2020-05-14T00:17:36.844Z] [INFO] Tests run: 1, Failures: 0, Errors: 0, Skipped: 0, Time elapsed:
6.47 s - in org.apache.maven.surefire.its.jiras.Surefire985ParameterizedRunnerAndCategoriesIT
[2020-05-14T00:17:36.844Z] [INFO] Running org.apache.maven.surefire.its.jiras.Surefire995CategoryInheritanceIT
[2020-05-14T00:18:24.445Z] [INFO] Tests run: 7, Failures: 0, Errors: 0, Skipped: 0, Time elapsed:
45.53 s - in org.apache.maven.surefire.its.jiras.Surefire995CategoryInheritanceIT
[2020-05-14T00:18:24.445Z] [INFO] 
[2020-05-14T00:18:24.445Z] [INFO] Results:
[2020-05-14T00:18:24.445Z] [INFO] 
[2020-05-14T00:18:24.445Z] [ERROR] Errors: 
[2020-05-14T00:18:24.445Z] [ERROR]   Surefire1712ExtractedModulenameWithoutASMIT.test:47 »
SurefireVerifier org.apa...
[2020-05-14T00:18:24.445Z] [INFO] 
[2020-05-14T00:18:24.445Z] [ERROR] Tests run: 955, Failures: 0, Errors: 1, Skipped: 138
[2020-05-14T00:18:24.445Z] [INFO] 
[2020-05-14T00:18:24.445Z] [INFO] 
[2020-05-14T00:18:24.445Z] [INFO] --- maven-checkstyle-plugin:3.0.0:check (checkstyle-check)
@ surefire-its ---
[2020-05-14T00:18:24.445Z] [INFO] 
[2020-05-14T00:18:24.445Z] [INFO] --- maven-failsafe-plugin:3.0.0-M4:verify (default) @ surefire-its
---
[2020-05-14T00:18:24.445Z] [INFO] Failsafe report directory: /home/jenkins/jenkins-slave/workspace/box_maven-surefire_SUREFIRE-1570@2/surefire-its/target/failsafe-reports
[2020-05-14T00:18:24.445Z] [INFO] ------------------------------------------------------------------------
[2020-05-14T00:18:24.445Z] [INFO] Reactor Summary for Apache Maven Surefire 3.0.0-SNAPSHOT:
[2020-05-14T00:18:24.445Z] [INFO] 
[2020-05-14T00:18:24.445Z] [INFO] Apache Maven Surefire .............................. SUCCESS
[ 18.305 s]
[2020-05-14T00:18:24.445Z] [INFO] SureFire Logger API ................................ SUCCESS
[  9.969 s]
[2020-05-14T00:18:24.445Z] [INFO] SureFire API ....................................... SUCCESS
[ 18.686 s]
[2020-05-14T00:18:24.445Z] [INFO] Surefire Extensions API ............................ SUCCESS
[  7.109 s]
[2020-05-14T00:18:24.445Z] [INFO] Surefire Extensions SPI ............................ SUCCESS
[  2.521 s]
[2020-05-14T00:18:24.445Z] [INFO] SureFire Booter .................................... SUCCESS
[ 22.491 s]
[2020-05-14T00:18:24.445Z] [INFO] Maven Surefire Test-Grouping Support ............... SUCCESS
[  6.732 s]
[2020-05-14T00:18:24.445Z] [INFO] SureFire Providers ................................. SUCCESS
[  1.326 s]
[2020-05-14T00:18:24.445Z] [INFO] Shared JUnit3 Provider Code ........................ SUCCESS
[  4.621 s]
[2020-05-14T00:18:24.445Z] [INFO] Shared Java 5 Provider Base ........................ SUCCESS
[  5.576 s]
[2020-05-14T00:18:24.445Z] [INFO] Shared JUnit4 Provider Code ........................ SUCCESS
[  5.786 s]
[2020-05-14T00:18:24.445Z] [INFO] Shared JUnit48 Provider Code ....................... SUCCESS
[  9.489 s]
[2020-05-14T00:18:24.445Z] [INFO] SureFire JUnit Runner .............................. SUCCESS
[  5.263 s]
[2020-05-14T00:18:24.445Z] [INFO] SureFire JUnit4 Runner ............................. SUCCESS
[  5.017 s]
[2020-05-14T00:18:24.445Z] [INFO] Maven Surefire Common .............................. SUCCESS
[01:01 min]
[2020-05-14T00:18:24.445Z] [INFO] SureFire JUnitCore Runner .......................... SUCCESS
[02:25 min]
[2020-05-14T00:18:24.445Z] [INFO] SureFire JUnit Platform Runner ..................... SUCCESS
[ 13.548 s]
[2020-05-14T00:18:24.445Z] [INFO] SureFire TestNG Utils .............................. SUCCESS
[  5.176 s]
[2020-05-14T00:18:24.445Z] [INFO] SureFire TestNG Runner ............................. SUCCESS
[  7.851 s]
[2020-05-14T00:18:24.445Z] [INFO] ShadeFire JUnit3 Provider .......................... SUCCESS
[  3.250 s]
[2020-05-14T00:18:24.445Z] [INFO] Surefire Report Parser ............................. SUCCESS
[  6.837 s]
[2020-05-14T00:18:24.445Z] [INFO] Maven Surefire Plugin .............................. SUCCESS
[ 11.694 s]
[2020-05-14T00:18:24.445Z] [INFO] Maven Failsafe Plugin .............................. SUCCESS
[01:58 min]
[2020-05-14T00:18:24.445Z] [INFO] Maven Surefire Report Plugin ....................... SUCCESS
[ 34.474 s]
[2020-05-14T00:18:24.445Z] [INFO] Maven Surefire Integration Tests ................... FAILURE
[  01:42 h]
[2020-05-14T00:18:24.445Z] [INFO] Surefire Shared Utils .............................. SKIPPED
[2020-05-14T00:18:24.445Z] [INFO] ------------------------------------------------------------------------
[2020-05-14T00:18:24.445Z] [INFO] BUILD FAILURE
[2020-05-14T00:18:24.445Z] [INFO] ------------------------------------------------------------------------
[2020-05-14T00:18:24.445Z] [INFO] Total time:  01:51 h
[2020-05-14T00:18:24.445Z] [INFO] Finished at: 2020-05-14T00:18:23Z
[2020-05-14T00:18:24.445Z] [INFO] ------------------------------------------------------------------------
[2020-05-14T00:18:24.445Z] [ERROR] Failed to execute goal org.apache.maven.plugins:maven-failsafe-plugin:3.0.0-M4:verify
(default) on project surefire-its: There are test failures.
[2020-05-14T00:18:24.445Z] [ERROR] 
[2020-05-14T00:18:24.446Z] [ERROR] Please refer to /home/jenkins/jenkins-slave/workspace/box_maven-surefire_SUREFIRE-1570@2/surefire-its/target/failsafe-reports
for the individual test results.
[2020-05-14T00:18:24.446Z] [ERROR] Please refer to dump files (if any exist) [date].dump,
[date]-jvmRun[N].dump and [date].dumpstream.
[2020-05-14T00:18:24.446Z] [ERROR] -> [Help 1]
[2020-05-14T00:18:24.446Z] org.apache.maven.lifecycle.LifecycleExecutionException: Failed
to execute goal org.apache.maven.plugins:maven-failsafe-plugin:3.0.0-M4:verify (default) on
project surefire-its: There are test failures.
[2020-05-14T00:18:24.446Z] 
[2020-05-14T00:18:24.446Z] Please refer to /home/jenkins/jenkins-slave/workspace/box_maven-surefire_SUREFIRE-1570@2/surefire-its/target/failsafe-reports
for the individual test results.
[2020-05-14T00:18:24.446Z] Please refer to dump files (if any exist) [date].dump, [date]-jvmRun[N].dump
and [date].dumpstream.
[2020-05-14T00:18:24.446Z]     at org.apache.maven.lifecycle.internal.MojoExecutor.execute
(MojoExecutor.java:215)
[2020-05-14T00:18:24.446Z]     at org.apache.maven.lifecycle.internal.MojoExecutor.execute
(MojoExecutor.java:156)
[2020-05-14T00:18:24.446Z]     at org.apache.maven.lifecycle.internal.MojoExecutor.execute
(MojoExecutor.java:148)
[2020-05-14T00:18:24.446Z]     at org.apache.maven.lifecycle.internal.LifecycleModuleBuilder.buildProject
(LifecycleModuleBuilder.java:117)
[2020-05-14T00:18:24.446Z]     at org.apache.maven.lifecycle.internal.LifecycleModuleBuilder.buildProject
(LifecycleModuleBuilder.java:81)
[2020-05-14T00:18:24.446Z]     at org.apache.maven.lifecycle.internal.builder.singlethreaded.SingleThreadedBuilder.build
(SingleThreadedBuilder.java:56)
[2020-05-14T00:18:24.446Z]     at org.apache.maven.lifecycle.internal.LifecycleStarter.execute
(LifecycleStarter.java:128)
[2020-05-14T00:18:24.446Z]     at org.apache.maven.DefaultMaven.doExecute (DefaultMaven.java:305)
[2020-05-14T00:18:24.446Z]     at org.apache.maven.DefaultMaven.doExecute (DefaultMaven.java:192)
[2020-05-14T00:18:24.446Z]     at org.apache.maven.DefaultMaven.execute (DefaultMaven.java:105)
[2020-05-14T00:18:24.446Z]     at org.apache.maven.cli.MavenCli.execute (MavenCli.java:957)
[2020-05-14T00:18:24.446Z]     at org.apache.maven.cli.MavenCli.doMain (MavenCli.java:289)
[2020-05-14T00:18:24.446Z]     at org.apache.maven.cli.MavenCli.main (MavenCli.java:193)
[2020-05-14T00:18:24.446Z]     at sun.reflect.NativeMethodAccessorImpl.invoke0 (Native Method)
[2020-05-14T00:18:24.446Z]     at sun.reflect.NativeMethodAccessorImpl.invoke (NativeMethodAccessorImpl.java:62)
[2020-05-14T00:18:24.446Z]     at sun.reflect.DelegatingMethodAccessorImpl.invoke (DelegatingMethodAccessorImpl.java:43)
[2020-05-14T00:18:24.446Z]     at java.lang.reflect.Method.invoke (Method.java:498)
[2020-05-14T00:18:24.446Z]     at org.codehaus.plexus.classworlds.launcher.Launcher.launchEnhanced
(Launcher.java:282)
[2020-05-14T00:18:24.446Z]     at org.codehaus.plexus.classworlds.launcher.Launcher.launch
(Launcher.java:225)
[2020-05-14T00:18:24.446Z]     at org.codehaus.plexus.classworlds.launcher.Launcher.mainWithExitCode
(Launcher.java:406)
[2020-05-14T00:18:24.446Z]     at org.codehaus.plexus.classworlds.launcher.Launcher.main (Launcher.java:347)
[2020-05-14T00:18:24.446Z] Caused by: org.apache.maven.plugin.MojoFailureException: There
are test failures.
[2020-05-14T00:18:24.446Z] 
[2020-05-14T00:18:24.446Z] Please refer to /home/jenkins/jenkins-slave/workspace/box_maven-surefire_SUREFIRE-1570@2/surefire-its/target/failsafe-reports
for the individual test results.
[2020-05-14T00:18:24.446Z] Please refer to dump files (if any exist) [date].dump, [date]-jvmRun[N].dump
and [date].dumpstream.
[2020-05-14T00:18:24.446Z]     at org.apache.maven.plugin.surefire.SurefireHelper.throwException
(SurefireHelper.java:271)
[2020-05-14T00:18:24.446Z]     at org.apache.maven.plugin.surefire.SurefireHelper.reportExecution
(SurefireHelper.java:159)
[2020-05-14T00:18:24.446Z]     at org.apache.maven.plugin.failsafe.VerifyMojo.execute (VerifyMojo.java:192)
[2020-05-14T00:18:24.446Z]     at org.apache.maven.plugin.DefaultBuildPluginManager.executeMojo
(DefaultBuildPluginManager.java:137)
[2020-05-14T00:18:24.446Z]     at org.apache.maven.lifecycle.internal.MojoExecutor.execute
(MojoExecutor.java:210)
[2020-05-14T00:18:24.446Z]     at org.apache.maven.lifecycle.internal.MojoExecutor.execute
(MojoExecutor.java:156)
[2020-05-14T00:18:24.446Z]     at org.apache.maven.lifecycle.internal.MojoExecutor.execute
(MojoExecutor.java:148)
[2020-05-14T00:18:24.446Z]     at org.apache.maven.lifecycle.internal.LifecycleModuleBuilder.buildProject
(LifecycleModuleBuilder.java:117)
[2020-05-14T00:18:24.446Z]     at org.apache.maven.lifecycle.internal.LifecycleModuleBuilder.buildProject
(LifecycleModuleBuilder.java:81)
[2020-05-14T00:18:24.446Z]     at org.apache.maven.lifecycle.internal.builder.singlethreaded.SingleThreadedBuilder.build
(SingleThreadedBuilder.java:56)
[2020-05-14T00:18:24.446Z]     at org.apache.maven.lifecycle.internal.LifecycleStarter.execute
(LifecycleStarter.java:128)
[2020-05-14T00:18:24.446Z]     at org.apache.maven.DefaultMaven.doExecute (DefaultMaven.java:305)
[2020-05-14T00:18:24.446Z]     at org.apache.maven.DefaultMaven.doExecute (DefaultMaven.java:192)
[2020-05-14T00:18:24.446Z]     at org.apache.maven.DefaultMaven.execute (DefaultMaven.java:105)
[2020-05-14T00:18:24.446Z]     at org.apache.maven.cli.MavenCli.execute (MavenCli.java:957)
[2020-05-14T00:18:24.446Z]     at org.apache.maven.cli.MavenCli.doMain (MavenCli.java:289)
[2020-05-14T00:18:24.446Z]     at org.apache.maven.cli.MavenCli.main (MavenCli.java:193)
[2020-05-14T00:18:24.446Z]     at sun.reflect.NativeMethodAccessorImpl.invoke0 (Native Method)
[2020-05-14T00:18:24.446Z]     at sun.reflect.NativeMethodAccessorImpl.invoke (NativeMethodAccessorImpl.java:62)
[2020-05-14T00:18:24.446Z]     at sun.reflect.DelegatingMethodAccessorImpl.invoke (DelegatingMethodAccessorImpl.java:43)
[2020-05-14T00:18:24.446Z]     at java.lang.reflect.Method.invoke (Method.java:498)
[2020-05-14T00:18:24.446Z]     at org.codehaus.plexus.classworlds.launcher.Launcher.launchEnhanced
(Launcher.java:282)
[2020-05-14T00:18:24.447Z]     at org.codehaus.plexus.classworlds.launcher.Launcher.launch
(Launcher.java:225)
[2020-05-14T00:18:24.447Z]     at org.codehaus.plexus.classworlds.launcher.Launcher.mainWithExitCode
(Launcher.java:406)
[2020-05-14T00:18:24.447Z]     at org.codehaus.plexus.classworlds.launcher.Launcher.main (Launcher.java:347)
[2020-05-14T00:18:24.447Z] [ERROR] 
[2020-05-14T00:18:24.447Z] [ERROR] Re-run Maven using the -X switch to enable full debug logging.
[2020-05-14T00:18:24.447Z] [ERROR] 
[2020-05-14T00:18:24.447Z] [ERROR] For more information about the errors and possible solutions,
please read the following articles:
[2020-05-14T00:18:24.447Z] [ERROR] [Help 1] http://cwiki.apache.org/confluence/display/MAVEN/MojoFailureException
[2020-05-14T00:18:24.447Z] [ERROR] 
[2020-05-14T00:18:24.447Z] [ERROR] After correcting the problems, you can resume the build
with the command
[2020-05-14T00:18:24.447Z] [ERROR]   mvn <args> -rf :surefire-its
[Pipeline] }
[Pipeline] // withEnv
[Pipeline] }
[Pipeline] // stage
[Pipeline] openTasks
[2020-05-14T00:18:25.042Z] [TASKS] Skipping publisher since build result is FAILURE
[Pipeline] jacoco
[Pipeline] junit
[2020-05-14T00:18:25.405Z] Recording test results
[Pipeline] fileExists
[Pipeline] zip
[2020-05-14T00:18:29.186Z] Writing zip file of /home/jenkins/jenkins-slave/workspace/box_maven-surefire_SUREFIRE-1570@2/maven-failsafe-plugin/target/it
to /home/jenkins/jenkins-slave/workspace/box_maven-surefire_SUREFIRE-1570@2/maven-failsafe-plugin--linux-jdk15-maven3.6.x.zip
[2020-05-14T00:18:29.372Z] Zipped 78 entries.
[2020-05-14T00:18:29.372Z] Archiving /home/jenkins/jenkins-slave/workspace/box_maven-surefire_SUREFIRE-1570@2/maven-failsafe-plugin--linux-jdk15-maven3.6.x.zip
[2020-05-14T00:18:29.373Z] [Fast Archiver] No prior successful build to compare, so performing
full copy of artifacts
[Pipeline] fileExists
[Pipeline] zip
[2020-05-14T00:18:30.323Z] Writing zip file of /home/jenkins/jenkins-slave/workspace/box_maven-surefire_SUREFIRE-1570@2/surefire-its/target
to /home/jenkins/jenkins-slave/workspace/box_maven-surefire_SUREFIRE-1570@2/surefire-its--linux-jdk15-maven3.6.x.zip
[2020-05-14T00:18:53.907Z] Zipped 20119 entries.
[2020-05-14T00:18:53.907Z] Archiving /home/jenkins/jenkins-slave/workspace/box_maven-surefire_SUREFIRE-1570@2/surefire-its--linux-jdk15-maven3.6.x.zip
[2020-05-14T00:18:53.907Z] [Fast Archiver] No prior successful build to compare, so performing
full copy of artifacts
[Pipeline] archiveArtifacts
[2020-05-14T00:19:00.096Z] Archiving artifacts
[2020-05-14T00:19:00.255Z] [Fast Archiver] No prior successful build to compare, so performing
full copy of artifacts
[Pipeline] cleanWs
[2020-05-14T00:19:06.114Z] [WS-CLEANUP] Deleting project workspace...
[2020-05-14T00:19:06.114Z] [WS-CLEANUP] Deferred wipeout is used...
[2020-05-14T00:19:06.430Z] [WS-CLEANUP] done
[Pipeline] }
[Pipeline] // ws
[Pipeline] }
[Pipeline] // timestamps
[Pipeline] }
[Pipeline] // node
[Pipeline] }
[Pipeline] // parallel
[Pipeline] echo
Build result: FAILURE
[Pipeline] jiraIssueSelector
[Pipeline] echo
The authors of changes [tibordigana].
[Pipeline] echo
Sending email ...
[Pipeline] emailext
Mime
  • Unnamed multipart/mixed (inline, None, 0 bytes)
View raw message