maven-notifications mailing list archives

Site index · List index
Message view « Date » · « Thread »
Top « Date » · « Thread »
From Apache Jenkins Server <jenk...@builds.apache.org>
Subject Build failed in Jenkins: Maven TLP » maven-surefire » SUREFIRE-1570 #6
Date Sat, 16 May 2020 00:59:14 GMT
See https://builds.apache.org/job/maven-box/job/maven-surefire/job/SUREFIRE-1570/6/

Changes:

* unit tests

No tests ran.

Build log:
[...truncated 7913 lines...]
[2020-05-16T00:59:10.848Z] [INFO] Minimized 211 -> 180 (85%)
[2020-05-16T00:59:10.848Z] [INFO] Replacing original artifact with shaded artifact.
[2020-05-16T00:59:10.848Z] [INFO] Replacing C:\Windows\System32\config\systemprofile\AppData\Local\Temp\jenkins-maven-box-maven-surefire-SUREFIRE-1570-6@2\maven-surefire-common\target\maven-surefire-common-3.0.0-SNAPSHOT.jar
with C:\Windows\System32\config\systemprofile\AppData\Local\Temp\jenkins-maven-box-maven-surefire-SUREFIRE-1570-6@2\maven-surefire-common\target\maven-surefire-common-3.0.0-SNAPSHOT-shaded.jar
[2020-05-16T00:59:10.848Z] [INFO] Dependency-reduced POM written at: C:\Windows\System32\config\systemprofile\AppData\Local\Temp\jenkins-maven-box-maven-surefire-SUREFIRE-1570-6@2\maven-surefire-common\dependency-reduced-pom.xml
[2020-05-16T00:59:11.087Z] [INFO] 
[2020-05-16T00:59:11.087Z] [INFO] --- maven-checkstyle-plugin:3.0.0:check (checkstyle-check)
@ maven-surefire-common ---
[2020-05-16T00:59:11.141Z] [INFO] 
[2020-05-16T00:59:11.141Z] [INFO] --- maven-checkstyle-plugin:3.0.0:check (checkstyle-check)
@ maven-surefire-common ---
[2020-05-16T00:59:13.439Z] [INFO] There are 16 errors reported by Checkstyle 6.18 with config/maven_checks.xml
ruleset.
[2020-05-16T00:59:13.439Z] [ERROR] src\test\java\org\apache\maven\plugin\surefire\AbstractSurefireMojoTest.java:[256,59]
(coding) MagicNumber: '0xCA' is a magic number.
[2020-05-16T00:59:13.439Z] [ERROR] src\test\java\org\apache\maven\plugin\surefire\AbstractSurefireMojoTest.java:[256,72]
(coding) MagicNumber: '0xFE' is a magic number.
[2020-05-16T00:59:13.439Z] [ERROR] src\test\java\org\apache\maven\plugin\surefire\AbstractSurefireMojoTest.java:[256,85]
(coding) MagicNumber: '0xBA' is a magic number.
[2020-05-16T00:59:13.439Z] [ERROR] src\test\java\org\apache\maven\plugin\surefire\AbstractSurefireMojoTest.java:[256,98]
(coding) MagicNumber: '0xBE' is a magic number.
[2020-05-16T00:59:13.439Z] [INFO] Ignored 12 errors, 4 violations remaining.
[2020-05-16T00:59:13.439Z] [INFO] ------------------------------------------------------------------------
[2020-05-16T00:59:13.439Z] [INFO] Reactor Summary for Apache Maven Surefire 3.0.0-SNAPSHOT:
[2020-05-16T00:59:13.439Z] [INFO] 
[2020-05-16T00:59:13.439Z] [INFO] Apache Maven Surefire .............................. SUCCESS
[ 59.680 s]
[2020-05-16T00:59:13.439Z] [INFO] SureFire Logger API ................................ SUCCESS
[ 20.190 s]
[2020-05-16T00:59:13.439Z] [INFO] SureFire API ....................................... SUCCESS
[ 22.538 s]
[2020-05-16T00:59:13.439Z] [INFO] Surefire Extensions API ............................ SUCCESS
[  6.630 s]
[2020-05-16T00:59:13.439Z] [INFO] Surefire Extensions SPI ............................ SUCCESS
[  2.199 s]
[2020-05-16T00:59:13.439Z] [INFO] SureFire Booter .................................... SUCCESS
[ 23.420 s]
[2020-05-16T00:59:13.439Z] [INFO] Maven Surefire Test-Grouping Support ............... SUCCESS
[ 14.268 s]
[2020-05-16T00:59:13.439Z] [INFO] SureFire Providers ................................. SUCCESS
[  0.913 s]
[2020-05-16T00:59:13.439Z] [INFO] Shared JUnit3 Provider Code ........................ SUCCESS
[  4.095 s]
[2020-05-16T00:59:13.439Z] [INFO] Shared Java 5 Provider Base ........................ SUCCESS
[  5.597 s]
[2020-05-16T00:59:13.439Z] [INFO] Shared JUnit4 Provider Code ........................ SUCCESS
[  5.874 s]
[2020-05-16T00:59:13.439Z] [INFO] Shared JUnit48 Provider Code ....................... SUCCESS
[  9.627 s]
[2020-05-16T00:59:13.439Z] [INFO] SureFire JUnit Runner .............................. SUCCESS
[  4.693 s]
[2020-05-16T00:59:13.439Z] [INFO] SureFire JUnit4 Runner ............................. SUCCESS
[  4.955 s]
[2020-05-16T00:59:13.439Z] [INFO] Maven Surefire Common .............................. FAILURE
[ 59.243 s]
[2020-05-16T00:59:13.439Z] [INFO] SureFire JUnitCore Runner .......................... SKIPPED
[2020-05-16T00:59:13.439Z] [INFO] SureFire JUnit Platform Runner ..................... SKIPPED
[2020-05-16T00:59:13.439Z] [INFO] SureFire TestNG Utils .............................. SKIPPED
[2020-05-16T00:59:13.439Z] [INFO] SureFire TestNG Runner ............................. SKIPPED
[2020-05-16T00:59:13.439Z] [INFO] ShadeFire JUnit3 Provider .......................... SKIPPED
[2020-05-16T00:59:13.439Z] [INFO] Surefire Report Parser ............................. SKIPPED
[2020-05-16T00:59:13.439Z] [INFO] Maven Surefire Plugin .............................. SKIPPED
[2020-05-16T00:59:13.439Z] [INFO] Maven Failsafe Plugin .............................. SKIPPED
[2020-05-16T00:59:13.439Z] [INFO] Maven Surefire Report Plugin ....................... SKIPPED
[2020-05-16T00:59:13.439Z] [INFO] Maven Surefire Integration Tests ................... SKIPPED
[2020-05-16T00:59:13.439Z] [INFO] Surefire Shared Utils .............................. SKIPPED
[2020-05-16T00:59:13.439Z] [INFO] ------------------------------------------------------------------------
[2020-05-16T00:59:13.439Z] [INFO] BUILD FAILURE
[2020-05-16T00:59:13.439Z] [INFO] ------------------------------------------------------------------------
[2020-05-16T00:59:13.439Z] [INFO] Total time:  04:05 min
[2020-05-16T00:59:13.439Z] [INFO] Finished at: 2020-05-15T17:59:13-07:00
[2020-05-16T00:59:13.439Z] [INFO] ------------------------------------------------------------------------
[2020-05-16T00:59:13.439Z] [ERROR] Failed to execute goal org.apache.maven.plugins:maven-checkstyle-plugin:3.0.0:check
(checkstyle-check) on project maven-surefire-common: You have 4 Checkstyle violations. ->
[Help 1]
[2020-05-16T00:59:13.439Z] org.apache.maven.lifecycle.LifecycleExecutionException: Failed
to execute goal org.apache.maven.plugins:maven-checkstyle-plugin:3.0.0:check (checkstyle-check)
on project maven-surefire-common: You have 4 Checkstyle violations.
[2020-05-16T00:59:13.439Z]     at org.apache.maven.lifecycle.internal.MojoExecutor.execute
(MojoExecutor.java:215)
[2020-05-16T00:59:13.440Z]     at org.apache.maven.lifecycle.internal.MojoExecutor.execute
(MojoExecutor.java:156)
[2020-05-16T00:59:13.440Z]     at org.apache.maven.lifecycle.internal.MojoExecutor.execute
(MojoExecutor.java:148)
[2020-05-16T00:59:13.440Z]     at org.apache.maven.lifecycle.internal.LifecycleModuleBuilder.buildProject
(LifecycleModuleBuilder.java:117)
[2020-05-16T00:59:13.440Z]     at org.apache.maven.lifecycle.internal.LifecycleModuleBuilder.buildProject
(LifecycleModuleBuilder.java:81)
[2020-05-16T00:59:13.440Z]     at org.apache.maven.lifecycle.internal.builder.singlethreaded.SingleThreadedBuilder.build
(SingleThreadedBuilder.java:56)
[2020-05-16T00:59:13.440Z]     at org.apache.maven.lifecycle.internal.LifecycleStarter.execute
(LifecycleStarter.java:128)
[2020-05-16T00:59:13.440Z]     at org.apache.maven.DefaultMaven.doExecute (DefaultMaven.java:305)
[2020-05-16T00:59:13.440Z]     at org.apache.maven.DefaultMaven.doExecute (DefaultMaven.java:192)
[2020-05-16T00:59:13.440Z]     at org.apache.maven.DefaultMaven.execute (DefaultMaven.java:105)
[2020-05-16T00:59:13.440Z]     at org.apache.maven.cli.MavenCli.execute (MavenCli.java:956)
[2020-05-16T00:59:13.440Z]     at org.apache.maven.cli.MavenCli.doMain (MavenCli.java:288)
[2020-05-16T00:59:13.440Z]     at org.apache.maven.cli.MavenCli.main (MavenCli.java:192)
[2020-05-16T00:59:13.440Z]     at sun.reflect.NativeMethodAccessorImpl.invoke0 (Native Method)
[2020-05-16T00:59:13.440Z]     at sun.reflect.NativeMethodAccessorImpl.invoke (NativeMethodAccessorImpl.java:62)
[2020-05-16T00:59:13.440Z]     at sun.reflect.DelegatingMethodAccessorImpl.invoke (DelegatingMethodAccessorImpl.java:43)
[2020-05-16T00:59:13.440Z]     at java.lang.reflect.Method.invoke (Method.java:498)
[2020-05-16T00:59:13.440Z]     at org.codehaus.plexus.classworlds.launcher.Launcher.launchEnhanced
(Launcher.java:282)
[2020-05-16T00:59:13.440Z]     at org.codehaus.plexus.classworlds.launcher.Launcher.launch
(Launcher.java:225)
[2020-05-16T00:59:13.440Z]     at org.codehaus.plexus.classworlds.launcher.Launcher.mainWithExitCode
(Launcher.java:406)
[2020-05-16T00:59:13.440Z]     at org.codehaus.plexus.classworlds.launcher.Launcher.main (Launcher.java:347)
[2020-05-16T00:59:13.440Z] Caused by: org.apache.maven.plugin.MojoFailureException: You have
4 Checkstyle violations.
[2020-05-16T00:59:13.440Z]     at org.apache.maven.plugins.checkstyle.CheckstyleViolationCheckMojo.execute
(CheckstyleViolationCheckMojo.java:576)
[2020-05-16T00:59:13.440Z]     at org.apache.maven.plugin.DefaultBuildPluginManager.executeMojo
(DefaultBuildPluginManager.java:137)
[2020-05-16T00:59:13.440Z]     at org.apache.maven.lifecycle.internal.MojoExecutor.execute
(MojoExecutor.java:210)
[2020-05-16T00:59:13.440Z]     at org.apache.maven.lifecycle.internal.MojoExecutor.execute
(MojoExecutor.java:156)
[2020-05-16T00:59:13.440Z]     at org.apache.maven.lifecycle.internal.MojoExecutor.execute
(MojoExecutor.java:148)
[2020-05-16T00:59:13.440Z]     at org.apache.maven.lifecycle.internal.LifecycleModuleBuilder.buildProject
(LifecycleModuleBuilder.java:117)
[2020-05-16T00:59:13.440Z]     at org.apache.maven.lifecycle.internal.LifecycleModuleBuilder.buildProject
(LifecycleModuleBuilder.java:81)
[2020-05-16T00:59:13.440Z]     at org.apache.maven.lifecycle.internal.builder.singlethreaded.SingleThreadedBuilder.build
(SingleThreadedBuilder.java:56)
[2020-05-16T00:59:13.440Z]     at org.apache.maven.lifecycle.internal.LifecycleStarter.execute
(LifecycleStarter.java:128)
[2020-05-16T00:59:13.440Z]     at org.apache.maven.DefaultMaven.doExecute (DefaultMaven.java:305)
[2020-05-16T00:59:13.440Z]     at org.apache.maven.DefaultMaven.doExecute (DefaultMaven.java:192)
[2020-05-16T00:59:13.440Z]     at org.apache.maven.DefaultMaven.execute (DefaultMaven.java:105)
[2020-05-16T00:59:13.440Z]     at org.apache.maven.cli.MavenCli.execute (MavenCli.java:956)
[2020-05-16T00:59:13.440Z]     at org.apache.maven.cli.MavenCli.doMain (MavenCli.java:288)
[2020-05-16T00:59:13.440Z]     at org.apache.maven.cli.MavenCli.main (MavenCli.java:192)
[2020-05-16T00:59:13.440Z]     at sun.reflect.NativeMethodAccessorImpl.invoke0 (Native Method)
[2020-05-16T00:59:13.440Z]     at sun.reflect.NativeMethodAccessorImpl.invoke (NativeMethodAccessorImpl.java:62)
[2020-05-16T00:59:13.440Z]     at sun.reflect.DelegatingMethodAccessorImpl.invoke (DelegatingMethodAccessorImpl.java:43)
[2020-05-16T00:59:13.440Z]     at java.lang.reflect.Method.invoke (Method.java:498)
[2020-05-16T00:59:13.440Z]     at org.codehaus.plexus.classworlds.launcher.Launcher.launchEnhanced
(Launcher.java:282)
[2020-05-16T00:59:13.440Z]     at org.codehaus.plexus.classworlds.launcher.Launcher.launch
(Launcher.java:225)
[2020-05-16T00:59:13.440Z]     at org.codehaus.plexus.classworlds.launcher.Launcher.mainWithExitCode
(Launcher.java:406)
[2020-05-16T00:59:13.440Z]     at org.codehaus.plexus.classworlds.launcher.Launcher.main (Launcher.java:347)
[2020-05-16T00:59:13.440Z] [ERROR] 
[2020-05-16T00:59:13.440Z] [ERROR] Re-run Maven using the -X switch to enable full debug logging.
[2020-05-16T00:59:13.440Z] [ERROR] 
[2020-05-16T00:59:13.440Z] [ERROR] For more information about the errors and possible solutions,
please read the following articles:
[2020-05-16T00:59:13.440Z] [ERROR] [Help 1] http://cwiki.apache.org/confluence/display/MAVEN/MojoFailureException
[2020-05-16T00:59:13.440Z] [ERROR] 
[2020-05-16T00:59:13.440Z] [ERROR] After correcting the problems, you can resume the build
with the command
[2020-05-16T00:59:13.440Z] [ERROR]   mvn <args> -rf :maven-surefire-common
[2020-05-16T00:59:13.449Z] [INFO] There are 16 errors reported by Checkstyle 6.18 with config/maven_checks.xml
ruleset.
[2020-05-16T00:59:13.449Z] [ERROR] src\test\java\org\apache\maven\plugin\surefire\AbstractSurefireMojoTest.java:[256,59]
(coding) MagicNumber: '0xCA' is a magic number.
[2020-05-16T00:59:13.449Z] [ERROR] src\test\java\org\apache\maven\plugin\surefire\AbstractSurefireMojoTest.java:[256,72]
(coding) MagicNumber: '0xFE' is a magic number.
[2020-05-16T00:59:13.449Z] [ERROR] src\test\java\org\apache\maven\plugin\surefire\AbstractSurefireMojoTest.java:[256,85]
(coding) MagicNumber: '0xBA' is a magic number.
[2020-05-16T00:59:13.450Z] [ERROR] src\test\java\org\apache\maven\plugin\surefire\AbstractSurefireMojoTest.java:[256,98]
(coding) MagicNumber: '0xBE' is a magic number.
[2020-05-16T00:59:13.450Z] [INFO] Ignored 12 errors, 4 violations remaining.
[2020-05-16T00:59:13.450Z] [INFO] ------------------------------------------------------------------------
[2020-05-16T00:59:13.450Z] [INFO] Reactor Summary for Apache Maven Surefire 3.0.0-SNAPSHOT:
[2020-05-16T00:59:13.450Z] [INFO] 
[2020-05-16T00:59:13.450Z] [INFO] Apache Maven Surefire .............................. SUCCESS
[01:00 min]
[2020-05-16T00:59:13.450Z] [INFO] SureFire Logger API ................................ SUCCESS
[ 19.541 s]
[2020-05-16T00:59:13.450Z] [INFO] SureFire API ....................................... SUCCESS
[ 22.585 s]
[2020-05-16T00:59:13.450Z] [INFO] Surefire Extensions API ............................ SUCCESS
[  6.662 s]
[2020-05-16T00:59:13.450Z] [INFO] Surefire Extensions SPI ............................ SUCCESS
[  2.146 s]
[2020-05-16T00:59:13.450Z] [INFO] SureFire Booter .................................... SUCCESS
[ 23.708 s]
[2020-05-16T00:59:13.450Z] [INFO] Maven Surefire Test-Grouping Support ............... SUCCESS
[ 13.806 s]
[2020-05-16T00:59:13.450Z] [INFO] SureFire Providers ................................. SUCCESS
[  0.861 s]
[2020-05-16T00:59:13.450Z] [INFO] Shared JUnit3 Provider Code ........................ SUCCESS
[  4.315 s]
[2020-05-16T00:59:13.450Z] [INFO] Shared Java 5 Provider Base ........................ SUCCESS
[  5.350 s]
[2020-05-16T00:59:13.450Z] [INFO] Shared JUnit4 Provider Code ........................ SUCCESS
[  6.130 s]
[2020-05-16T00:59:13.450Z] [INFO] Shared JUnit48 Provider Code ....................... SUCCESS
[  9.270 s]
[2020-05-16T00:59:13.450Z] [INFO] SureFire JUnit Runner .............................. SUCCESS
[  4.912 s]
[2020-05-16T00:59:13.450Z] [INFO] SureFire JUnit4 Runner ............................. SUCCESS
[  4.931 s]
[2020-05-16T00:59:13.450Z] [INFO] Maven Surefire Common .............................. FAILURE
[ 59.500 s]
[2020-05-16T00:59:13.450Z] [INFO] SureFire JUnitCore Runner .......................... SKIPPED
[2020-05-16T00:59:13.450Z] [INFO] SureFire JUnit Platform Runner ..................... SKIPPED
[2020-05-16T00:59:13.450Z] [INFO] SureFire TestNG Utils .............................. SKIPPED
[2020-05-16T00:59:13.450Z] [INFO] SureFire TestNG Runner ............................. SKIPPED
[2020-05-16T00:59:13.450Z] [INFO] ShadeFire JUnit3 Provider .......................... SKIPPED
[2020-05-16T00:59:13.450Z] [INFO] Surefire Report Parser ............................. SKIPPED
[2020-05-16T00:59:13.450Z] [INFO] Maven Surefire Plugin .............................. SKIPPED
[2020-05-16T00:59:13.450Z] [INFO] Maven Failsafe Plugin .............................. SKIPPED
[2020-05-16T00:59:13.450Z] [INFO] Maven Surefire Report Plugin ....................... SKIPPED
[2020-05-16T00:59:13.450Z] [INFO] Maven Surefire Integration Tests ................... SKIPPED
[2020-05-16T00:59:13.450Z] [INFO] Surefire Shared Utils .............................. SKIPPED
[2020-05-16T00:59:13.450Z] [INFO] ------------------------------------------------------------------------
[2020-05-16T00:59:13.450Z] [INFO] BUILD FAILURE
[2020-05-16T00:59:13.450Z] [INFO] ------------------------------------------------------------------------
[2020-05-16T00:59:13.450Z] [INFO] Total time:  04:06 min
[2020-05-16T00:59:13.450Z] [INFO] Finished at: 2020-05-15T17:59:13-07:00
[2020-05-16T00:59:13.450Z] [INFO] ------------------------------------------------------------------------
[2020-05-16T00:59:13.450Z] [ERROR] Failed to execute goal org.apache.maven.plugins:maven-checkstyle-plugin:3.0.0:check
(checkstyle-check) on project maven-surefire-common: You have 4 Checkstyle violations. ->
[Help 1]
[2020-05-16T00:59:13.450Z] org.apache.maven.lifecycle.LifecycleExecutionException: Failed
to execute goal org.apache.maven.plugins:maven-checkstyle-plugin:3.0.0:check (checkstyle-check)
on project maven-surefire-common: You have 4 Checkstyle violations.
[2020-05-16T00:59:13.450Z]     at org.apache.maven.lifecycle.internal.MojoExecutor.execute
(MojoExecutor.java:215)
[2020-05-16T00:59:13.450Z]     at org.apache.maven.lifecycle.internal.MojoExecutor.execute
(MojoExecutor.java:156)
[2020-05-16T00:59:13.450Z]     at org.apache.maven.lifecycle.internal.MojoExecutor.execute
(MojoExecutor.java:148)
[2020-05-16T00:59:13.450Z]     at org.apache.maven.lifecycle.internal.LifecycleModuleBuilder.buildProject
(LifecycleModuleBuilder.java:117)
[2020-05-16T00:59:13.450Z]     at org.apache.maven.lifecycle.internal.LifecycleModuleBuilder.buildProject
(LifecycleModuleBuilder.java:81)
[2020-05-16T00:59:13.450Z]     at org.apache.maven.lifecycle.internal.builder.singlethreaded.SingleThreadedBuilder.build
(SingleThreadedBuilder.java:56)
[2020-05-16T00:59:13.450Z]     at org.apache.maven.lifecycle.internal.LifecycleStarter.execute
(LifecycleStarter.java:128)
[2020-05-16T00:59:13.450Z]     at org.apache.maven.DefaultMaven.doExecute (DefaultMaven.java:305)
[2020-05-16T00:59:13.450Z]     at org.apache.maven.DefaultMaven.doExecute (DefaultMaven.java:192)
[2020-05-16T00:59:13.450Z]     at org.apache.maven.DefaultMaven.execute (DefaultMaven.java:105)
[2020-05-16T00:59:13.450Z]     at org.apache.maven.cli.MavenCli.execute (MavenCli.java:956)
[2020-05-16T00:59:13.450Z]     at org.apache.maven.cli.MavenCli.doMain (MavenCli.java:288)
[2020-05-16T00:59:13.450Z]     at org.apache.maven.cli.MavenCli.main (MavenCli.java:192)
[2020-05-16T00:59:13.450Z]     at sun.reflect.NativeMethodAccessorImpl.invoke0 (Native Method)
[2020-05-16T00:59:13.450Z]     at sun.reflect.NativeMethodAccessorImpl.invoke (NativeMethodAccessorImpl.java:62)
[2020-05-16T00:59:13.450Z]     at sun.reflect.DelegatingMethodAccessorImpl.invoke (DelegatingMethodAccessorImpl.java:43)
[2020-05-16T00:59:13.450Z]     at java.lang.reflect.Method.invoke (Method.java:498)
[2020-05-16T00:59:13.450Z]     at org.codehaus.plexus.classworlds.launcher.Launcher.launchEnhanced
(Launcher.java:282)
[2020-05-16T00:59:13.450Z]     at org.codehaus.plexus.classworlds.launcher.Launcher.launch
(Launcher.java:225)
[2020-05-16T00:59:13.450Z]     at org.codehaus.plexus.classworlds.launcher.Launcher.mainWithExitCode
(Launcher.java:406)
[2020-05-16T00:59:13.450Z]     at org.codehaus.plexus.classworlds.launcher.Launcher.main (Launcher.java:347)
[2020-05-16T00:59:13.450Z] Caused by: org.apache.maven.plugin.MojoFailureException: You have
4 Checkstyle violations.
[2020-05-16T00:59:13.450Z]     at org.apache.maven.plugins.checkstyle.CheckstyleViolationCheckMojo.execute
(CheckstyleViolationCheckMojo.java:576)
[2020-05-16T00:59:13.450Z]     at org.apache.maven.plugin.DefaultBuildPluginManager.executeMojo
(DefaultBuildPluginManager.java:137)
[2020-05-16T00:59:13.450Z]     at org.apache.maven.lifecycle.internal.MojoExecutor.execute
(MojoExecutor.java:210)
[2020-05-16T00:59:13.450Z]     at org.apache.maven.lifecycle.internal.MojoExecutor.execute
(MojoExecutor.java:156)
[2020-05-16T00:59:13.450Z]     at org.apache.maven.lifecycle.internal.MojoExecutor.execute
(MojoExecutor.java:148)
[2020-05-16T00:59:13.450Z]     at org.apache.maven.lifecycle.internal.LifecycleModuleBuilder.buildProject
(LifecycleModuleBuilder.java:117)
[2020-05-16T00:59:13.450Z]     at org.apache.maven.lifecycle.internal.LifecycleModuleBuilder.buildProject
(LifecycleModuleBuilder.java:81)
[2020-05-16T00:59:13.450Z]     at org.apache.maven.lifecycle.internal.builder.singlethreaded.SingleThreadedBuilder.build
(SingleThreadedBuilder.java:56)
[2020-05-16T00:59:13.450Z]     at org.apache.maven.lifecycle.internal.LifecycleStarter.execute
(LifecycleStarter.java:128)
[2020-05-16T00:59:13.450Z]     at org.apache.maven.DefaultMaven.doExecute (DefaultMaven.java:305)
[2020-05-16T00:59:13.450Z]     at org.apache.maven.DefaultMaven.doExecute (DefaultMaven.java:192)
[2020-05-16T00:59:13.450Z]     at org.apache.maven.DefaultMaven.execute (DefaultMaven.java:105)
[2020-05-16T00:59:13.450Z]     at org.apache.maven.cli.MavenCli.execute (MavenCli.java:956)
[2020-05-16T00:59:13.450Z]     at org.apache.maven.cli.MavenCli.doMain (MavenCli.java:288)
[2020-05-16T00:59:13.450Z]     at org.apache.maven.cli.MavenCli.main (MavenCli.java:192)
[2020-05-16T00:59:13.450Z]     at sun.reflect.NativeMethodAccessorImpl.invoke0 (Native Method)
[2020-05-16T00:59:13.450Z]     at sun.reflect.NativeMethodAccessorImpl.invoke (NativeMethodAccessorImpl.java:62)
[2020-05-16T00:59:13.450Z]     at sun.reflect.DelegatingMethodAccessorImpl.invoke (DelegatingMethodAccessorImpl.java:43)
[2020-05-16T00:59:13.450Z]     at java.lang.reflect.Method.invoke (Method.java:498)
[2020-05-16T00:59:13.450Z]     at org.codehaus.plexus.classworlds.launcher.Launcher.launchEnhanced
(Launcher.java:282)
[2020-05-16T00:59:13.450Z]     at org.codehaus.plexus.classworlds.launcher.Launcher.launch
(Launcher.java:225)
[2020-05-16T00:59:13.450Z]     at org.codehaus.plexus.classworlds.launcher.Launcher.mainWithExitCode
(Launcher.java:406)
[2020-05-16T00:59:13.450Z]     at org.codehaus.plexus.classworlds.launcher.Launcher.main (Launcher.java:347)
[2020-05-16T00:59:13.450Z] [ERROR] 
[2020-05-16T00:59:13.450Z] [ERROR] Re-run Maven using the -X switch to enable full debug logging.
[2020-05-16T00:59:13.450Z] [ERROR] 
[2020-05-16T00:59:13.450Z] [ERROR] For more information about the errors and possible solutions,
please read the following articles:
[2020-05-16T00:59:13.450Z] [ERROR] [Help 1] http://cwiki.apache.org/confluence/display/MAVEN/MojoFailureException
[2020-05-16T00:59:13.450Z] [ERROR] 
[2020-05-16T00:59:13.450Z] [ERROR] After correcting the problems, you can resume the build
with the command
[2020-05-16T00:59:13.450Z] [ERROR]   mvn <args> -rf :maven-surefire-common
[Pipeline] }
[Pipeline] // withEnv
[Pipeline] }
[Pipeline] // stage
[Pipeline] fileExists
[Pipeline] fileExists
[Pipeline] archiveArtifacts
[2020-05-16T00:59:13.604Z] Archiving artifacts
[Pipeline] cleanWs
[2020-05-16T00:59:13.650Z] [WS-CLEANUP] Deleting project workspace...
[2020-05-16T00:59:13.650Z] [WS-CLEANUP] Deferred wipeout is used...
[2020-05-16T00:59:13.690Z] [WS-CLEANUP] done
[Pipeline] }
[Pipeline] // ws
[Pipeline] }
[Pipeline] }
[Pipeline] // timestamps
[Pipeline] // withEnv
[Pipeline] }
[Pipeline] }
[Pipeline] // node
[Pipeline] // stage
[Pipeline] }
[Pipeline] fileExists
[Pipeline] fileExists
[Pipeline] archiveArtifacts
[2020-05-16T00:59:14.075Z] Archiving artifacts
[Pipeline] cleanWs
[2020-05-16T00:59:14.162Z] [WS-CLEANUP] Deleting project workspace...
[2020-05-16T00:59:14.162Z] [WS-CLEANUP] Deferred wipeout is used...
[2020-05-16T00:59:14.231Z] [WS-CLEANUP] done
[Pipeline] }
[Pipeline] // ws
[Pipeline] }
[Pipeline] // timestamps
[Pipeline] }
[Pipeline] // node
[Pipeline] }
[Pipeline] // parallel
[Pipeline] echo
hudson.AbortException: hudson.AbortException: Error cloning remote repo 'origin'
[Pipeline] echo
Build result: FAILURE
[Pipeline] jiraIssueSelector
[Pipeline] echo
The authors of changes [tibordigana].
[Pipeline] echo
Sending email ...
[Pipeline] emailext
Mime
  • Unnamed multipart/mixed (inline, None, 0 bytes)
View raw message