maven-notifications mailing list archives

Site index · List index
Message view « Date » · « Thread »
Top « Date » · « Thread »
From Apache Jenkins Server <jenk...@builds.apache.org>
Subject Build failed in Jenkins: Maven TLP » maven-surefire » master #197
Date Sat, 02 May 2020 11:16:37 GMT
See https://builds.apache.org/job/maven-box/job/maven-surefire/job/master/197/

Changes:

* [SUREFIRE-1787] Support multiple runners (JUnit4, TestNG, other) and

7 tests failed.
FAILED:  org.apache.maven.plugin.surefire.AbstractSurefireMojoTest.shouldSmartlyResolveJUnit5ProviderWithJUnit4

Error Message:
null

Stack Trace:
java.lang.NullPointerException
	at org.apache.maven.plugin.surefire.AbstractSurefireMojo$JUnitPlatformProviderInfo.getProviderClasspath(AbstractSurefireMojo.java:3172)
	at org.apache.maven.plugin.surefire.AbstractSurefireMojoTest.shouldSmartlyResolveJUnit5ProviderWithJUnit4(AbstractSurefireMojoTest.java:701)
	at java.base/jdk.internal.reflect.NativeMethodAccessorImpl.invoke0(Native Method)
	at java.base/jdk.internal.reflect.NativeMethodAccessorImpl.invoke(NativeMethodAccessorImpl.java:62)
	at java.base/jdk.internal.reflect.DelegatingMethodAccessorImpl.invoke(DelegatingMethodAccessorImpl.java:43)
	at java.base/java.lang.reflect.Method.invoke(Method.java:564)
	at org.junit.internal.runners.TestMethod.invoke(TestMethod.java:68)
	at org.powermock.modules.junit4.internal.impl.PowerMockJUnit44RunnerDelegateImpl$PowerMockJUnit44MethodRunner.runTestMethod(PowerMockJUnit44RunnerDelegateImpl.java:326)
	at org.junit.internal.runners.MethodRoadie$2.run(MethodRoadie.java:89)
	at org.junit.internal.runners.MethodRoadie.runBeforesThenTestThenAfters(MethodRoadie.java:97)
	at org.powermock.modules.junit4.internal.impl.PowerMockJUnit44RunnerDelegateImpl$PowerMockJUnit44MethodRunner.executeTest(PowerMockJUnit44RunnerDelegateImpl.java:310)
	at org.powermock.modules.junit4.internal.impl.PowerMockJUnit47RunnerDelegateImpl$PowerMockJUnit47MethodRunner.executeTestInSuper(PowerMockJUnit47RunnerDelegateImpl.java:131)
	at org.powermock.modules.junit4.internal.impl.PowerMockJUnit47RunnerDelegateImpl$PowerMockJUnit47MethodRunner.access$100(PowerMockJUnit47RunnerDelegateImpl.java:59)
	at org.powermock.modules.junit4.internal.impl.PowerMockJUnit47RunnerDelegateImpl$PowerMockJUnit47MethodRunner$TestExecutorStatement.evaluate(PowerMockJUnit47RunnerDelegateImpl.java:147)
	at org.junit.rules.ExpectedException$ExpectedExceptionStatement.evaluate(ExpectedException.java:258)
	at org.powermock.modules.junit4.internal.impl.PowerMockJUnit47RunnerDelegateImpl$PowerMockJUnit47MethodRunner.evaluateStatement(PowerMockJUnit47RunnerDelegateImpl.java:107)
	at org.powermock.modules.junit4.internal.impl.PowerMockJUnit47RunnerDelegateImpl$PowerMockJUnit47MethodRunner.executeTest(PowerMockJUnit47RunnerDelegateImpl.java:82)
	at org.powermock.modules.junit4.internal.impl.PowerMockJUnit44RunnerDelegateImpl$PowerMockJUnit44MethodRunner.runBeforesThenTestThenAfters(PowerMockJUnit44RunnerDelegateImpl.java:298)
	at org.junit.internal.runners.MethodRoadie.runTest(MethodRoadie.java:87)
	at org.junit.internal.runners.MethodRoadie.run(MethodRoadie.java:50)
	at org.powermock.modules.junit4.internal.impl.PowerMockJUnit44RunnerDelegateImpl.invokeTestMethod(PowerMockJUnit44RunnerDelegateImpl.java:218)
	at org.powermock.modules.junit4.internal.impl.PowerMockJUnit44RunnerDelegateImpl.runMethods(PowerMockJUnit44RunnerDelegateImpl.java:160)
	at org.powermock.modules.junit4.internal.impl.PowerMockJUnit44RunnerDelegateImpl$1.run(PowerMockJUnit44RunnerDelegateImpl.java:134)
	at org.junit.internal.runners.ClassRoadie.runUnprotected(ClassRoadie.java:34)
	at org.junit.internal.runners.ClassRoadie.runProtected(ClassRoadie.java:44)
	at org.powermock.modules.junit4.internal.impl.PowerMockJUnit44RunnerDelegateImpl.run(PowerMockJUnit44RunnerDelegateImpl.java:136)
	at org.powermock.modules.junit4.common.internal.impl.JUnit4TestSuiteChunkerImpl.run(JUnit4TestSuiteChunkerImpl.java:117)
	at org.powermock.modules.junit4.common.internal.impl.AbstractCommonPowerMockRunner.run(AbstractCommonPowerMockRunner.java:57)
	at org.powermock.modules.junit4.PowerMockRunner.run(PowerMockRunner.java:59)
	at junit.framework.JUnit4TestAdapter.run(JUnit4TestAdapter.java:50)
	at junit.framework.TestSuite.runTest(TestSuite.java:241)
	at junit.framework.TestSuite.run(TestSuite.java:236)
	at java.base/jdk.internal.reflect.NativeMethodAccessorImpl.invoke0(Native Method)
	at java.base/jdk.internal.reflect.NativeMethodAccessorImpl.invoke(NativeMethodAccessorImpl.java:62)
	at java.base/jdk.internal.reflect.DelegatingMethodAccessorImpl.invoke(DelegatingMethodAccessorImpl.java:43)
	at java.base/java.lang.reflect.Method.invoke(Method.java:564)
	at org.apache.maven.shadefire.surefire.junit.JUnitTestSet.execute(JUnitTestSet.java:99)
	at org.apache.maven.shadefire.surefire.junit.JUnit3Provider.executeTestSet(JUnit3Provider.java:141)
	at org.apache.maven.shadefire.surefire.junit.JUnit3Provider.invoke(JUnit3Provider.java:114)
	at org.apache.maven.shadefire.surefire.booter.ForkedBooter.runSuitesInProcess(ForkedBooter.java:377)
	at org.apache.maven.shadefire.surefire.booter.ForkedBooter.execute(ForkedBooter.java:138)
	at org.apache.maven.shadefire.surefire.booter.ForkedBooter.run(ForkedBooter.java:465)
	at org.apache.maven.shadefire.surefire.booter.ForkedBooter.main(ForkedBooter.java:451)


FAILED:  org.apache.maven.plugin.surefire.AbstractSurefireMojoTest.shouldSmartlyResolveJUnit5ProviderWithVintage

Error Message:
null

Stack Trace:
java.lang.NullPointerException
	at org.apache.maven.plugin.surefire.AbstractSurefireMojo$JUnitPlatformProviderInfo.getProviderClasspath(AbstractSurefireMojo.java:3142)
	at org.apache.maven.plugin.surefire.AbstractSurefireMojoTest.shouldSmartlyResolveJUnit5ProviderWithVintage(AbstractSurefireMojoTest.java:860)
	at java.base/jdk.internal.reflect.NativeMethodAccessorImpl.invoke0(Native Method)
	at java.base/jdk.internal.reflect.NativeMethodAccessorImpl.invoke(NativeMethodAccessorImpl.java:62)
	at java.base/jdk.internal.reflect.DelegatingMethodAccessorImpl.invoke(DelegatingMethodAccessorImpl.java:43)
	at java.base/java.lang.reflect.Method.invoke(Method.java:564)
	at org.junit.internal.runners.TestMethod.invoke(TestMethod.java:68)
	at org.powermock.modules.junit4.internal.impl.PowerMockJUnit44RunnerDelegateImpl$PowerMockJUnit44MethodRunner.runTestMethod(PowerMockJUnit44RunnerDelegateImpl.java:326)
	at org.junit.internal.runners.MethodRoadie$2.run(MethodRoadie.java:89)
	at org.junit.internal.runners.MethodRoadie.runBeforesThenTestThenAfters(MethodRoadie.java:97)
	at org.powermock.modules.junit4.internal.impl.PowerMockJUnit44RunnerDelegateImpl$PowerMockJUnit44MethodRunner.executeTest(PowerMockJUnit44RunnerDelegateImpl.java:310)
	at org.powermock.modules.junit4.internal.impl.PowerMockJUnit47RunnerDelegateImpl$PowerMockJUnit47MethodRunner.executeTestInSuper(PowerMockJUnit47RunnerDelegateImpl.java:131)
	at org.powermock.modules.junit4.internal.impl.PowerMockJUnit47RunnerDelegateImpl$PowerMockJUnit47MethodRunner.access$100(PowerMockJUnit47RunnerDelegateImpl.java:59)
	at org.powermock.modules.junit4.internal.impl.PowerMockJUnit47RunnerDelegateImpl$PowerMockJUnit47MethodRunner$TestExecutorStatement.evaluate(PowerMockJUnit47RunnerDelegateImpl.java:147)
	at org.junit.rules.ExpectedException$ExpectedExceptionStatement.evaluate(ExpectedException.java:258)
	at org.powermock.modules.junit4.internal.impl.PowerMockJUnit47RunnerDelegateImpl$PowerMockJUnit47MethodRunner.evaluateStatement(PowerMockJUnit47RunnerDelegateImpl.java:107)
	at org.powermock.modules.junit4.internal.impl.PowerMockJUnit47RunnerDelegateImpl$PowerMockJUnit47MethodRunner.executeTest(PowerMockJUnit47RunnerDelegateImpl.java:82)
	at org.powermock.modules.junit4.internal.impl.PowerMockJUnit44RunnerDelegateImpl$PowerMockJUnit44MethodRunner.runBeforesThenTestThenAfters(PowerMockJUnit44RunnerDelegateImpl.java:298)
	at org.junit.internal.runners.MethodRoadie.runTest(MethodRoadie.java:87)
	at org.junit.internal.runners.MethodRoadie.run(MethodRoadie.java:50)
	at org.powermock.modules.junit4.internal.impl.PowerMockJUnit44RunnerDelegateImpl.invokeTestMethod(PowerMockJUnit44RunnerDelegateImpl.java:218)
	at org.powermock.modules.junit4.internal.impl.PowerMockJUnit44RunnerDelegateImpl.runMethods(PowerMockJUnit44RunnerDelegateImpl.java:160)
	at org.powermock.modules.junit4.internal.impl.PowerMockJUnit44RunnerDelegateImpl$1.run(PowerMockJUnit44RunnerDelegateImpl.java:134)
	at org.junit.internal.runners.ClassRoadie.runUnprotected(ClassRoadie.java:34)
	at org.junit.internal.runners.ClassRoadie.runProtected(ClassRoadie.java:44)
	at org.powermock.modules.junit4.internal.impl.PowerMockJUnit44RunnerDelegateImpl.run(PowerMockJUnit44RunnerDelegateImpl.java:136)
	at org.powermock.modules.junit4.common.internal.impl.JUnit4TestSuiteChunkerImpl.run(JUnit4TestSuiteChunkerImpl.java:117)
	at org.powermock.modules.junit4.common.internal.impl.AbstractCommonPowerMockRunner.run(AbstractCommonPowerMockRunner.java:57)
	at org.powermock.modules.junit4.PowerMockRunner.run(PowerMockRunner.java:59)
	at junit.framework.JUnit4TestAdapter.run(JUnit4TestAdapter.java:50)
	at junit.framework.TestSuite.runTest(TestSuite.java:241)
	at junit.framework.TestSuite.run(TestSuite.java:236)
	at java.base/jdk.internal.reflect.NativeMethodAccessorImpl.invoke0(Native Method)
	at java.base/jdk.internal.reflect.NativeMethodAccessorImpl.invoke(NativeMethodAccessorImpl.java:62)
	at java.base/jdk.internal.reflect.DelegatingMethodAccessorImpl.invoke(DelegatingMethodAccessorImpl.java:43)
	at java.base/java.lang.reflect.Method.invoke(Method.java:564)
	at org.apache.maven.shadefire.surefire.junit.JUnitTestSet.execute(JUnitTestSet.java:99)
	at org.apache.maven.shadefire.surefire.junit.JUnit3Provider.executeTestSet(JUnit3Provider.java:141)
	at org.apache.maven.shadefire.surefire.junit.JUnit3Provider.invoke(JUnit3Provider.java:114)
	at org.apache.maven.shadefire.surefire.booter.ForkedBooter.runSuitesInProcess(ForkedBooter.java:377)
	at org.apache.maven.shadefire.surefire.booter.ForkedBooter.execute(ForkedBooter.java:138)
	at org.apache.maven.shadefire.surefire.booter.ForkedBooter.run(ForkedBooter.java:465)
	at org.apache.maven.shadefire.surefire.booter.ForkedBooter.main(ForkedBooter.java:451)


FAILED:  org.apache.maven.plugin.surefire.AbstractSurefireMojoTest.shouldSmartlyResolveJUnit5ProviderWithJUnit5Commons

Error Message:
null

Stack Trace:
java.lang.AssertionError
	at org.junit.Assert.fail(Assert.java:87)
	at org.junit.Assert.fail(Assert.java:96)
	at org.apache.maven.plugin.surefire.AbstractSurefireMojoTest$7.answer(AbstractSurefireMojoTest.java:943)
	at org.apache.maven.plugin.surefire.AbstractSurefireMojoTest$7.answer(AbstractSurefireMojoTest.java:931)
	at org.mockito.internal.stubbing.StubbedInvocationMatcher.answer(StubbedInvocationMatcher.java:39)
	at org.mockito.internal.handler.MockHandlerImpl.handle(MockHandlerImpl.java:96)
	at org.mockito.internal.handler.NullResultGuardian.handle(NullResultGuardian.java:29)
	at org.mockito.internal.handler.InvocationNotifierHandler.handle(InvocationNotifierHandler.java:35)
	at org.mockito.internal.creation.bytebuddy.MockMethodInterceptor.doIntercept(MockMethodInterceptor.java:61)
	at org.mockito.internal.creation.bytebuddy.MockMethodInterceptor.doIntercept(MockMethodInterceptor.java:49)
	at org.mockito.internal.creation.bytebuddy.MockMethodInterceptor$DispatcherDefaultingToRealMethod.interceptAbstract(MockMethodInterceptor.java:126)
	at org.apache.maven.repository.RepositorySystem$MockitoMock$1652698771.resolve(Unknown Source)
	at org.apache.maven.plugin.surefire.SurefireDependencyResolver.resolveArtifact(SurefireDependencyResolver.java:194)
	at org.apache.maven.plugin.surefire.SurefireDependencyResolver.resolveProjectArtifact(SurefireDependencyResolver.java:180)
	at org.apache.maven.plugin.surefire.SurefireDependencyResolver.resolveProjectArtifact(SurefireDependencyResolver.java:170)
	at org.apache.maven.plugin.surefire.AbstractSurefireMojo$JUnitPlatformProviderInfo.resolve(AbstractSurefireMojo.java:3217)
	at org.apache.maven.plugin.surefire.AbstractSurefireMojo$JUnitPlatformProviderInfo.alignProviderVersions(AbstractSurefireMojo.java:3202)
	at org.apache.maven.plugin.surefire.AbstractSurefireMojo$JUnitPlatformProviderInfo.getProviderClasspath(AbstractSurefireMojo.java:3178)
	at org.apache.maven.plugin.surefire.AbstractSurefireMojoTest.shouldSmartlyResolveJUnit5ProviderWithJUnit5Commons(AbstractSurefireMojoTest.java:983)
	at java.base/jdk.internal.reflect.NativeMethodAccessorImpl.invoke0(Native Method)
	at java.base/jdk.internal.reflect.NativeMethodAccessorImpl.invoke(NativeMethodAccessorImpl.java:62)
	at java.base/jdk.internal.reflect.DelegatingMethodAccessorImpl.invoke(DelegatingMethodAccessorImpl.java:43)
	at java.base/java.lang.reflect.Method.invoke(Method.java:564)
	at org.junit.internal.runners.TestMethod.invoke(TestMethod.java:68)
	at org.powermock.modules.junit4.internal.impl.PowerMockJUnit44RunnerDelegateImpl$PowerMockJUnit44MethodRunner.runTestMethod(PowerMockJUnit44RunnerDelegateImpl.java:326)
	at org.junit.internal.runners.MethodRoadie$2.run(MethodRoadie.java:89)
	at org.junit.internal.runners.MethodRoadie.runBeforesThenTestThenAfters(MethodRoadie.java:97)
	at org.powermock.modules.junit4.internal.impl.PowerMockJUnit44RunnerDelegateImpl$PowerMockJUnit44MethodRunner.executeTest(PowerMockJUnit44RunnerDelegateImpl.java:310)
	at org.powermock.modules.junit4.internal.impl.PowerMockJUnit47RunnerDelegateImpl$PowerMockJUnit47MethodRunner.executeTestInSuper(PowerMockJUnit47RunnerDelegateImpl.java:131)
	at org.powermock.modules.junit4.internal.impl.PowerMockJUnit47RunnerDelegateImpl$PowerMockJUnit47MethodRunner.access$100(PowerMockJUnit47RunnerDelegateImpl.java:59)
	at org.powermock.modules.junit4.internal.impl.PowerMockJUnit47RunnerDelegateImpl$PowerMockJUnit47MethodRunner$TestExecutorStatement.evaluate(PowerMockJUnit47RunnerDelegateImpl.java:147)
	at org.junit.rules.ExpectedException$ExpectedExceptionStatement.evaluate(ExpectedException.java:258)
	at org.powermock.modules.junit4.internal.impl.PowerMockJUnit47RunnerDelegateImpl$PowerMockJUnit47MethodRunner.evaluateStatement(PowerMockJUnit47RunnerDelegateImpl.java:107)
	at org.powermock.modules.junit4.internal.impl.PowerMockJUnit47RunnerDelegateImpl$PowerMockJUnit47MethodRunner.executeTest(PowerMockJUnit47RunnerDelegateImpl.java:82)
	at org.powermock.modules.junit4.internal.impl.PowerMockJUnit44RunnerDelegateImpl$PowerMockJUnit44MethodRunner.runBeforesThenTestThenAfters(PowerMockJUnit44RunnerDelegateImpl.java:298)
	at org.junit.internal.runners.MethodRoadie.runTest(MethodRoadie.java:87)
	at org.junit.internal.runners.MethodRoadie.run(MethodRoadie.java:50)
	at org.powermock.modules.junit4.internal.impl.PowerMockJUnit44RunnerDelegateImpl.invokeTestMethod(PowerMockJUnit44RunnerDelegateImpl.java:218)
	at org.powermock.modules.junit4.internal.impl.PowerMockJUnit44RunnerDelegateImpl.runMethods(PowerMockJUnit44RunnerDelegateImpl.java:160)
	at org.powermock.modules.junit4.internal.impl.PowerMockJUnit44RunnerDelegateImpl$1.run(PowerMockJUnit44RunnerDelegateImpl.java:134)
	at org.junit.internal.runners.ClassRoadie.runUnprotected(ClassRoadie.java:34)
	at org.junit.internal.runners.ClassRoadie.runProtected(ClassRoadie.java:44)
	at org.powermock.modules.junit4.internal.impl.PowerMockJUnit44RunnerDelegateImpl.run(PowerMockJUnit44RunnerDelegateImpl.java:136)
	at org.powermock.modules.junit4.common.internal.impl.JUnit4TestSuiteChunkerImpl.run(JUnit4TestSuiteChunkerImpl.java:117)
	at org.powermock.modules.junit4.common.internal.impl.AbstractCommonPowerMockRunner.run(AbstractCommonPowerMockRunner.java:57)
	at org.powermock.modules.junit4.PowerMockRunner.run(PowerMockRunner.java:59)
	at junit.framework.JUnit4TestAdapter.run(JUnit4TestAdapter.java:50)
	at junit.framework.TestSuite.runTest(TestSuite.java:241)
	at junit.framework.TestSuite.run(TestSuite.java:236)
	at java.base/jdk.internal.reflect.NativeMethodAccessorImpl.invoke0(Native Method)
	at java.base/jdk.internal.reflect.NativeMethodAccessorImpl.invoke(NativeMethodAccessorImpl.java:62)
	at java.base/jdk.internal.reflect.DelegatingMethodAccessorImpl.invoke(DelegatingMethodAccessorImpl.java:43)
	at java.base/java.lang.reflect.Method.invoke(Method.java:564)
	at org.apache.maven.shadefire.surefire.junit.JUnitTestSet.execute(JUnitTestSet.java:99)
	at org.apache.maven.shadefire.surefire.junit.JUnit3Provider.executeTestSet(JUnit3Provider.java:141)
	at org.apache.maven.shadefire.surefire.junit.JUnit3Provider.invoke(JUnit3Provider.java:114)
	at org.apache.maven.shadefire.surefire.booter.ForkedBooter.runSuitesInProcess(ForkedBooter.java:377)
	at org.apache.maven.shadefire.surefire.booter.ForkedBooter.execute(ForkedBooter.java:138)
	at org.apache.maven.shadefire.surefire.booter.ForkedBooter.run(ForkedBooter.java:465)
	at org.apache.maven.shadefire.surefire.booter.ForkedBooter.main(ForkedBooter.java:451)


FAILED:  org.apache.maven.plugin.surefire.AbstractSurefireMojoTest.shouldSmartlyResolveJUnit5ProviderWithJUnit5Engine

Error Message:
null

Stack Trace:
java.lang.NullPointerException
	at org.apache.maven.plugin.surefire.AbstractSurefireMojo$JUnitPlatformProviderInfo.getProviderClasspath(AbstractSurefireMojo.java:3142)
	at org.apache.maven.plugin.surefire.AbstractSurefireMojoTest.shouldSmartlyResolveJUnit5ProviderWithJUnit5Engine(AbstractSurefireMojoTest.java:1102)
	at java.base/jdk.internal.reflect.NativeMethodAccessorImpl.invoke0(Native Method)
	at java.base/jdk.internal.reflect.NativeMethodAccessorImpl.invoke(NativeMethodAccessorImpl.java:62)
	at java.base/jdk.internal.reflect.DelegatingMethodAccessorImpl.invoke(DelegatingMethodAccessorImpl.java:43)
	at java.base/java.lang.reflect.Method.invoke(Method.java:564)
	at org.junit.internal.runners.TestMethod.invoke(TestMethod.java:68)
	at org.powermock.modules.junit4.internal.impl.PowerMockJUnit44RunnerDelegateImpl$PowerMockJUnit44MethodRunner.runTestMethod(PowerMockJUnit44RunnerDelegateImpl.java:326)
	at org.junit.internal.runners.MethodRoadie$2.run(MethodRoadie.java:89)
	at org.junit.internal.runners.MethodRoadie.runBeforesThenTestThenAfters(MethodRoadie.java:97)
	at org.powermock.modules.junit4.internal.impl.PowerMockJUnit44RunnerDelegateImpl$PowerMockJUnit44MethodRunner.executeTest(PowerMockJUnit44RunnerDelegateImpl.java:310)
	at org.powermock.modules.junit4.internal.impl.PowerMockJUnit47RunnerDelegateImpl$PowerMockJUnit47MethodRunner.executeTestInSuper(PowerMockJUnit47RunnerDelegateImpl.java:131)
	at org.powermock.modules.junit4.internal.impl.PowerMockJUnit47RunnerDelegateImpl$PowerMockJUnit47MethodRunner.access$100(PowerMockJUnit47RunnerDelegateImpl.java:59)
	at org.powermock.modules.junit4.internal.impl.PowerMockJUnit47RunnerDelegateImpl$PowerMockJUnit47MethodRunner$TestExecutorStatement.evaluate(PowerMockJUnit47RunnerDelegateImpl.java:147)
	at org.junit.rules.ExpectedException$ExpectedExceptionStatement.evaluate(ExpectedException.java:258)
	at org.powermock.modules.junit4.internal.impl.PowerMockJUnit47RunnerDelegateImpl$PowerMockJUnit47MethodRunner.evaluateStatement(PowerMockJUnit47RunnerDelegateImpl.java:107)
	at org.powermock.modules.junit4.internal.impl.PowerMockJUnit47RunnerDelegateImpl$PowerMockJUnit47MethodRunner.executeTest(PowerMockJUnit47RunnerDelegateImpl.java:82)
	at org.powermock.modules.junit4.internal.impl.PowerMockJUnit44RunnerDelegateImpl$PowerMockJUnit44MethodRunner.runBeforesThenTestThenAfters(PowerMockJUnit44RunnerDelegateImpl.java:298)
	at org.junit.internal.runners.MethodRoadie.runTest(MethodRoadie.java:87)
	at org.junit.internal.runners.MethodRoadie.run(MethodRoadie.java:50)
	at org.powermock.modules.junit4.internal.impl.PowerMockJUnit44RunnerDelegateImpl.invokeTestMethod(PowerMockJUnit44RunnerDelegateImpl.java:218)
	at org.powermock.modules.junit4.internal.impl.PowerMockJUnit44RunnerDelegateImpl.runMethods(PowerMockJUnit44RunnerDelegateImpl.java:160)
	at org.powermock.modules.junit4.internal.impl.PowerMockJUnit44RunnerDelegateImpl$1.run(PowerMockJUnit44RunnerDelegateImpl.java:134)
	at org.junit.internal.runners.ClassRoadie.runUnprotected(ClassRoadie.java:34)
	at org.junit.internal.runners.ClassRoadie.runProtected(ClassRoadie.java:44)
	at org.powermock.modules.junit4.internal.impl.PowerMockJUnit44RunnerDelegateImpl.run(PowerMockJUnit44RunnerDelegateImpl.java:136)
	at org.powermock.modules.junit4.common.internal.impl.JUnit4TestSuiteChunkerImpl.run(JUnit4TestSuiteChunkerImpl.java:117)
	at org.powermock.modules.junit4.common.internal.impl.AbstractCommonPowerMockRunner.run(AbstractCommonPowerMockRunner.java:57)
	at org.powermock.modules.junit4.PowerMockRunner.run(PowerMockRunner.java:59)
	at junit.framework.JUnit4TestAdapter.run(JUnit4TestAdapter.java:50)
	at junit.framework.TestSuite.runTest(TestSuite.java:241)
	at junit.framework.TestSuite.run(TestSuite.java:236)
	at java.base/jdk.internal.reflect.NativeMethodAccessorImpl.invoke0(Native Method)
	at java.base/jdk.internal.reflect.NativeMethodAccessorImpl.invoke(NativeMethodAccessorImpl.java:62)
	at java.base/jdk.internal.reflect.DelegatingMethodAccessorImpl.invoke(DelegatingMethodAccessorImpl.java:43)
	at java.base/java.lang.reflect.Method.invoke(Method.java:564)
	at org.apache.maven.shadefire.surefire.junit.JUnitTestSet.execute(JUnitTestSet.java:99)
	at org.apache.maven.shadefire.surefire.junit.JUnit3Provider.executeTestSet(JUnit3Provider.java:141)
	at org.apache.maven.shadefire.surefire.junit.JUnit3Provider.invoke(JUnit3Provider.java:114)
	at org.apache.maven.shadefire.surefire.booter.ForkedBooter.runSuitesInProcess(ForkedBooter.java:377)
	at org.apache.maven.shadefire.surefire.booter.ForkedBooter.execute(ForkedBooter.java:138)
	at org.apache.maven.shadefire.surefire.booter.ForkedBooter.run(ForkedBooter.java:465)
	at org.apache.maven.shadefire.surefire.booter.ForkedBooter.main(ForkedBooter.java:451)


FAILED:  org.apache.maven.plugin.surefire.AbstractSurefireMojoTest.shouldSmartlyResolveJUnit5ProviderWithJupiterApi

Error Message:
null

Stack Trace:
java.lang.AssertionError
	at org.junit.Assert.fail(Assert.java:87)
	at org.junit.Assert.fail(Assert.java:96)
	at org.apache.maven.plugin.surefire.AbstractSurefireMojoTest$12.answer(AbstractSurefireMojoTest.java:1211)
	at org.apache.maven.plugin.surefire.AbstractSurefireMojoTest$12.answer(AbstractSurefireMojoTest.java:1182)
	at org.mockito.internal.stubbing.StubbedInvocationMatcher.answer(StubbedInvocationMatcher.java:39)
	at org.mockito.internal.handler.MockHandlerImpl.handle(MockHandlerImpl.java:96)
	at org.mockito.internal.handler.NullResultGuardian.handle(NullResultGuardian.java:29)
	at org.mockito.internal.handler.InvocationNotifierHandler.handle(InvocationNotifierHandler.java:35)
	at org.mockito.internal.creation.bytebuddy.MockMethodInterceptor.doIntercept(MockMethodInterceptor.java:61)
	at org.mockito.internal.creation.bytebuddy.MockMethodInterceptor.doIntercept(MockMethodInterceptor.java:49)
	at org.mockito.internal.creation.bytebuddy.MockMethodInterceptor$DispatcherDefaultingToRealMethod.interceptAbstract(MockMethodInterceptor.java:126)
	at org.apache.maven.repository.RepositorySystem$MockitoMock$1652698771.resolve(Unknown Source)
	at org.apache.maven.plugin.surefire.SurefireDependencyResolver.resolveArtifact(SurefireDependencyResolver.java:194)
	at org.apache.maven.plugin.surefire.SurefireDependencyResolver.resolveProjectArtifact(SurefireDependencyResolver.java:180)
	at org.apache.maven.plugin.surefire.SurefireDependencyResolver.resolveProjectArtifact(SurefireDependencyResolver.java:170)
	at org.apache.maven.plugin.surefire.AbstractSurefireMojo$JUnitPlatformProviderInfo.resolve(AbstractSurefireMojo.java:3217)
	at org.apache.maven.plugin.surefire.AbstractSurefireMojo$JUnitPlatformProviderInfo.alignProviderVersions(AbstractSurefireMojo.java:3202)
	at org.apache.maven.plugin.surefire.AbstractSurefireMojo$JUnitPlatformProviderInfo.getProviderClasspath(AbstractSurefireMojo.java:3178)
	at org.apache.maven.plugin.surefire.AbstractSurefireMojoTest.shouldSmartlyResolveJUnit5ProviderWithJupiterApi(AbstractSurefireMojoTest.java:1251)
	at java.base/jdk.internal.reflect.NativeMethodAccessorImpl.invoke0(Native Method)
	at java.base/jdk.internal.reflect.NativeMethodAccessorImpl.invoke(NativeMethodAccessorImpl.java:62)
	at java.base/jdk.internal.reflect.DelegatingMethodAccessorImpl.invoke(DelegatingMethodAccessorImpl.java:43)
	at java.base/java.lang.reflect.Method.invoke(Method.java:564)
	at org.junit.internal.runners.TestMethod.invoke(TestMethod.java:68)
	at org.powermock.modules.junit4.internal.impl.PowerMockJUnit44RunnerDelegateImpl$PowerMockJUnit44MethodRunner.runTestMethod(PowerMockJUnit44RunnerDelegateImpl.java:326)
	at org.junit.internal.runners.MethodRoadie$2.run(MethodRoadie.java:89)
	at org.junit.internal.runners.MethodRoadie.runBeforesThenTestThenAfters(MethodRoadie.java:97)
	at org.powermock.modules.junit4.internal.impl.PowerMockJUnit44RunnerDelegateImpl$PowerMockJUnit44MethodRunner.executeTest(PowerMockJUnit44RunnerDelegateImpl.java:310)
	at org.powermock.modules.junit4.internal.impl.PowerMockJUnit47RunnerDelegateImpl$PowerMockJUnit47MethodRunner.executeTestInSuper(PowerMockJUnit47RunnerDelegateImpl.java:131)
	at org.powermock.modules.junit4.internal.impl.PowerMockJUnit47RunnerDelegateImpl$PowerMockJUnit47MethodRunner.access$100(PowerMockJUnit47RunnerDelegateImpl.java:59)
	at org.powermock.modules.junit4.internal.impl.PowerMockJUnit47RunnerDelegateImpl$PowerMockJUnit47MethodRunner$TestExecutorStatement.evaluate(PowerMockJUnit47RunnerDelegateImpl.java:147)
	at org.junit.rules.ExpectedException$ExpectedExceptionStatement.evaluate(ExpectedException.java:258)
	at org.powermock.modules.junit4.internal.impl.PowerMockJUnit47RunnerDelegateImpl$PowerMockJUnit47MethodRunner.evaluateStatement(PowerMockJUnit47RunnerDelegateImpl.java:107)
	at org.powermock.modules.junit4.internal.impl.PowerMockJUnit47RunnerDelegateImpl$PowerMockJUnit47MethodRunner.executeTest(PowerMockJUnit47RunnerDelegateImpl.java:82)
	at org.powermock.modules.junit4.internal.impl.PowerMockJUnit44RunnerDelegateImpl$PowerMockJUnit44MethodRunner.runBeforesThenTestThenAfters(PowerMockJUnit44RunnerDelegateImpl.java:298)
	at org.junit.internal.runners.MethodRoadie.runTest(MethodRoadie.java:87)
	at org.junit.internal.runners.MethodRoadie.run(MethodRoadie.java:50)
	at org.powermock.modules.junit4.internal.impl.PowerMockJUnit44RunnerDelegateImpl.invokeTestMethod(PowerMockJUnit44RunnerDelegateImpl.java:218)
	at org.powermock.modules.junit4.internal.impl.PowerMockJUnit44RunnerDelegateImpl.runMethods(PowerMockJUnit44RunnerDelegateImpl.java:160)
	at org.powermock.modules.junit4.internal.impl.PowerMockJUnit44RunnerDelegateImpl$1.run(PowerMockJUnit44RunnerDelegateImpl.java:134)
	at org.junit.internal.runners.ClassRoadie.runUnprotected(ClassRoadie.java:34)
	at org.junit.internal.runners.ClassRoadie.runProtected(ClassRoadie.java:44)
	at org.powermock.modules.junit4.internal.impl.PowerMockJUnit44RunnerDelegateImpl.run(PowerMockJUnit44RunnerDelegateImpl.java:136)
	at org.powermock.modules.junit4.common.internal.impl.JUnit4TestSuiteChunkerImpl.run(JUnit4TestSuiteChunkerImpl.java:117)
	at org.powermock.modules.junit4.common.internal.impl.AbstractCommonPowerMockRunner.run(AbstractCommonPowerMockRunner.java:57)
	at org.powermock.modules.junit4.PowerMockRunner.run(PowerMockRunner.java:59)
	at junit.framework.JUnit4TestAdapter.run(JUnit4TestAdapter.java:50)
	at junit.framework.TestSuite.runTest(TestSuite.java:241)
	at junit.framework.TestSuite.run(TestSuite.java:236)
	at java.base/jdk.internal.reflect.NativeMethodAccessorImpl.invoke0(Native Method)
	at java.base/jdk.internal.reflect.NativeMethodAccessorImpl.invoke(NativeMethodAccessorImpl.java:62)
	at java.base/jdk.internal.reflect.DelegatingMethodAccessorImpl.invoke(DelegatingMethodAccessorImpl.java:43)
	at java.base/java.lang.reflect.Method.invoke(Method.java:564)
	at org.apache.maven.shadefire.surefire.junit.JUnitTestSet.execute(JUnitTestSet.java:99)
	at org.apache.maven.shadefire.surefire.junit.JUnit3Provider.executeTestSet(JUnit3Provider.java:141)
	at org.apache.maven.shadefire.surefire.junit.JUnit3Provider.invoke(JUnit3Provider.java:114)
	at org.apache.maven.shadefire.surefire.booter.ForkedBooter.runSuitesInProcess(ForkedBooter.java:377)
	at org.apache.maven.shadefire.surefire.booter.ForkedBooter.execute(ForkedBooter.java:138)
	at org.apache.maven.shadefire.surefire.booter.ForkedBooter.run(ForkedBooter.java:465)
	at org.apache.maven.shadefire.surefire.booter.ForkedBooter.main(ForkedBooter.java:451)


FAILED:  org.apache.maven.plugin.surefire.AbstractSurefireMojoTest.shouldSmartlyResolveJUnit5ProviderWithJupiterEngine

Error Message:
null

Stack Trace:
java.lang.NullPointerException
	at org.apache.maven.plugin.surefire.AbstractSurefireMojo$JUnitPlatformProviderInfo.getProviderClasspath(AbstractSurefireMojo.java:3142)
	at org.apache.maven.plugin.surefire.AbstractSurefireMojoTest.shouldSmartlyResolveJUnit5ProviderWithJupiterEngine(AbstractSurefireMojoTest.java:1383)
	at java.base/jdk.internal.reflect.NativeMethodAccessorImpl.invoke0(Native Method)
	at java.base/jdk.internal.reflect.NativeMethodAccessorImpl.invoke(NativeMethodAccessorImpl.java:62)
	at java.base/jdk.internal.reflect.DelegatingMethodAccessorImpl.invoke(DelegatingMethodAccessorImpl.java:43)
	at java.base/java.lang.reflect.Method.invoke(Method.java:564)
	at org.junit.internal.runners.TestMethod.invoke(TestMethod.java:68)
	at org.powermock.modules.junit4.internal.impl.PowerMockJUnit44RunnerDelegateImpl$PowerMockJUnit44MethodRunner.runTestMethod(PowerMockJUnit44RunnerDelegateImpl.java:326)
	at org.junit.internal.runners.MethodRoadie$2.run(MethodRoadie.java:89)
	at org.junit.internal.runners.MethodRoadie.runBeforesThenTestThenAfters(MethodRoadie.java:97)
	at org.powermock.modules.junit4.internal.impl.PowerMockJUnit44RunnerDelegateImpl$PowerMockJUnit44MethodRunner.executeTest(PowerMockJUnit44RunnerDelegateImpl.java:310)
	at org.powermock.modules.junit4.internal.impl.PowerMockJUnit47RunnerDelegateImpl$PowerMockJUnit47MethodRunner.executeTestInSuper(PowerMockJUnit47RunnerDelegateImpl.java:131)
	at org.powermock.modules.junit4.internal.impl.PowerMockJUnit47RunnerDelegateImpl$PowerMockJUnit47MethodRunner.access$100(PowerMockJUnit47RunnerDelegateImpl.java:59)
	at org.powermock.modules.junit4.internal.impl.PowerMockJUnit47RunnerDelegateImpl$PowerMockJUnit47MethodRunner$TestExecutorStatement.evaluate(PowerMockJUnit47RunnerDelegateImpl.java:147)
	at org.junit.rules.ExpectedException$ExpectedExceptionStatement.evaluate(ExpectedException.java:258)
	at org.powermock.modules.junit4.internal.impl.PowerMockJUnit47RunnerDelegateImpl$PowerMockJUnit47MethodRunner.evaluateStatement(PowerMockJUnit47RunnerDelegateImpl.java:107)
	at org.powermock.modules.junit4.internal.impl.PowerMockJUnit47RunnerDelegateImpl$PowerMockJUnit47MethodRunner.executeTest(PowerMockJUnit47RunnerDelegateImpl.java:82)
	at org.powermock.modules.junit4.internal.impl.PowerMockJUnit44RunnerDelegateImpl$PowerMockJUnit44MethodRunner.runBeforesThenTestThenAfters(PowerMockJUnit44RunnerDelegateImpl.java:298)
	at org.junit.internal.runners.MethodRoadie.runTest(MethodRoadie.java:87)
	at org.junit.internal.runners.MethodRoadie.run(MethodRoadie.java:50)
	at org.powermock.modules.junit4.internal.impl.PowerMockJUnit44RunnerDelegateImpl.invokeTestMethod(PowerMockJUnit44RunnerDelegateImpl.java:218)
	at org.powermock.modules.junit4.internal.impl.PowerMockJUnit44RunnerDelegateImpl.runMethods(PowerMockJUnit44RunnerDelegateImpl.java:160)
	at org.powermock.modules.junit4.internal.impl.PowerMockJUnit44RunnerDelegateImpl$1.run(PowerMockJUnit44RunnerDelegateImpl.java:134)
	at org.junit.internal.runners.ClassRoadie.runUnprotected(ClassRoadie.java:34)
	at org.junit.internal.runners.ClassRoadie.runProtected(ClassRoadie.java:44)
	at org.powermock.modules.junit4.internal.impl.PowerMockJUnit44RunnerDelegateImpl.run(PowerMockJUnit44RunnerDelegateImpl.java:136)
	at org.powermock.modules.junit4.common.internal.impl.JUnit4TestSuiteChunkerImpl.run(JUnit4TestSuiteChunkerImpl.java:117)
	at org.powermock.modules.junit4.common.internal.impl.AbstractCommonPowerMockRunner.run(AbstractCommonPowerMockRunner.java:57)
	at org.powermock.modules.junit4.PowerMockRunner.run(PowerMockRunner.java:59)
	at junit.framework.JUnit4TestAdapter.run(JUnit4TestAdapter.java:50)
	at junit.framework.TestSuite.runTest(TestSuite.java:241)
	at junit.framework.TestSuite.run(TestSuite.java:236)
	at java.base/jdk.internal.reflect.NativeMethodAccessorImpl.invoke0(Native Method)
	at java.base/jdk.internal.reflect.NativeMethodAccessorImpl.invoke(NativeMethodAccessorImpl.java:62)
	at java.base/jdk.internal.reflect.DelegatingMethodAccessorImpl.invoke(DelegatingMethodAccessorImpl.java:43)
	at java.base/java.lang.reflect.Method.invoke(Method.java:564)
	at org.apache.maven.shadefire.surefire.junit.JUnitTestSet.execute(JUnitTestSet.java:99)
	at org.apache.maven.shadefire.surefire.junit.JUnit3Provider.executeTestSet(JUnit3Provider.java:141)
	at org.apache.maven.shadefire.surefire.junit.JUnit3Provider.invoke(JUnit3Provider.java:114)
	at org.apache.maven.shadefire.surefire.booter.ForkedBooter.runSuitesInProcess(ForkedBooter.java:377)
	at org.apache.maven.shadefire.surefire.booter.ForkedBooter.execute(ForkedBooter.java:138)
	at org.apache.maven.shadefire.surefire.booter.ForkedBooter.run(ForkedBooter.java:465)
	at org.apache.maven.shadefire.surefire.booter.ForkedBooter.main(ForkedBooter.java:451)


FAILED:  org.apache.maven.plugin.surefire.AbstractSurefireMojoTest.shouldSmartlyResolveJUnit5ProviderWithJupiterEngineInPluginDependencies

Error Message:
null

Stack Trace:
java.lang.AssertionError
	at org.junit.Assert.fail(Assert.java:87)
	at org.junit.Assert.fail(Assert.java:96)
	at org.apache.maven.plugin.surefire.AbstractSurefireMojoTest$17.answer(AbstractSurefireMojoTest.java:1527)
	at org.apache.maven.plugin.surefire.AbstractSurefireMojoTest$17.answer(AbstractSurefireMojoTest.java:1497)
	at org.mockito.internal.stubbing.StubbedInvocationMatcher.answer(StubbedInvocationMatcher.java:39)
	at org.mockito.internal.handler.MockHandlerImpl.handle(MockHandlerImpl.java:96)
	at org.mockito.internal.handler.NullResultGuardian.handle(NullResultGuardian.java:29)
	at org.mockito.internal.handler.InvocationNotifierHandler.handle(InvocationNotifierHandler.java:35)
	at org.mockito.internal.creation.bytebuddy.MockMethodInterceptor.doIntercept(MockMethodInterceptor.java:61)
	at org.mockito.internal.creation.bytebuddy.MockMethodInterceptor.doIntercept(MockMethodInterceptor.java:49)
	at org.mockito.internal.creation.bytebuddy.MockMethodInterceptor$DispatcherDefaultingToRealMethod.interceptAbstract(MockMethodInterceptor.java:126)
	at org.apache.maven.repository.RepositorySystem$MockitoMock$1652698771.resolve(Unknown Source)
	at org.apache.maven.plugin.surefire.SurefireDependencyResolver.resolveArtifact(SurefireDependencyResolver.java:194)
	at org.apache.maven.plugin.surefire.SurefireDependencyResolver.resolveProjectArtifact(SurefireDependencyResolver.java:180)
	at org.apache.maven.plugin.surefire.SurefireDependencyResolver.resolveProjectArtifact(SurefireDependencyResolver.java:170)
	at org.apache.maven.plugin.surefire.AbstractSurefireMojo$JUnitPlatformProviderInfo.resolve(AbstractSurefireMojo.java:3217)
	at org.apache.maven.plugin.surefire.AbstractSurefireMojo$JUnitPlatformProviderInfo.alignProviderVersions(AbstractSurefireMojo.java:3202)
	at org.apache.maven.plugin.surefire.AbstractSurefireMojo$JUnitPlatformProviderInfo.getProviderClasspath(AbstractSurefireMojo.java:3178)
	at org.apache.maven.plugin.surefire.AbstractSurefireMojoTest.shouldSmartlyResolveJUnit5ProviderWithJupiterEngineInPluginDependencies(AbstractSurefireMojoTest.java:1587)
	at java.base/jdk.internal.reflect.NativeMethodAccessorImpl.invoke0(Native Method)
	at java.base/jdk.internal.reflect.NativeMethodAccessorImpl.invoke(NativeMethodAccessorImpl.java:62)
	at java.base/jdk.internal.reflect.DelegatingMethodAccessorImpl.invoke(DelegatingMethodAccessorImpl.java:43)
	at java.base/java.lang.reflect.Method.invoke(Method.java:564)
	at org.junit.internal.runners.TestMethod.invoke(TestMethod.java:68)
	at org.powermock.modules.junit4.internal.impl.PowerMockJUnit44RunnerDelegateImpl$PowerMockJUnit44MethodRunner.runTestMethod(PowerMockJUnit44RunnerDelegateImpl.java:326)
	at org.junit.internal.runners.MethodRoadie$2.run(MethodRoadie.java:89)
	at org.junit.internal.runners.MethodRoadie.runBeforesThenTestThenAfters(MethodRoadie.java:97)
	at org.powermock.modules.junit4.internal.impl.PowerMockJUnit44RunnerDelegateImpl$PowerMockJUnit44MethodRunner.executeTest(PowerMockJUnit44RunnerDelegateImpl.java:310)
	at org.powermock.modules.junit4.internal.impl.PowerMockJUnit47RunnerDelegateImpl$PowerMockJUnit47MethodRunner.executeTestInSuper(PowerMockJUnit47RunnerDelegateImpl.java:131)
	at org.powermock.modules.junit4.internal.impl.PowerMockJUnit47RunnerDelegateImpl$PowerMockJUnit47MethodRunner.access$100(PowerMockJUnit47RunnerDelegateImpl.java:59)
	at org.powermock.modules.junit4.internal.impl.PowerMockJUnit47RunnerDelegateImpl$PowerMockJUnit47MethodRunner$TestExecutorStatement.evaluate(PowerMockJUnit47RunnerDelegateImpl.java:147)
	at org.junit.rules.ExpectedException$ExpectedExceptionStatement.evaluate(ExpectedException.java:258)
	at org.powermock.modules.junit4.internal.impl.PowerMockJUnit47RunnerDelegateImpl$PowerMockJUnit47MethodRunner.evaluateStatement(PowerMockJUnit47RunnerDelegateImpl.java:107)
	at org.powermock.modules.junit4.internal.impl.PowerMockJUnit47RunnerDelegateImpl$PowerMockJUnit47MethodRunner.executeTest(PowerMockJUnit47RunnerDelegateImpl.java:82)
	at org.powermock.modules.junit4.internal.impl.PowerMockJUnit44RunnerDelegateImpl$PowerMockJUnit44MethodRunner.runBeforesThenTestThenAfters(PowerMockJUnit44RunnerDelegateImpl.java:298)
	at org.junit.internal.runners.MethodRoadie.runTest(MethodRoadie.java:87)
	at org.junit.internal.runners.MethodRoadie.run(MethodRoadie.java:50)
	at org.powermock.modules.junit4.internal.impl.PowerMockJUnit44RunnerDelegateImpl.invokeTestMethod(PowerMockJUnit44RunnerDelegateImpl.java:218)
	at org.powermock.modules.junit4.internal.impl.PowerMockJUnit44RunnerDelegateImpl.runMethods(PowerMockJUnit44RunnerDelegateImpl.java:160)
	at org.powermock.modules.junit4.internal.impl.PowerMockJUnit44RunnerDelegateImpl$1.run(PowerMockJUnit44RunnerDelegateImpl.java:134)
	at org.junit.internal.runners.ClassRoadie.runUnprotected(ClassRoadie.java:34)
	at org.junit.internal.runners.ClassRoadie.runProtected(ClassRoadie.java:44)
	at org.powermock.modules.junit4.internal.impl.PowerMockJUnit44RunnerDelegateImpl.run(PowerMockJUnit44RunnerDelegateImpl.java:136)
	at org.powermock.modules.junit4.common.internal.impl.JUnit4TestSuiteChunkerImpl.run(JUnit4TestSuiteChunkerImpl.java:117)
	at org.powermock.modules.junit4.common.internal.impl.AbstractCommonPowerMockRunner.run(AbstractCommonPowerMockRunner.java:57)
	at org.powermock.modules.junit4.PowerMockRunner.run(PowerMockRunner.java:59)
	at junit.framework.JUnit4TestAdapter.run(JUnit4TestAdapter.java:50)
	at junit.framework.TestSuite.runTest(TestSuite.java:241)
	at junit.framework.TestSuite.run(TestSuite.java:236)
	at java.base/jdk.internal.reflect.NativeMethodAccessorImpl.invoke0(Native Method)
	at java.base/jdk.internal.reflect.NativeMethodAccessorImpl.invoke(NativeMethodAccessorImpl.java:62)
	at java.base/jdk.internal.reflect.DelegatingMethodAccessorImpl.invoke(DelegatingMethodAccessorImpl.java:43)
	at java.base/java.lang.reflect.Method.invoke(Method.java:564)
	at org.apache.maven.shadefire.surefire.junit.JUnitTestSet.execute(JUnitTestSet.java:99)
	at org.apache.maven.shadefire.surefire.junit.JUnit3Provider.executeTestSet(JUnit3Provider.java:141)
	at org.apache.maven.shadefire.surefire.junit.JUnit3Provider.invoke(JUnit3Provider.java:114)
	at org.apache.maven.shadefire.surefire.booter.ForkedBooter.runSuitesInProcess(ForkedBooter.java:377)
	at org.apache.maven.shadefire.surefire.booter.ForkedBooter.execute(ForkedBooter.java:138)
	at org.apache.maven.shadefire.surefire.booter.ForkedBooter.run(ForkedBooter.java:465)
	at org.apache.maven.shadefire.surefire.booter.ForkedBooter.main(ForkedBooter.java:451)




Build log:
[...truncated 36970 lines...]
[2020-05-02T11:16:35.604Z] 	at junit.framework.TestSuite.run(TestSuite.java:236)
[2020-05-02T11:16:35.604Z] 	at sun.reflect.NativeMethodAccessorImpl.invoke0(Native Method)
[2020-05-02T11:16:35.604Z] 	at sun.reflect.NativeMethodAccessorImpl.invoke(NativeMethodAccessorImpl.java:62)
[2020-05-02T11:16:35.604Z] 	at sun.reflect.DelegatingMethodAccessorImpl.invoke(DelegatingMethodAccessorImpl.java:43)
[2020-05-02T11:16:35.604Z] 	at java.lang.reflect.Method.invoke(Method.java:498)
[2020-05-02T11:16:35.604Z] 	at org.apache.maven.shadefire.surefire.junit.JUnitTestSet.execute(JUnitTestSet.java:99)
[2020-05-02T11:16:35.604Z] 	at org.apache.maven.shadefire.surefire.junit.JUnit3Provider.executeTestSet(JUnit3Provider.java:141)
[2020-05-02T11:16:35.604Z] 	at org.apache.maven.shadefire.surefire.junit.JUnit3Provider.invoke(JUnit3Provider.java:114)
[2020-05-02T11:16:35.604Z] 	at org.apache.maven.shadefire.surefire.booter.ForkedBooter.runSuitesInProcess(ForkedBooter.java:377)
[2020-05-02T11:16:35.604Z] 	at org.apache.maven.shadefire.surefire.booter.ForkedBooter.execute(ForkedBooter.java:138)
[2020-05-02T11:16:35.604Z] 	at org.apache.maven.shadefire.surefire.booter.ForkedBooter.run(ForkedBooter.java:465)
[2020-05-02T11:16:35.604Z] 	at org.apache.maven.shadefire.surefire.booter.ForkedBooter.main(ForkedBooter.java:451)
[2020-05-02T11:16:35.604Z] 
[2020-05-02T11:16:35.604Z] [ERROR] org.apache.maven.plugin.surefire.AbstractSurefireMojoTest.shouldSmartlyResolveJUnit5ProviderWithJUnit5Commons  Time elapsed: 0 s  <<< ERROR!
[2020-05-02T11:16:35.604Z] java.lang.AssertionError
[2020-05-02T11:16:35.604Z] 	at org.junit.Assert.fail(Assert.java:87)
[2020-05-02T11:16:35.604Z] 	at org.junit.Assert.fail(Assert.java:96)
[2020-05-02T11:16:35.604Z] 	at org.apache.maven.plugin.surefire.AbstractSurefireMojoTest$7.answer(AbstractSurefireMojoTest.java:943)
[2020-05-02T11:16:35.604Z] 	at org.apache.maven.plugin.surefire.AbstractSurefireMojoTest$7.answer(AbstractSurefireMojoTest.java:931)
[2020-05-02T11:16:35.604Z] 	at org.mockito.internal.stubbing.StubbedInvocationMatcher.answer(StubbedInvocationMatcher.java:39)
[2020-05-02T11:16:35.604Z] 	at org.mockito.internal.handler.MockHandlerImpl.handle(MockHandlerImpl.java:96)
[2020-05-02T11:16:35.604Z] 	at org.mockito.internal.handler.NullResultGuardian.handle(NullResultGuardian.java:29)
[2020-05-02T11:16:35.604Z] 	at org.mockito.internal.handler.InvocationNotifierHandler.handle(InvocationNotifierHandler.java:35)
[2020-05-02T11:16:35.604Z] 	at org.mockito.internal.creation.bytebuddy.MockMethodInterceptor.doIntercept(MockMethodInterceptor.java:61)
[2020-05-02T11:16:35.604Z] 	at org.mockito.internal.creation.bytebuddy.MockMethodInterceptor.doIntercept(MockMethodInterceptor.java:49)
[2020-05-02T11:16:35.604Z] 	at org.mockito.internal.creation.bytebuddy.MockMethodInterceptor$DispatcherDefaultingToRealMethod.interceptAbstract(MockMethodInterceptor.java:126)
[2020-05-02T11:16:35.604Z] 	at org.apache.maven.repository.RepositorySystem$MockitoMock$1618864160.resolve(Unknown Source)
[2020-05-02T11:16:35.604Z] 	at org.apache.maven.plugin.surefire.SurefireDependencyResolver.resolveArtifact(SurefireDependencyResolver.java:194)
[2020-05-02T11:16:35.604Z] 	at org.apache.maven.plugin.surefire.SurefireDependencyResolver.resolveProjectArtifact(SurefireDependencyResolver.java:180)
[2020-05-02T11:16:35.604Z] 	at org.apache.maven.plugin.surefire.SurefireDependencyResolver.resolveProjectArtifact(SurefireDependencyResolver.java:170)
[2020-05-02T11:16:35.604Z] 	at org.apache.maven.plugin.surefire.AbstractSurefireMojo$JUnitPlatformProviderInfo.resolve(AbstractSurefireMojo.java:3217)
[2020-05-02T11:16:35.604Z] 	at org.apache.maven.plugin.surefire.AbstractSurefireMojo$JUnitPlatformProviderInfo.alignProviderVersions(AbstractSurefireMojo.java:3202)
[2020-05-02T11:16:35.604Z] 	at org.apache.maven.plugin.surefire.AbstractSurefireMojo$JUnitPlatformProviderInfo.getProviderClasspath(AbstractSurefireMojo.java:3178)
[2020-05-02T11:16:35.604Z] 	at org.apache.maven.plugin.surefire.AbstractSurefireMojoTest.shouldSmartlyResolveJUnit5ProviderWithJUnit5Commons(AbstractSurefireMojoTest.java:983)
[2020-05-02T11:16:35.604Z] 	at sun.reflect.NativeMethodAccessorImpl.invoke0(Native Method)
[2020-05-02T11:16:35.604Z] 	at sun.reflect.NativeMethodAccessorImpl.invoke(NativeMethodAccessorImpl.java:62)
[2020-05-02T11:16:35.604Z] 	at sun.reflect.DelegatingMethodAccessorImpl.invoke(DelegatingMethodAccessorImpl.java:43)
[2020-05-02T11:16:35.604Z] 	at java.lang.reflect.Method.invoke(Method.java:498)
[2020-05-02T11:16:35.604Z] 	at org.junit.internal.runners.TestMethod.invoke(TestMethod.java:68)
[2020-05-02T11:16:35.605Z] 	at org.powermock.modules.junit4.internal.impl.PowerMockJUnit44RunnerDelegateImpl$PowerMockJUnit44MethodRunner.runTestMethod(PowerMockJUnit44RunnerDelegateImpl.java:326)
[2020-05-02T11:16:35.605Z] 	at org.junit.internal.runners.MethodRoadie$2.run(MethodRoadie.java:89)
[2020-05-02T11:16:35.605Z] 	at org.junit.internal.runners.MethodRoadie.runBeforesThenTestThenAfters(MethodRoadie.java:97)
[2020-05-02T11:16:35.605Z] 	at org.powermock.modules.junit4.internal.impl.PowerMockJUnit44RunnerDelegateImpl$PowerMockJUnit44MethodRunner.executeTest(PowerMockJUnit44RunnerDelegateImpl.java:310)
[2020-05-02T11:16:35.605Z] 	at org.powermock.modules.junit4.internal.impl.PowerMockJUnit47RunnerDelegateImpl$PowerMockJUnit47MethodRunner.executeTestInSuper(PowerMockJUnit47RunnerDelegateImpl.java:131)
[2020-05-02T11:16:35.605Z] 	at org.powermock.modules.junit4.internal.impl.PowerMockJUnit47RunnerDelegateImpl$PowerMockJUnit47MethodRunner.access$100(PowerMockJUnit47RunnerDelegateImpl.java:59)
[2020-05-02T11:16:35.605Z] 	at org.powermock.modules.junit4.internal.impl.PowerMockJUnit47RunnerDelegateImpl$PowerMockJUnit47MethodRunner$TestExecutorStatement.evaluate(PowerMockJUnit47RunnerDelegateImpl.java:147)
[2020-05-02T11:16:35.605Z] 	at org.junit.rules.ExpectedException$ExpectedExceptionStatement.evaluate(ExpectedException.java:258)
[2020-05-02T11:16:35.605Z] 	at org.powermock.modules.junit4.internal.impl.PowerMockJUnit47RunnerDelegateImpl$PowerMockJUnit47MethodRunner.evaluateStatement(PowerMockJUnit47RunnerDelegateImpl.java:107)
[2020-05-02T11:16:35.605Z] 	at org.powermock.modules.junit4.internal.impl.PowerMockJUnit47RunnerDelegateImpl$PowerMockJUnit47MethodRunner.executeTest(PowerMockJUnit47RunnerDelegateImpl.java:82)
[2020-05-02T11:16:35.605Z] 	at org.powermock.modules.junit4.internal.impl.PowerMockJUnit44RunnerDelegateImpl$PowerMockJUnit44MethodRunner.runBeforesThenTestThenAfters(PowerMockJUnit44RunnerDelegateImpl.java:298)
[2020-05-02T11:16:35.605Z] 	at org.junit.internal.runners.MethodRoadie.runTest(MethodRoadie.java:87)
[2020-05-02T11:16:35.605Z] 	at org.junit.internal.runners.MethodRoadie.run(MethodRoadie.java:50)
[2020-05-02T11:16:35.605Z] 	at org.powermock.modules.junit4.internal.impl.PowerMockJUnit44RunnerDelegateImpl.invokeTestMethod(PowerMockJUnit44RunnerDelegateImpl.java:218)
[2020-05-02T11:16:35.605Z] 	at org.powermock.modules.junit4.internal.impl.PowerMockJUnit44RunnerDelegateImpl.runMethods(PowerMockJUnit44RunnerDelegateImpl.java:160)
[2020-05-02T11:16:35.605Z] 	at org.powermock.modules.junit4.internal.impl.PowerMockJUnit44RunnerDelegateImpl$1.run(PowerMockJUnit44RunnerDelegateImpl.java:134)
[2020-05-02T11:16:35.605Z] 	at org.junit.internal.runners.ClassRoadie.runUnprotected(ClassRoadie.java:34)
[2020-05-02T11:16:35.605Z] 	at org.junit.internal.runners.ClassRoadie.runProtected(ClassRoadie.java:44)
[2020-05-02T11:16:35.605Z] 	at org.powermock.modules.junit4.internal.impl.PowerMockJUnit44RunnerDelegateImpl.run(PowerMockJUnit44RunnerDelegateImpl.java:136)
[2020-05-02T11:16:35.605Z] 	at org.powermock.modules.junit4.common.internal.impl.JUnit4TestSuiteChunkerImpl.run(JUnit4TestSuiteChunkerImpl.java:117)
[2020-05-02T11:16:35.605Z] 	at org.powermock.modules.junit4.common.internal.impl.AbstractCommonPowerMockRunner.run(AbstractCommonPowerMockRunner.java:57)
[2020-05-02T11:16:35.605Z] 	at org.powermock.modules.junit4.PowerMockRunner.run(PowerMockRunner.java:59)
[2020-05-02T11:16:35.605Z] 	at junit.framework.JUnit4TestAdapter.run(JUnit4TestAdapter.java:50)
[2020-05-02T11:16:35.605Z] 	at junit.framework.TestSuite.runTest(TestSuite.java:241)
[2020-05-02T11:16:35.605Z] 	at junit.framework.TestSuite.run(TestSuite.java:236)
[2020-05-02T11:16:35.606Z] 	at sun.reflect.NativeMethodAccessorImpl.invoke0(Native Method)
[2020-05-02T11:16:35.606Z] 	at sun.reflect.NativeMethodAccessorImpl.invoke(NativeMethodAccessorImpl.java:62)
[2020-05-02T11:16:35.606Z] 	at sun.reflect.DelegatingMethodAccessorImpl.invoke(DelegatingMethodAccessorImpl.java:43)
[2020-05-02T11:16:35.606Z] 	at java.lang.reflect.Method.invoke(Method.java:498)
[2020-05-02T11:16:35.606Z] 	at org.apache.maven.shadefire.surefire.junit.JUnitTestSet.execute(JUnitTestSet.java:99)
[2020-05-02T11:16:35.606Z] 	at org.apache.maven.shadefire.surefire.junit.JUnit3Provider.executeTestSet(JUnit3Provider.java:141)
[2020-05-02T11:16:35.606Z] 	at org.apache.maven.shadefire.surefire.junit.JUnit3Provider.invoke(JUnit3Provider.java:114)
[2020-05-02T11:16:35.606Z] 	at org.apache.maven.shadefire.surefire.booter.ForkedBooter.runSuitesInProcess(ForkedBooter.java:377)
[2020-05-02T11:16:35.606Z] 	at org.apache.maven.shadefire.surefire.booter.ForkedBooter.execute(ForkedBooter.java:138)
[2020-05-02T11:16:35.606Z] 	at org.apache.maven.shadefire.surefire.booter.ForkedBooter.run(ForkedBooter.java:465)
[2020-05-02T11:16:35.606Z] 	at org.apache.maven.shadefire.surefire.booter.ForkedBooter.main(ForkedBooter.java:451)
[2020-05-02T11:16:35.606Z] 
[2020-05-02T11:16:35.606Z] [ERROR] org.apache.maven.plugin.surefire.AbstractSurefireMojoTest.shouldSmartlyResolveJUnit5ProviderWithJUnit5Engine  Time elapsed: 0.012 s  <<< ERROR!
[2020-05-02T11:16:35.606Z] java.lang.NullPointerException
[2020-05-02T11:16:35.606Z] 	at org.apache.maven.plugin.surefire.AbstractSurefireMojo$JUnitPlatformProviderInfo.getProviderClasspath(AbstractSurefireMojo.java:3142)
[2020-05-02T11:16:35.606Z] 	at org.apache.maven.plugin.surefire.AbstractSurefireMojoTest.shouldSmartlyResolveJUnit5ProviderWithJUnit5Engine(AbstractSurefireMojoTest.java:1102)
[2020-05-02T11:16:35.606Z] 	at sun.reflect.NativeMethodAccessorImpl.invoke0(Native Method)
[2020-05-02T11:16:35.606Z] 	at sun.reflect.NativeMethodAccessorImpl.invoke(NativeMethodAccessorImpl.java:62)
[2020-05-02T11:16:35.606Z] 	at sun.reflect.DelegatingMethodAccessorImpl.invoke(DelegatingMethodAccessorImpl.java:43)
[2020-05-02T11:16:35.606Z] 	at java.lang.reflect.Method.invoke(Method.java:498)
[2020-05-02T11:16:35.606Z] 	at org.junit.internal.runners.TestMethod.invoke(TestMethod.java:68)
[2020-05-02T11:16:35.606Z] 	at org.powermock.modules.junit4.internal.impl.PowerMockJUnit44RunnerDelegateImpl$PowerMockJUnit44MethodRunner.runTestMethod(PowerMockJUnit44RunnerDelegateImpl.java:326)
[2020-05-02T11:16:35.606Z] 	at org.junit.internal.runners.MethodRoadie$2.run(MethodRoadie.java:89)
[2020-05-02T11:16:35.606Z] 	at org.junit.internal.runners.MethodRoadie.runBeforesThenTestThenAfters(MethodRoadie.java:97)
[2020-05-02T11:16:35.606Z] 	at org.powermock.modules.junit4.internal.impl.PowerMockJUnit44RunnerDelegateImpl$PowerMockJUnit44MethodRunner.executeTest(PowerMockJUnit44RunnerDelegateImpl.java:310)
[2020-05-02T11:16:35.606Z] 	at org.powermock.modules.junit4.internal.impl.PowerMockJUnit47RunnerDelegateImpl$PowerMockJUnit47MethodRunner.executeTestInSuper(PowerMockJUnit47RunnerDelegateImpl.java:131)
[2020-05-02T11:16:35.606Z] 	at org.powermock.modules.junit4.internal.impl.PowerMockJUnit47RunnerDelegateImpl$PowerMockJUnit47MethodRunner.access$100(PowerMockJUnit47RunnerDelegateImpl.java:59)
[2020-05-02T11:16:35.606Z] 	at org.powermock.modules.junit4.internal.impl.PowerMockJUnit47RunnerDelegateImpl$PowerMockJUnit47MethodRunner$TestExecutorStatement.evaluate(PowerMockJUnit47RunnerDelegateImpl.java:147)
[2020-05-02T11:16:35.606Z] 	at org.junit.rules.ExpectedException$ExpectedExceptionStatement.evaluate(ExpectedException.java:258)
[2020-05-02T11:16:35.606Z] 	at org.powermock.modules.junit4.internal.impl.PowerMockJUnit47RunnerDelegateImpl$PowerMockJUnit47MethodRunner.evaluateStatement(PowerMockJUnit47RunnerDelegateImpl.java:107)
[2020-05-02T11:16:35.606Z] 	at org.powermock.modules.junit4.internal.impl.PowerMockJUnit47RunnerDelegateImpl$PowerMockJUnit47MethodRunner.executeTest(PowerMockJUnit47RunnerDelegateImpl.java:82)
[2020-05-02T11:16:35.606Z] 	at org.powermock.modules.junit4.internal.impl.PowerMockJUnit44RunnerDelegateImpl$PowerMockJUnit44MethodRunner.runBeforesThenTestThenAfters(PowerMockJUnit44RunnerDelegateImpl.java:298)
[2020-05-02T11:16:35.606Z] 	at org.junit.internal.runners.MethodRoadie.runTest(MethodRoadie.java:87)
[2020-05-02T11:16:35.606Z] 	at org.junit.internal.runners.MethodRoadie.run(MethodRoadie.java:50)
[2020-05-02T11:16:35.606Z] 	at org.powermock.modules.junit4.internal.impl.PowerMockJUnit44RunnerDelegateImpl.invokeTestMethod(PowerMockJUnit44RunnerDelegateImpl.java:218)
[2020-05-02T11:16:35.606Z] 	at org.powermock.modules.junit4.internal.impl.PowerMockJUnit44RunnerDelegateImpl.runMethods(PowerMockJUnit44RunnerDelegateImpl.java:160)
[2020-05-02T11:16:35.606Z] 	at org.powermock.modules.junit4.internal.impl.PowerMockJUnit44RunnerDelegateImpl$1.run(PowerMockJUnit44RunnerDelegateImpl.java:134)
[2020-05-02T11:16:35.606Z] 	at org.junit.internal.runners.ClassRoadie.runUnprotected(ClassRoadie.java:34)
[2020-05-02T11:16:35.606Z] 	at org.junit.internal.runners.ClassRoadie.runProtected(ClassRoadie.java:44)
[2020-05-02T11:16:35.606Z] 	at org.powermock.modules.junit4.internal.impl.PowerMockJUnit44RunnerDelegateImpl.run(PowerMockJUnit44RunnerDelegateImpl.java:136)
[2020-05-02T11:16:35.606Z] 	at org.powermock.modules.junit4.common.internal.impl.JUnit4TestSuiteChunkerImpl.run(JUnit4TestSuiteChunkerImpl.java:117)
[2020-05-02T11:16:35.606Z] 	at org.powermock.modules.junit4.common.internal.impl.AbstractCommonPowerMockRunner.run(AbstractCommonPowerMockRunner.java:57)
[2020-05-02T11:16:35.606Z] 	at org.powermock.modules.junit4.PowerMockRunner.run(PowerMockRunner.java:59)
[2020-05-02T11:16:35.606Z] 	at junit.framework.JUnit4TestAdapter.run(JUnit4TestAdapter.java:50)
[2020-05-02T11:16:35.606Z] 	at junit.framework.TestSuite.runTest(TestSuite.java:241)
[2020-05-02T11:16:35.606Z] 	at junit.framework.TestSuite.run(TestSuite.java:236)
[2020-05-02T11:16:35.607Z] 	at sun.reflect.NativeMethodAccessorImpl.invoke0(Native Method)
[2020-05-02T11:16:35.607Z] 	at sun.reflect.NativeMethodAccessorImpl.invoke(NativeMethodAccessorImpl.java:62)
[2020-05-02T11:16:35.607Z] 	at sun.reflect.DelegatingMethodAccessorImpl.invoke(DelegatingMethodAccessorImpl.java:43)
[2020-05-02T11:16:35.607Z] 	at java.lang.reflect.Method.invoke(Method.java:498)
[2020-05-02T11:16:35.607Z] 	at org.apache.maven.shadefire.surefire.junit.JUnitTestSet.execute(JUnitTestSet.java:99)
[2020-05-02T11:16:35.607Z] 	at org.apache.maven.shadefire.surefire.junit.JUnit3Provider.executeTestSet(JUnit3Provider.java:141)
[2020-05-02T11:16:35.607Z] 	at org.apache.maven.shadefire.surefire.junit.JUnit3Provider.invoke(JUnit3Provider.java:114)
[2020-05-02T11:16:35.607Z] 	at org.apache.maven.shadefire.surefire.booter.ForkedBooter.runSuitesInProcess(ForkedBooter.java:377)
[2020-05-02T11:16:35.607Z] 	at org.apache.maven.shadefire.surefire.booter.ForkedBooter.execute(ForkedBooter.java:138)
[2020-05-02T11:16:35.607Z] 	at org.apache.maven.shadefire.surefire.booter.ForkedBooter.run(ForkedBooter.java:465)
[2020-05-02T11:16:35.607Z] 	at org.apache.maven.shadefire.surefire.booter.ForkedBooter.main(ForkedBooter.java:451)
[2020-05-02T11:16:35.607Z] 
[2020-05-02T11:16:35.918Z] [INFO] 
[2020-05-02T11:16:35.918Z] [INFO] Results:
[2020-05-02T11:16:35.918Z] [INFO] 
[2020-05-02T11:16:35.918Z] [ERROR] Errors: 
[2020-05-02T11:16:35.918Z] [ERROR]   junit.framework.JUnit4TestCaseFacade#UNKNOWN NullPointerException
[2020-05-02T11:16:35.918Z] [ERROR]   junit.framework.JUnit4TestCaseFacade#UNKNOWN 
[2020-05-02T11:16:35.918Z] [ERROR]   junit.framework.JUnit4TestCaseFacade#UNKNOWN NullPointerException
[2020-05-02T11:16:35.918Z] [ERROR]   junit.framework.JUnit4TestCaseFacade#UNKNOWN 
[2020-05-02T11:16:35.918Z] [ERROR]   junit.framework.JUnit4TestCaseFacade#UNKNOWN NullPointerException
[2020-05-02T11:16:35.918Z] [ERROR]   junit.framework.JUnit4TestCaseFacade#UNKNOWN 
[2020-05-02T11:16:35.918Z] [ERROR]   junit.framework.JUnit4TestCaseFacade#UNKNOWN NullPointerException
[2020-05-02T11:16:35.918Z] [INFO] 
[2020-05-02T11:16:35.918Z] [ERROR] Tests run: 257, Failures: 0, Errors: 7, Skipped: 0
[2020-05-02T11:16:35.918Z] [INFO] 
[2020-05-02T11:16:35.918Z] [INFO] ------------------------------------------------------------------------
[2020-05-02T11:16:35.918Z] [INFO] Reactor Summary:
[2020-05-02T11:16:35.918Z] [INFO] 
[2020-05-02T11:16:35.918Z] [INFO] Apache Maven Surefire .............................. SUCCESS [ 51.901 s]
[2020-05-02T11:16:35.918Z] [INFO] SureFire Logger API ................................ SUCCESS [ 18.718 s]
[2020-05-02T11:16:35.918Z] [INFO] SureFire API ....................................... SUCCESS [ 21.217 s]
[2020-05-02T11:16:35.918Z] [INFO] Surefire Extensions API ............................ SUCCESS [  6.468 s]
[2020-05-02T11:16:35.918Z] [INFO] Surefire Extensions SPI ............................ SUCCESS [  2.253 s]
[2020-05-02T11:16:35.918Z] [INFO] SureFire Booter .................................... SUCCESS [ 20.534 s]
[2020-05-02T11:16:35.918Z] [INFO] Maven Surefire Test-Grouping Support ............... SUCCESS [  8.567 s]
[2020-05-02T11:16:35.918Z] [INFO] SureFire Providers ................................. SUCCESS [  0.984 s]
[2020-05-02T11:16:35.918Z] [INFO] Shared JUnit3 Provider Code ........................ SUCCESS [  4.212 s]
[2020-05-02T11:16:35.918Z] [INFO] Shared Java 5 Provider Base ........................ SUCCESS [  5.516 s]
[2020-05-02T11:16:35.918Z] [INFO] Shared JUnit4 Provider Code ........................ SUCCESS [  6.307 s]
[2020-05-02T11:16:35.918Z] [INFO] Shared JUnit48 Provider Code ....................... SUCCESS [  8.675 s]
[2020-05-02T11:16:35.918Z] [INFO] SureFire JUnit Runner .............................. SUCCESS [  5.039 s]
[2020-05-02T11:16:35.919Z] [INFO] SureFire JUnit4 Runner ............................. SUCCESS [  4.991 s]
[2020-05-02T11:16:35.919Z] [INFO] Maven Surefire Common .............................. FAILURE [ 50.290 s]
[2020-05-02T11:16:35.919Z] [INFO] SureFire JUnitCore Runner .......................... SKIPPED
[2020-05-02T11:16:35.919Z] [INFO] SureFire JUnit Platform Runner ..................... SKIPPED
[2020-05-02T11:16:35.919Z] [INFO] SureFire TestNG Utils .............................. SKIPPED
[2020-05-02T11:16:35.919Z] [INFO] SureFire TestNG Runner ............................. SKIPPED
[2020-05-02T11:16:35.919Z] [INFO] ShadeFire JUnit3 Provider .......................... SKIPPED
[2020-05-02T11:16:35.919Z] [INFO] Surefire Report Parser ............................. SKIPPED
[2020-05-02T11:16:35.919Z] [INFO] Maven Surefire Plugin .............................. SKIPPED
[2020-05-02T11:16:35.919Z] [INFO] Maven Failsafe Plugin .............................. SKIPPED
[2020-05-02T11:16:35.919Z] [INFO] Maven Surefire Report Plugin ....................... SKIPPED
[2020-05-02T11:16:35.919Z] [INFO] Maven Surefire Integration Tests ................... SKIPPED
[2020-05-02T11:16:35.919Z] [INFO] Surefire Shared Utils .............................. SKIPPED
[2020-05-02T11:16:35.919Z] [INFO] ------------------------------------------------------------------------
[2020-05-02T11:16:35.919Z] [INFO] BUILD FAILURE
[2020-05-02T11:16:35.919Z] [INFO] ------------------------------------------------------------------------
[2020-05-02T11:16:35.919Z] [INFO] Total time: 03:37 min
[2020-05-02T11:16:35.919Z] [INFO] Finished at: 2020-05-02T04:16:35-07:00
[2020-05-02T11:16:36.509Z] [INFO] Final Memory: 44M/156M
[2020-05-02T11:16:36.509Z] [INFO] ------------------------------------------------------------------------
[2020-05-02T11:16:36.509Z] [ERROR] Failed to execute goal org.apache.maven.plugins:maven-surefire-plugin:3.0.0-M4:test (default-test) on project maven-surefire-common: There are test failures.
[2020-05-02T11:16:36.509Z] [ERROR] 
[2020-05-02T11:16:36.509Z] [ERROR] Please refer to C:\Users\jenkins\AppData\Local\Temp\2\jenkins-maven-box-maven-surefire-master-197@2\maven-surefire-common\target\surefire-reports for the individual test results.
[2020-05-02T11:16:36.509Z] [ERROR] Please refer to dump files (if any exist) [date].dump, [date]-jvmRun[N].dump and [date].dumpstream.
[2020-05-02T11:16:36.509Z] [ERROR] -> [Help 1]
[2020-05-02T11:16:36.509Z] org.apache.maven.lifecycle.LifecycleExecutionException: Failed to execute goal org.apache.maven.plugins:maven-surefire-plugin:3.0.0-M4:test (default-test) on project maven-surefire-common: There are test failures.
[2020-05-02T11:16:36.509Z] 
[2020-05-02T11:16:36.509Z] Please refer to C:\Users\jenkins\AppData\Local\Temp\2\jenkins-maven-box-maven-surefire-master-197@2\maven-surefire-common\target\surefire-reports for the individual test results.
[2020-05-02T11:16:36.509Z] Please refer to dump files (if any exist) [date].dump, [date]-jvmRun[N].dump and [date].dumpstream.
[2020-05-02T11:16:36.509Z] 	at org.apache.maven.lifecycle.internal.MojoExecutor.execute(MojoExecutor.java:212)
[2020-05-02T11:16:36.509Z] 	at org.apache.maven.lifecycle.internal.MojoExecutor.execute(MojoExecutor.java:153)
[2020-05-02T11:16:36.509Z] 	at org.apache.maven.lifecycle.internal.MojoExecutor.execute(MojoExecutor.java:145)
[2020-05-02T11:16:36.509Z] 	at org.apache.maven.lifecycle.internal.LifecycleModuleBuilder.buildProject(LifecycleModuleBuilder.java:116)
[2020-05-02T11:16:36.509Z] 	at org.apache.maven.lifecycle.internal.LifecycleModuleBuilder.buildProject(LifecycleModuleBuilder.java:80)
[2020-05-02T11:16:36.509Z] 	at org.apache.maven.lifecycle.internal.builder.singlethreaded.SingleThreadedBuilder.build(SingleThreadedBuilder.java:51)
[2020-05-02T11:16:36.509Z] 	at org.apache.maven.lifecycle.internal.LifecycleStarter.execute(LifecycleStarter.java:120)
[2020-05-02T11:16:36.509Z] 	at org.apache.maven.DefaultMaven.doExecute(DefaultMaven.java:355)
[2020-05-02T11:16:36.509Z] 	at org.apache.maven.DefaultMaven.execute(DefaultMaven.java:155)
[2020-05-02T11:16:36.509Z] 	at org.apache.maven.cli.MavenCli.execute(MavenCli.java:584)
[2020-05-02T11:16:36.509Z] 	at org.apache.maven.cli.MavenCli.doMain(MavenCli.java:216)
[2020-05-02T11:16:36.509Z] 	at org.apache.maven.cli.MavenCli.main(MavenCli.java:160)
[2020-05-02T11:16:36.509Z] 	at sun.reflect.NativeMethodAccessorImpl.invoke0(Native Method)
[2020-05-02T11:16:36.509Z] 	at sun.reflect.NativeMethodAccessorImpl.invoke(NativeMethodAccessorImpl.java:62)
[2020-05-02T11:16:36.509Z] 	at sun.reflect.DelegatingMethodAccessorImpl.invoke(DelegatingMethodAccessorImpl.java:43)
[2020-05-02T11:16:36.509Z] 	at java.lang.reflect.Method.invoke(Method.java:498)
[2020-05-02T11:16:36.509Z] 	at org.codehaus.plexus.classworlds.launcher.Launcher.launchEnhanced(Launcher.java:289)
[2020-05-02T11:16:36.509Z] 	at org.codehaus.plexus.classworlds.launcher.Launcher.launch(Launcher.java:229)
[2020-05-02T11:16:36.509Z] 	at org.codehaus.plexus.classworlds.launcher.Launcher.mainWithExitCode(Launcher.java:415)
[2020-05-02T11:16:36.509Z] 	at org.codehaus.plexus.classworlds.launcher.Launcher.main(Launcher.java:356)
[2020-05-02T11:16:36.509Z] Caused by: org.apache.maven.plugin.MojoFailureException: There are test failures.
[2020-05-02T11:16:36.509Z] 
[2020-05-02T11:16:36.509Z] Please refer to C:\Users\jenkins\AppData\Local\Temp\2\jenkins-maven-box-maven-surefire-master-197@2\maven-surefire-common\target\surefire-reports for the individual test results.
[2020-05-02T11:16:36.509Z] Please refer to dump files (if any exist) [date].dump, [date]-jvmRun[N].dump and [date].dumpstream.
[2020-05-02T11:16:36.509Z] 	at org.apache.maven.plugin.surefire.SurefireHelper.throwException(SurefireHelper.java:271)
[2020-05-02T11:16:36.509Z] 	at org.apache.maven.plugin.surefire.SurefireHelper.reportExecution(SurefireHelper.java:159)
[2020-05-02T11:16:36.509Z] 	at org.apache.maven.plugin.surefire.SurefirePlugin.handleSummary(SurefirePlugin.java:435)
[2020-05-02T11:16:36.509Z] 	at org.apache.maven.plugin.surefire.AbstractSurefireMojo.executeAfterPreconditionsChecked(AbstractSurefireMojo.java:1079)
[2020-05-02T11:16:36.509Z] 	at org.apache.maven.plugin.surefire.AbstractSurefireMojo.execute(AbstractSurefireMojo.java:889)
[2020-05-02T11:16:36.510Z] 	at org.apache.maven.plugin.DefaultBuildPluginManager.executeMojo(DefaultBuildPluginManager.java:132)
[2020-05-02T11:16:36.510Z] 	at org.apache.maven.lifecycle.internal.MojoExecutor.execute(MojoExecutor.java:208)
[2020-05-02T11:16:36.510Z] 	... 19 more
[2020-05-02T11:16:36.510Z] [ERROR] 
[2020-05-02T11:16:36.510Z] [ERROR] Re-run Maven using the -X switch to enable full debug logging.
[2020-05-02T11:16:36.510Z] [ERROR] 
[2020-05-02T11:16:36.510Z] [ERROR] For more information about the errors and possible solutions, please read the following articles:
[2020-05-02T11:16:36.510Z] [ERROR] [Help 1] http://cwiki.apache.org/confluence/display/MAVEN/MojoFailureException
[2020-05-02T11:16:36.510Z] [ERROR] 
[2020-05-02T11:16:36.510Z] [ERROR] After correcting the problems, you can resume the build with the command
[2020-05-02T11:16:36.510Z] [ERROR]   mvn <goals> -rf :maven-surefire-common
[Pipeline] }
[Pipeline] // withEnv
[Pipeline] }
[Pipeline] // stage
[Pipeline] fileExists
[Pipeline] fileExists
[Pipeline] archiveArtifacts
[2020-05-02T11:16:36.758Z] Archiving artifacts
[Pipeline] cleanWs
[2020-05-02T11:16:36.810Z] [WS-CLEANUP] Deleting project workspace...
[2020-05-02T11:16:36.810Z] [WS-CLEANUP] Deferred wipeout is used...
[2020-05-02T11:16:36.857Z] [WS-CLEANUP] done
[Pipeline] }
[Pipeline] // ws
[Pipeline] }
[Pipeline] // timestamps
[Pipeline] }
[Pipeline] // node
[Pipeline] }
[Pipeline] // parallel
[Pipeline] echo
Build result: FAILURE
[Pipeline] jiraIssueSelector
[Pipeline] echo
The authors of changes [tibordigana].
[Pipeline] echo
Sending email ...
[Pipeline] emailext
Mime
  • Unnamed multipart/mixed (inline, None, 0 bytes)
View raw message