maven-notifications mailing list archives

Site index · List index
Message view « Date » · « Thread »
Top « Date » · « Thread »
From Apache Jenkins Server <jenk...@builds.apache.org>
Subject Build unstable in Jenkins: Maven TLP » maven » MNG-5937 #4
Date Sat, 02 May 2020 15:49:17 GMT
See https://builds.apache.org/job/maven-box/job/maven/job/MNG-5937/4/

Changes:

* [MNG-5937] Lock to available maven-install-plugin

13 tests failed.
FAILED:  org.apache.maven.it.MavenITmng5937MavenWrapper.linux-jdk14 / Run ITs Linux Java 14 / testitMNG5937Bin

Error Message:
Exit code was non-zero: 127; command line and log = 
/home/jenkins/jenkins-slave/workspace/maven-box_maven_MNG-5937/test/core-it-suite/target/apache-maven/bin/mvn --global-settings /home/jenkins/jenkins-slave/workspace/maven-box_maven_MNG-5937/test/core-it-suite/target/test-classes/settings.xml -e --batch-mode -Dmaven.repo.local=/home/jenkins/jenkins-slave/workspace/maven-box_maven_MNG-5937/test/it-local-repo validate
/bin/sh: 1: mvnw: not found


Stack Trace:
org.apache.maven.it.VerificationException: 
Exit code was non-zero: 127; command line and log = 
/home/jenkins/jenkins-slave/workspace/maven-box_maven_MNG-5937/test/core-it-suite/target/apache-maven/bin/mvn --global-settings /home/jenkins/jenkins-slave/workspace/maven-box_maven_MNG-5937/test/core-it-suite/target/test-classes/settings.xml -e --batch-mode -Dmaven.repo.local=/home/jenkins/jenkins-slave/workspace/maven-box_maven_MNG-5937/test/it-local-repo validate
/bin/sh: 1: mvnw: not found

	at org.apache.maven.it.MavenITmng5937MavenWrapper.testitMNG5937Bin(MavenITmng5937MavenWrapper.java:96)


FAILED:  org.apache.maven.it.MavenITmng5937MavenWrapper.linux-jdk14 / Run ITs Linux Java 14 / testitMNG5937Script

Error Message:
Exit code was non-zero: 127; command line and log = 
/home/jenkins/jenkins-slave/workspace/maven-box_maven_MNG-5937/test/core-it-suite/target/apache-maven/bin/mvn --global-settings /home/jenkins/jenkins-slave/workspace/maven-box_maven_MNG-5937/test/core-it-suite/target/test-classes/settings.xml -e --batch-mode -Dmaven.repo.local=/home/jenkins/jenkins-slave/workspace/maven-box_maven_MNG-5937/test/it-local-repo validate
/bin/sh: 1: mvnw: not found


Stack Trace:
org.apache.maven.it.VerificationException: 
Exit code was non-zero: 127; command line and log = 
/home/jenkins/jenkins-slave/workspace/maven-box_maven_MNG-5937/test/core-it-suite/target/apache-maven/bin/mvn --global-settings /home/jenkins/jenkins-slave/workspace/maven-box_maven_MNG-5937/test/core-it-suite/target/test-classes/settings.xml -e --batch-mode -Dmaven.repo.local=/home/jenkins/jenkins-slave/workspace/maven-box_maven_MNG-5937/test/it-local-repo validate
/bin/sh: 1: mvnw: not found

	at org.apache.maven.it.MavenITmng5937MavenWrapper.testitMNG5937Script(MavenITmng5937MavenWrapper.java:111)


FAILED:  org.apache.maven.it.MavenITmng5937MavenWrapper.linux-jdk14 / Run ITs Linux Java 14 / testitMNG5937Source

Error Message:
Exit code was non-zero: 127; command line and log = 
/home/jenkins/jenkins-slave/workspace/maven-box_maven_MNG-5937/test/core-it-suite/target/apache-maven/bin/mvn --global-settings /home/jenkins/jenkins-slave/workspace/maven-box_maven_MNG-5937/test/core-it-suite/target/test-classes/settings.xml -e --batch-mode -Dmaven.repo.local=/home/jenkins/jenkins-slave/workspace/maven-box_maven_MNG-5937/test/it-local-repo validate
/bin/sh: 1: mvnw: not found


Stack Trace:
org.apache.maven.it.VerificationException: 
Exit code was non-zero: 127; command line and log = 
/home/jenkins/jenkins-slave/workspace/maven-box_maven_MNG-5937/test/core-it-suite/target/apache-maven/bin/mvn --global-settings /home/jenkins/jenkins-slave/workspace/maven-box_maven_MNG-5937/test/core-it-suite/target/test-classes/settings.xml -e --batch-mode -Dmaven.repo.local=/home/jenkins/jenkins-slave/workspace/maven-box_maven_MNG-5937/test/it-local-repo validate
/bin/sh: 1: mvnw: not found

	at org.apache.maven.it.MavenITmng5937MavenWrapper.testitMNG5937Source(MavenITmng5937MavenWrapper.java:126)


FAILED:  org.apache.maven.it.MavenITmng5937MavenWrapper.linux-jdk15 / Run ITs Linux Java 15 / testitMNG5937Bin

Error Message:
Exit code was non-zero: 127; command line and log = 
/home/jenkins/jenkins-slave/workspace/maven-box_maven_MNG-5937/test/core-it-suite/target/apache-maven/bin/mvn --global-settings /home/jenkins/jenkins-slave/workspace/maven-box_maven_MNG-5937/test/core-it-suite/target/test-classes/settings.xml -e --batch-mode -Dmaven.repo.local=/home/jenkins/jenkins-slave/workspace/maven-box_maven_MNG-5937/test/it-local-repo validate
/bin/sh: 1: mvnw: not found


Stack Trace:
org.apache.maven.it.VerificationException: 
Exit code was non-zero: 127; command line and log = 
/home/jenkins/jenkins-slave/workspace/maven-box_maven_MNG-5937/test/core-it-suite/target/apache-maven/bin/mvn --global-settings /home/jenkins/jenkins-slave/workspace/maven-box_maven_MNG-5937/test/core-it-suite/target/test-classes/settings.xml -e --batch-mode -Dmaven.repo.local=/home/jenkins/jenkins-slave/workspace/maven-box_maven_MNG-5937/test/it-local-repo validate
/bin/sh: 1: mvnw: not found

	at org.apache.maven.it.MavenITmng5937MavenWrapper.testitMNG5937Bin(MavenITmng5937MavenWrapper.java:96)


FAILED:  org.apache.maven.it.MavenITmng5937MavenWrapper.linux-jdk15 / Run ITs Linux Java 15 / testitMNG5937Script

Error Message:
Exit code was non-zero: 127; command line and log = 
/home/jenkins/jenkins-slave/workspace/maven-box_maven_MNG-5937/test/core-it-suite/target/apache-maven/bin/mvn --global-settings /home/jenkins/jenkins-slave/workspace/maven-box_maven_MNG-5937/test/core-it-suite/target/test-classes/settings.xml -e --batch-mode -Dmaven.repo.local=/home/jenkins/jenkins-slave/workspace/maven-box_maven_MNG-5937/test/it-local-repo validate
/bin/sh: 1: mvnw: not found


Stack Trace:
org.apache.maven.it.VerificationException: 
Exit code was non-zero: 127; command line and log = 
/home/jenkins/jenkins-slave/workspace/maven-box_maven_MNG-5937/test/core-it-suite/target/apache-maven/bin/mvn --global-settings /home/jenkins/jenkins-slave/workspace/maven-box_maven_MNG-5937/test/core-it-suite/target/test-classes/settings.xml -e --batch-mode -Dmaven.repo.local=/home/jenkins/jenkins-slave/workspace/maven-box_maven_MNG-5937/test/it-local-repo validate
/bin/sh: 1: mvnw: not found

	at org.apache.maven.it.MavenITmng5937MavenWrapper.testitMNG5937Script(MavenITmng5937MavenWrapper.java:111)


FAILED:  org.apache.maven.it.MavenITmng5937MavenWrapper.linux-jdk15 / Run ITs Linux Java 15 / testitMNG5937Source

Error Message:
Exit code was non-zero: 127; command line and log = 
/home/jenkins/jenkins-slave/workspace/maven-box_maven_MNG-5937/test/core-it-suite/target/apache-maven/bin/mvn --global-settings /home/jenkins/jenkins-slave/workspace/maven-box_maven_MNG-5937/test/core-it-suite/target/test-classes/settings.xml -e --batch-mode -Dmaven.repo.local=/home/jenkins/jenkins-slave/workspace/maven-box_maven_MNG-5937/test/it-local-repo validate
/bin/sh: 1: mvnw: not found


Stack Trace:
org.apache.maven.it.VerificationException: 
Exit code was non-zero: 127; command line and log = 
/home/jenkins/jenkins-slave/workspace/maven-box_maven_MNG-5937/test/core-it-suite/target/apache-maven/bin/mvn --global-settings /home/jenkins/jenkins-slave/workspace/maven-box_maven_MNG-5937/test/core-it-suite/target/test-classes/settings.xml -e --batch-mode -Dmaven.repo.local=/home/jenkins/jenkins-slave/workspace/maven-box_maven_MNG-5937/test/it-local-repo validate
/bin/sh: 1: mvnw: not found

	at org.apache.maven.it.MavenITmng5937MavenWrapper.testitMNG5937Source(MavenITmng5937MavenWrapper.java:126)


FAILED:  org.apache.maven.it.MavenITmng5937MavenWrapper.linux-jdk8 / Run ITs Linux Java 8 / testitMNG5937Bin

Error Message:
Exit code was non-zero: 127; command line and log = 
/home/jenkins/jenkins-slave/workspace/maven-box_maven_MNG-5937/test/core-it-suite/target/apache-maven/bin/mvn --global-settings /home/jenkins/jenkins-slave/workspace/maven-box_maven_MNG-5937/test/core-it-suite/target/test-classes/settings.xml -e --batch-mode -Dmaven.repo.local=/home/jenkins/jenkins-slave/workspace/maven-box_maven_MNG-5937/test/it-local-repo validate
/bin/sh: 1: mvnw: not found


Stack Trace:
org.apache.maven.it.VerificationException: 
Exit code was non-zero: 127; command line and log = 
/home/jenkins/jenkins-slave/workspace/maven-box_maven_MNG-5937/test/core-it-suite/target/apache-maven/bin/mvn --global-settings /home/jenkins/jenkins-slave/workspace/maven-box_maven_MNG-5937/test/core-it-suite/target/test-classes/settings.xml -e --batch-mode -Dmaven.repo.local=/home/jenkins/jenkins-slave/workspace/maven-box_maven_MNG-5937/test/it-local-repo validate
/bin/sh: 1: mvnw: not found

	at org.apache.maven.it.MavenITmng5937MavenWrapper.testitMNG5937Bin(MavenITmng5937MavenWrapper.java:96)


FAILED:  org.apache.maven.it.MavenITmng5937MavenWrapper.linux-jdk8 / Run ITs Linux Java 8 / testitMNG5937Script

Error Message:
Exit code was non-zero: 127; command line and log = 
/home/jenkins/jenkins-slave/workspace/maven-box_maven_MNG-5937/test/core-it-suite/target/apache-maven/bin/mvn --global-settings /home/jenkins/jenkins-slave/workspace/maven-box_maven_MNG-5937/test/core-it-suite/target/test-classes/settings.xml -e --batch-mode -Dmaven.repo.local=/home/jenkins/jenkins-slave/workspace/maven-box_maven_MNG-5937/test/it-local-repo validate
/bin/sh: 1: mvnw: not found


Stack Trace:
org.apache.maven.it.VerificationException: 
Exit code was non-zero: 127; command line and log = 
/home/jenkins/jenkins-slave/workspace/maven-box_maven_MNG-5937/test/core-it-suite/target/apache-maven/bin/mvn --global-settings /home/jenkins/jenkins-slave/workspace/maven-box_maven_MNG-5937/test/core-it-suite/target/test-classes/settings.xml -e --batch-mode -Dmaven.repo.local=/home/jenkins/jenkins-slave/workspace/maven-box_maven_MNG-5937/test/it-local-repo validate
/bin/sh: 1: mvnw: not found

	at org.apache.maven.it.MavenITmng5937MavenWrapper.testitMNG5937Script(MavenITmng5937MavenWrapper.java:111)


FAILED:  org.apache.maven.it.MavenITmng5937MavenWrapper.linux-jdk8 / Run ITs Linux Java 8 / testitMNG5937Source

Error Message:
Exit code was non-zero: 127; command line and log = 
/home/jenkins/jenkins-slave/workspace/maven-box_maven_MNG-5937/test/core-it-suite/target/apache-maven/bin/mvn --global-settings /home/jenkins/jenkins-slave/workspace/maven-box_maven_MNG-5937/test/core-it-suite/target/test-classes/settings.xml -e --batch-mode -Dmaven.repo.local=/home/jenkins/jenkins-slave/workspace/maven-box_maven_MNG-5937/test/it-local-repo validate
/bin/sh: 1: mvnw: not found


Stack Trace:
org.apache.maven.it.VerificationException: 
Exit code was non-zero: 127; command line and log = 
/home/jenkins/jenkins-slave/workspace/maven-box_maven_MNG-5937/test/core-it-suite/target/apache-maven/bin/mvn --global-settings /home/jenkins/jenkins-slave/workspace/maven-box_maven_MNG-5937/test/core-it-suite/target/test-classes/settings.xml -e --batch-mode -Dmaven.repo.local=/home/jenkins/jenkins-slave/workspace/maven-box_maven_MNG-5937/test/it-local-repo validate
/bin/sh: 1: mvnw: not found

	at org.apache.maven.it.MavenITmng5937MavenWrapper.testitMNG5937Source(MavenITmng5937MavenWrapper.java:126)


FAILED:  org.apache.maven.it.MavenITmng5937MavenWrapper.windows-jdk14 / Run ITs Windows Java 14 / testitMNG5937Bin

Error Message:
Exit code was non-zero: 1; command line and log = 
C:\mvn-it-1.tmp\core-it-suite\target\apache-maven\bin\mvn --global-settings C:\mvn-it-1.tmp\core-it-suite\target\test-classes\settings.xml -e --batch-mode -Dmaven.repo.local=c:\mvn-it-1.tmp\it-local-repo validate

C:\mvn-it-1.tmp\core-it-suite\target\test-classes\mng-5937-wrapper\bin>if "" == "" (set "HOME=C:\Users\jenkins" ) 

C:\mvn-it-1.tmp\core-it-suite\target\test-classes\mng-5937-wrapper\bin>if not "" == "" goto skipRcPre 

C:\mvn-it-1.tmp\core-it-suite\target\test-classes\mng-5937-wrapper\bin>if exist "C:\Users\jenkins\mavenrc_pre.bat" call "C:\Users\jenkins\mavenrc_pre.bat" 

C:\mvn-it-1.tmp\core-it-suite\target\test-classes\mng-5937-wrapper\bin>if exist "C:\Users\jenkins\mavenrc_pre.cmd" call "C:\Users\jenkins\mavenrc_pre.cmd" 

C:\mvn-it-1.tmp\core-it-suite\target\test-classes\mng-5937-wrapper\bin>set ERROR_CODE=0 

C:\mvn-it-1.tmp\core-it-suite\target\test-classes\mng-5937-wrapper\bin>if not "f:\\jenkins\\tools\\java\\latest14" == "" goto OkJHome 

C:\mvn-it-1.tmp\core-it-suite\target\test-classes\mng-5937-wrapper\bin>if exist "f:\\jenkins\\tools\\java\\latest14\bin\java.exe" goto init 

C:\mvn-it-1.tmp\core-it-suite\target\test-classes\mng-5937-wrapper\bin>set MAVEN_PROJECTBASEDIR= 

C:\mvn-it-1.tmp\core-it-suite\target\test-classes\mng-5937-wrapper\bin>IF NOT "" == "" goto endDetectBaseDir 

C:\mvn-it-1.tmp\core-it-suite\target\test-classes\mng-5937-wrapper\bin>set EXEC_DIR=C:\mvn-it-1.tmp\core-it-suite\target\test-classes\mng-5937-wrapper\bin 

C:\mvn-it-1.tmp\core-it-suite\target\test-classes\mng-5937-wrapper\bin>set WDIR=C:\mvn-it-1.tmp\core-it-suite\target\test-classes\mng-5937-wrapper\bin 

C:\mvn-it-1.tmp\core-it-suite\target\test-classes\mng-5937-wrapper\bin>IF EXIST "C:\mvn-it-1.tmp\core-it-suite\target\test-classes\mng-5937-wrapper\bin"\.mvn goto baseDirFound 

C:\mvn-it-1.tmp\core-it-suite\target\test-classes\mng-5937-wrapper\bin>set MAVEN_PROJECTBASEDIR=C:\mvn-it-1.tmp\core-it-suite\target\test-classes\mng-5937-wrapper\bin 

C:\mvn-it-1.tmp\core-it-suite\target\test-classes\mng-5937-wrapper\bin>cd "C:\mvn-it-1.tmp\core-it-suite\target\test-classes\mng-5937-wrapper\bin" 

C:\mvn-it-1.tmp\core-it-suite\target\test-classes\mng-5937-wrapper\bin>goto endDetectBaseDir 

C:\mvn-it-1.tmp\core-it-suite\target\test-classes\mng-5937-wrapper\bin>IF NOT EXIST "C:\mvn-it-1.tmp\core-it-suite\target\test-classes\mng-5937-wrapper\bin\.mvn\jvm.config" goto endReadAdditionalConfig 

C:\mvn-it-1.tmp\core-it-suite\target\test-classes\mng-5937-wrapper\bin>SET MAVEN_JAVA_EXE="f:\\jenkins\\tools\\java\\latest14\bin\java.exe" 

C:\mvn-it-1.tmp\core-it-suite\target\test-classes\mng-5937-wrapper\bin>set WRAPPER_JAR="C:\mvn-it-1.tmp\core-it-suite\target\test-classes\mng-5937-wrapper\bin\.mvn\wrapper\maven-wrapper.jar" 

C:\mvn-it-1.tmp\core-it-suite\target\test-classes\mng-5937-wrapper\bin>set WRAPPER_LAUNCHER=org.apache.maven.wrapper.MavenWrapperMain 

C:\mvn-it-1.tmp\core-it-suite\target\test-classes\mng-5937-wrapper\bin>IF NOT EXIST "C:\mvn-it-1.tmp\core-it-suite\target\test-classes\mng-5937-wrapper\bin\.mvn\wrapper\maven-wrapper.jar" goto downloadWrapper 

C:\mvn-it-1.tmp\core-it-suite\target\test-classes\mng-5937-wrapper\bin>if "" == "true" ECHO Found "C:\mvn-it-1.tmp\core-it-suite\target\test-classes\mng-5937-wrapper\bin\.mvn\wrapper\maven-wrapper.jar" 

C:\mvn-it-1.tmp\core-it-suite\target\test-classes\mng-5937-wrapper\bin>goto endWrapper 

C:\mvn-it-1.tmp\core-it-suite\target\test-classes\mng-5937-wrapper\bin>set MAVEN_CMD_LINE_ARGS=-Dmaven.compiler.release=7 -Dmaven.compiler.target=7 -Dmaven.compiler.source=7 -Dmaven.multiModuleProjectDirectory=C:\mvn-it-1.tmp\core-it-suite\target\test-classes\mng-5937-wrapper\bin --global-settings C:\mvn-it-1.tmp\core-it-suite\target\test-classes\settings.xml -e --batch-mode -Dmaven.repo.local=c:\mvn-it-1.tmp\it-local-repo validate 

C:\mvn-it-1.tmp\core-it-suite\target\test-classes\mng-5937-wrapper\bin>"f:\\jenkins\\tools\\java\\latest14\bin\java.exe"    -classpath "C:\mvn-it-1.tmp\core-it-suite\target\test-classes\mng-5937-wrapper\bin\.mvn\wrapper\maven-wrapper.jar" "-Dmaven.multiModuleProjectDirectory=C:\mvn-it-1.tmp\core-it-suite\target\test-classes\mng-5937-wrapper\bin" org.apache.maven.wrapper.MavenWrapperMain --batch-mode --show-version "-Dmaven.repo.local=c:\mvn-it-1.tmp/it-local-repo"  -Dmaven.compiler.release=7 -Dmaven.compiler.target=7 -Dmaven.compiler.source=7 -Dmaven.multiModuleProjectDirectory=C:\mvn-it-1.tmp\core-it-suite\target\test-classes\mng-5937-wrapper\bin --global-settings C:\mvn-it-1.tmp\core-it-suite\target\test-classes\settings.xml -e --batch-mode -Dmaven.repo.local=c:\mvn-it-1.tmp\it-local-repo validate 
Picked up JAVA_TOOL_OPTIONS: -Dmaven.ext.class.path="c:\mvn-it-1.tmp@tmp\withMaven821e6c67\pipeline-maven-spy.jar" -Dorg.jenkinsci.plugins.pipeline.maven.reportsFolder="c:\mvn-it-1.tmp@tmp\withMaven821e6c67" 
Exception in thread "main" java.nio.file.NoSuchFileException: C:\Users\jenkins\.m2\wrapper\dists\apache-maven-3.7.0-SNAPSHOT-bin\apache-maven-3.7.0-SNAPSHOT-bin.zip.part
 at java.base/sun.nio.fs.WindowsException.translateToIOException(WindowsException.java:85)
 at java.base/sun.nio.fs.WindowsException.rethrowAsIOException(WindowsException.java:103)
 at java.base/sun.nio.fs.WindowsException.rethrowAsIOException(WindowsException.java:108)
 at java.base/sun.nio.fs.WindowsFileCopy.move(WindowsFileCopy.java:326)
 at java.base/sun.nio.fs.WindowsFileSystemProvider.move(WindowsFileSystemProvider.java:292)
 at java.base/java.nio.file.Files.move(Files.java:1425)
 at org.apache.maven.wrapper.Installer.createDist(Installer.java:86)
 at org.apache.maven.wrapper.WrapperExecutor.execute(WrapperExecutor.java:147)
 at org.apache.maven.wrapper.MavenWrapperMain.main(MavenWrapperMain.java:64)

C:\mvn-it-1.tmp\core-it-suite\target\test-classes\mng-5937-wrapper\bin>if ERRORLEVEL 1 goto error 

C:\mvn-it-1.tmp\core-it-suite\target\test-classes\mng-5937-wrapper\bin>set ERROR_CODE=1 

C:\mvn-it-1.tmp\core-it-suite\target\test-classes\mng-5937-wrapper\bin>if not "" == "" goto skipRcPost 

C:\mvn-it-1.tmp\core-it-suite\target\test-classes\mng-5937-wrapper\bin>if exist "C:\Users\jenkins\mavenrc_post.bat" call "C:\Users\jenkins\mavenrc_post.bat" 

C:\mvn-it-1.tmp\core-it-suite\target\test-classes\mng-5937-wrapper\bin>if exist "C:\Users\jenkins\mavenrc_post.cmd" call "C:\Users\jenkins\mavenrc_post.cmd" 

C:\mvn-it-1.tmp\core-it-suite\target\test-classes\mng-5937-wrapper\bin>if "" == "on" pause

C:\mvn-it-1.tmp\core-it-suite\target\test-classes\mng-5937-wrapper\bin>if "on" == "on" exit 1 


Stack Trace:
org.apache.maven.it.VerificationException: 
Exit code was non-zero: 1; command line and log = 
C:\mvn-it-1.tmp\core-it-suite\target\apache-maven\bin\mvn --global-settings C:\mvn-it-1.tmp\core-it-suite\target\test-classes\settings.xml -e --batch-mode -Dmaven.repo.local=c:\mvn-it-1.tmp\it-local-repo validate

C:\mvn-it-1.tmp\core-it-suite\target\test-classes\mng-5937-wrapper\bin>if "" == "" (set "HOME=C:\Users\jenkins" ) 

C:\mvn-it-1.tmp\core-it-suite\target\test-classes\mng-5937-wrapper\bin>if not "" == "" goto skipRcPre 

C:\mvn-it-1.tmp\core-it-suite\target\test-classes\mng-5937-wrapper\bin>if exist "C:\Users\jenkins\mavenrc_pre.bat" call "C:\Users\jenkins\mavenrc_pre.bat" 

C:\mvn-it-1.tmp\core-it-suite\target\test-classes\mng-5937-wrapper\bin>if exist "C:\Users\jenkins\mavenrc_pre.cmd" call "C:\Users\jenkins\mavenrc_pre.cmd" 

C:\mvn-it-1.tmp\core-it-suite\target\test-classes\mng-5937-wrapper\bin>set ERROR_CODE=0 

C:\mvn-it-1.tmp\core-it-suite\target\test-classes\mng-5937-wrapper\bin>if not "f:\\jenkins\\tools\\java\\latest14" == "" goto OkJHome 

C:\mvn-it-1.tmp\core-it-suite\target\test-classes\mng-5937-wrapper\bin>if exist "f:\\jenkins\\tools\\java\\latest14\bin\java.exe" goto init 

C:\mvn-it-1.tmp\core-it-suite\target\test-classes\mng-5937-wrapper\bin>set MAVEN_PROJECTBASEDIR= 

C:\mvn-it-1.tmp\core-it-suite\target\test-classes\mng-5937-wrapper\bin>IF NOT "" == "" goto endDetectBaseDir 

C:\mvn-it-1.tmp\core-it-suite\target\test-classes\mng-5937-wrapper\bin>set EXEC_DIR=C:\mvn-it-1.tmp\core-it-suite\target\test-classes\mng-5937-wrapper\bin 

C:\mvn-it-1.tmp\core-it-suite\target\test-classes\mng-5937-wrapper\bin>set WDIR=C:\mvn-it-1.tmp\core-it-suite\target\test-classes\mng-5937-wrapper\bin 

C:\mvn-it-1.tmp\core-it-suite\target\test-classes\mng-5937-wrapper\bin>IF EXIST "C:\mvn-it-1.tmp\core-it-suite\target\test-classes\mng-5937-wrapper\bin"\.mvn goto baseDirFound 

C:\mvn-it-1.tmp\core-it-suite\target\test-classes\mng-5937-wrapper\bin>set MAVEN_PROJECTBASEDIR=C:\mvn-it-1.tmp\core-it-suite\target\test-classes\mng-5937-wrapper\bin 

C:\mvn-it-1.tmp\core-it-suite\target\test-classes\mng-5937-wrapper\bin>cd "C:\mvn-it-1.tmp\core-it-suite\target\test-classes\mng-5937-wrapper\bin" 

C:\mvn-it-1.tmp\core-it-suite\target\test-classes\mng-5937-wrapper\bin>goto endDetectBaseDir 

C:\mvn-it-1.tmp\core-it-suite\target\test-classes\mng-5937-wrapper\bin>IF NOT EXIST "C:\mvn-it-1.tmp\core-it-suite\target\test-classes\mng-5937-wrapper\bin\.mvn\jvm.config" goto endReadAdditionalConfig 

C:\mvn-it-1.tmp\core-it-suite\target\test-classes\mng-5937-wrapper\bin>SET MAVEN_JAVA_EXE="f:\\jenkins\\tools\\java\\latest14\bin\java.exe" 

C:\mvn-it-1.tmp\core-it-suite\target\test-classes\mng-5937-wrapper\bin>set WRAPPER_JAR="C:\mvn-it-1.tmp\core-it-suite\target\test-classes\mng-5937-wrapper\bin\.mvn\wrapper\maven-wrapper.jar" 

C:\mvn-it-1.tmp\core-it-suite\target\test-classes\mng-5937-wrapper\bin>set WRAPPER_LAUNCHER=org.apache.maven.wrapper.MavenWrapperMain 

C:\mvn-it-1.tmp\core-it-suite\target\test-classes\mng-5937-wrapper\bin>IF NOT EXIST "C:\mvn-it-1.tmp\core-it-suite\target\test-classes\mng-5937-wrapper\bin\.mvn\wrapper\maven-wrapper.jar" goto downloadWrapper 

C:\mvn-it-1.tmp\core-it-suite\target\test-classes\mng-5937-wrapper\bin>if "" == "true" ECHO Found "C:\mvn-it-1.tmp\core-it-suite\target\test-classes\mng-5937-wrapper\bin\.mvn\wrapper\maven-wrapper.jar" 

C:\mvn-it-1.tmp\core-it-suite\target\test-classes\mng-5937-wrapper\bin>goto endWrapper 

C:\mvn-it-1.tmp\core-it-suite\target\test-classes\mng-5937-wrapper\bin>set MAVEN_CMD_LINE_ARGS=-Dmaven.compiler.release=7 -Dmaven.compiler.target=7 -Dmaven.compiler.source=7 -Dmaven.multiModuleProjectDirectory=C:\mvn-it-1.tmp\core-it-suite\target\test-classes\mng-5937-wrapper\bin --global-settings C:\mvn-it-1.tmp\core-it-suite\target\test-classes\settings.xml -e --batch-mode -Dmaven.repo.local=c:\mvn-it-1.tmp\it-local-repo validate 

C:\mvn-it-1.tmp\core-it-suite\target\test-classes\mng-5937-wrapper\bin>"f:\\jenkins\\tools\\java\\latest14\bin\java.exe"    -classpath "C:\mvn-it-1.tmp\core-it-suite\target\test-classes\mng-5937-wrapper\bin\.mvn\wrapper\maven-wrapper.jar" "-Dmaven.multiModuleProjectDirectory=C:\mvn-it-1.tmp\core-it-suite\target\test-classes\mng-5937-wrapper\bin" org.apache.maven.wrapper.MavenWrapperMain --batch-mode --show-version "-Dmaven.repo.local=c:\mvn-it-1.tmp/it-local-repo"  -Dmaven.compiler.release=7 -Dmaven.compiler.target=7 -Dmaven.compiler.source=7 -Dmaven.multiModuleProjectDirectory=C:\mvn-it-1.tmp\core-it-suite\target\test-classes\mng-5937-wrapper\bin --global-settings C:\mvn-it-1.tmp\core-it-suite\target\test-classes\settings.xml -e --batch-mode -Dmaven.repo.local=c:\mvn-it-1.tmp\it-local-repo validate 
Picked up JAVA_TOOL_OPTIONS: -Dmaven.ext.class.path="c:\mvn-it-1.tmp@tmp\withMaven821e6c67\pipeline-maven-spy.jar" -Dorg.jenkinsci.plugins.pipeline.maven.reportsFolder="c:\mvn-it-1.tmp@tmp\withMaven821e6c67" 
Exception in thread "main" java.nio.file.NoSuchFileException: C:\Users\jenkins\.m2\wrapper\dists\apache-maven-3.7.0-SNAPSHOT-bin\apache-maven-3.7.0-SNAPSHOT-bin.zip.part
	at java.base/sun.nio.fs.WindowsException.translateToIOException(WindowsException.java:85)
	at java.base/sun.nio.fs.WindowsException.rethrowAsIOException(WindowsException.java:103)
	at java.base/sun.nio.fs.WindowsException.rethrowAsIOException(WindowsException.java:108)
	at java.base/sun.nio.fs.WindowsFileCopy.move(WindowsFileCopy.java:326)
	at java.base/sun.nio.fs.WindowsFileSystemProvider.move(WindowsFileSystemProvider.java:292)
	at java.base/java.nio.file.Files.move(Files.java:1425)
	at org.apache.maven.wrapper.Installer.createDist(Installer.java:86)
	at org.apache.maven.wrapper.WrapperExecutor.execute(WrapperExecutor.java:147)
	at org.apache.maven.wrapper.MavenWrapperMain.main(MavenWrapperMain.java:64)

C:\mvn-it-1.tmp\core-it-suite\target\test-classes\mng-5937-wrapper\bin>if ERRORLEVEL 1 goto error 

C:\mvn-it-1.tmp\core-it-suite\target\test-classes\mng-5937-wrapper\bin>set ERROR_CODE=1 

C:\mvn-it-1.tmp\core-it-suite\target\test-classes\mng-5937-wrapper\bin>if not "" == "" goto skipRcPost 

C:\mvn-it-1.tmp\core-it-suite\target\test-classes\mng-5937-wrapper\bin>if exist "C:\Users\jenkins\mavenrc_post.bat" call "C:\Users\jenkins\mavenrc_post.bat" 

C:\mvn-it-1.tmp\core-it-suite\target\test-classes\mng-5937-wrapper\bin>if exist "C:\Users\jenkins\mavenrc_post.cmd" call "C:\Users\jenkins\mavenrc_post.cmd" 

C:\mvn-it-1.tmp\core-it-suite\target\test-classes\mng-5937-wrapper\bin>if "" == "on" pause

C:\mvn-it-1.tmp\core-it-suite\target\test-classes\mng-5937-wrapper\bin>if "on" == "on" exit 1 

	at org.apache.maven.it.MavenITmng5937MavenWrapper.testitMNG5937Bin(MavenITmng5937MavenWrapper.java:96)


FAILED:  org.apache.maven.it.MavenITmng5937MavenWrapper.linux-jdk11 / Run ITs Linux Java 11 / testitMNG5937Bin

Error Message:
Exit code was non-zero: 127; command line and log = 
/home/jenkins/jenkins-slave/workspace/maven-box_maven_MNG-5937@2/test/core-it-suite/target/apache-maven/bin/mvn --global-settings /home/jenkins/jenkins-slave/workspace/maven-box_maven_MNG-5937@2/test/core-it-suite/target/test-classes/settings.xml -e --batch-mode -Dmaven.repo.local=/home/jenkins/jenkins-slave/workspace/maven-box_maven_MNG-5937@2/test/it-local-repo validate
/bin/sh: 1: mvnw: not found


Stack Trace:
org.apache.maven.it.VerificationException: 
Exit code was non-zero: 127; command line and log = 
/home/jenkins/jenkins-slave/workspace/maven-box_maven_MNG-5937@2/test/core-it-suite/target/apache-maven/bin/mvn --global-settings /home/jenkins/jenkins-slave/workspace/maven-box_maven_MNG-5937@2/test/core-it-suite/target/test-classes/settings.xml -e --batch-mode -Dmaven.repo.local=/home/jenkins/jenkins-slave/workspace/maven-box_maven_MNG-5937@2/test/it-local-repo validate
/bin/sh: 1: mvnw: not found

	at org.apache.maven.it.MavenITmng5937MavenWrapper.testitMNG5937Bin(MavenITmng5937MavenWrapper.java:96)


FAILED:  org.apache.maven.it.MavenITmng5937MavenWrapper.linux-jdk11 / Run ITs Linux Java 11 / testitMNG5937Script

Error Message:
Exit code was non-zero: 127; command line and log = 
/home/jenkins/jenkins-slave/workspace/maven-box_maven_MNG-5937@2/test/core-it-suite/target/apache-maven/bin/mvn --global-settings /home/jenkins/jenkins-slave/workspace/maven-box_maven_MNG-5937@2/test/core-it-suite/target/test-classes/settings.xml -e --batch-mode -Dmaven.repo.local=/home/jenkins/jenkins-slave/workspace/maven-box_maven_MNG-5937@2/test/it-local-repo validate
/bin/sh: 1: mvnw: not found


Stack Trace:
org.apache.maven.it.VerificationException: 
Exit code was non-zero: 127; command line and log = 
/home/jenkins/jenkins-slave/workspace/maven-box_maven_MNG-5937@2/test/core-it-suite/target/apache-maven/bin/mvn --global-settings /home/jenkins/jenkins-slave/workspace/maven-box_maven_MNG-5937@2/test/core-it-suite/target/test-classes/settings.xml -e --batch-mode -Dmaven.repo.local=/home/jenkins/jenkins-slave/workspace/maven-box_maven_MNG-5937@2/test/it-local-repo validate
/bin/sh: 1: mvnw: not found

	at org.apache.maven.it.MavenITmng5937MavenWrapper.testitMNG5937Script(MavenITmng5937MavenWrapper.java:111)


FAILED:  org.apache.maven.it.MavenITmng5937MavenWrapper.linux-jdk11 / Run ITs Linux Java 11 / testitMNG5937Source

Error Message:
Exit code was non-zero: 127; command line and log = 
/home/jenkins/jenkins-slave/workspace/maven-box_maven_MNG-5937@2/test/core-it-suite/target/apache-maven/bin/mvn --global-settings /home/jenkins/jenkins-slave/workspace/maven-box_maven_MNG-5937@2/test/core-it-suite/target/test-classes/settings.xml -e --batch-mode -Dmaven.repo.local=/home/jenkins/jenkins-slave/workspace/maven-box_maven_MNG-5937@2/test/it-local-repo validate
/bin/sh: 1: mvnw: not found


Stack Trace:
org.apache.maven.it.VerificationException: 
Exit code was non-zero: 127; command line and log = 
/home/jenkins/jenkins-slave/workspace/maven-box_maven_MNG-5937@2/test/core-it-suite/target/apache-maven/bin/mvn --global-settings /home/jenkins/jenkins-slave/workspace/maven-box_maven_MNG-5937@2/test/core-it-suite/target/test-classes/settings.xml -e --batch-mode -Dmaven.repo.local=/home/jenkins/jenkins-slave/workspace/maven-box_maven_MNG-5937@2/test/it-local-repo validate
/bin/sh: 1: mvnw: not found

	at org.apache.maven.it.MavenITmng5937MavenWrapper.testitMNG5937Source(MavenITmng5937MavenWrapper.java:126)




Build log:
[...truncated 79777 lines...]
[withMaven] Publishers: Pipeline Graph Publisher: 26 ms, Generated Artifacts Publisher: 12968 ms, Invoker Publisher: 8 ms, Junit Publisher: 47187 ms, Concordion Publisher: 4 ms, Dependencies Fingerprint Publisher: 114 ms, Findbugs Publisher: 2 ms, JGiven Publisher: 1 ms, Jacoco Publisher: 3 ms, SpotBugs Publisher: 3 ms, Open Task Scanner Publisher: 857 ms
[Pipeline] // withMaven
[Pipeline] fileExists
[Pipeline] zip
Writing zip file of c:\mvn-it-1.tmp\core-it-suite\target\test-classes to c:\mvn-it-1.tmp\core-it-suite-logs-windows-jdk11.zip
[Pipeline] deleteDir
[withMaven] junitPublisher - Archive test results for Maven artifact org.apache.maven.its.plugins:maven-it-plugin-active-collection:maven-plugin:2.1-SNAPSHOT generated by maven-surefire-plugin:test (default-test): core-it-support/core-it-plugins/maven-it-plugin-active-collection/target/surefire-reports/*.xml
[withMaven] junitPublisher - Archive test results for Maven artifact org.apache.maven.its.plugins:maven-it-plugin-ant-based:maven-plugin:2.1-SNAPSHOT generated by maven-surefire-plugin:test (default-test): core-it-support/core-it-plugins/maven-it-plugin-ant-based/target/surefire-reports/*.xml
[withMaven] junitPublisher - Archive test results for Maven artifact org.apache.maven.its.plugins:maven-it-plugin-artifact:maven-plugin:2.1-SNAPSHOT generated by maven-surefire-plugin:test (default-test): core-it-support/core-it-plugins/maven-it-plugin-artifact/target/surefire-reports/*.xml
[withMaven] junitPublisher - Archive test results for Maven artifact org.apache.maven.its.plugins.class-loader:dep-a:jar:2.1-SNAPSHOT generated by maven-surefire-plugin:test (default-test): core-it-support/core-it-plugins/maven-it-plugin-class-loader/dep-a/target/surefire-reports/*.xml
[withMaven] junitPublisher - Archive test results for Maven artifact org.apache.maven.its.plugins.class-loader:dep-b:jar:2.1-SNAPSHOT generated by maven-surefire-plugin:test (default-test): core-it-support/core-it-plugins/maven-it-plugin-class-loader/dep-b/target/surefire-reports/*.xml
[withMaven] junitPublisher - Archive test results for Maven artifact org.apache.maven.its.plugins.class-loader:dep-c:jar:2.1-SNAPSHOT generated by maven-surefire-plugin:test (default-test): core-it-support/core-it-plugins/maven-it-plugin-class-loader/dep-c/target/surefire-reports/*.xml
[withMaven] junitPublisher - Archive test results for Maven artifact org.apache.maven.its.plugins:maven-it-plugin-class-loader:maven-plugin:2.1-SNAPSHOT generated by maven-surefire-plugin:test (default-test): core-it-support/core-it-plugins/maven-it-plugin-class-loader/maven-it-plugin-class-loader/target/surefire-reports/*.xml
[withMaven] junitPublisher - Archive test results for Maven artifact org.apache.maven.its.plugins:maven-it-plugin-configuration:maven-plugin:2.1-SNAPSHOT generated by maven-surefire-plugin:test (default-test): core-it-support/core-it-plugins/maven-it-plugin-configuration/target/surefire-reports/*.xml
[withMaven] junitPublisher - Archive test results for Maven artifact org.apache.maven.its.plugins:maven-it-plugin-context-passing:maven-plugin:2.1-SNAPSHOT generated by maven-surefire-plugin:test (default-test): core-it-support/core-it-plugins/maven-it-plugin-context-passing/target/surefire-reports/*.xml
[withMaven] junitPublisher - Archive test results for Maven artifact org.apache.maven.plugins:maven-clean-plugin:maven-plugin:0.1-stub-SNAPSHOT generated by maven-surefire-plugin:test (default-test): core-it-support/core-it-plugins/maven-it-plugin-core-stubs/maven-clean-plugin/target/surefire-reports/*.xml
[withMaven] junitPublisher - Archive test results for Maven artifact org.apache.maven.plugins:maven-compiler-plugin:maven-plugin:0.1-stub-SNAPSHOT generated by maven-surefire-plugin:test (default-test): core-it-support/core-it-plugins/maven-it-plugin-core-stubs/maven-compiler-plugin/target/surefire-reports/*.xml
[withMaven] junitPublisher - Archive test results for Maven artifact org.apache.maven.plugins:maven-deploy-plugin:maven-plugin:0.1-stub-SNAPSHOT generated by maven-surefire-plugin:test (default-test): core-it-support/core-it-plugins/maven-it-plugin-core-stubs/maven-deploy-plugin/target/surefire-reports/*.xml
[withMaven] junitPublisher - Archive test results for Maven artifact org.apache.maven.plugins:maven-ear-plugin:maven-plugin:0.1-stub-SNAPSHOT generated by maven-surefire-plugin:test (default-test): core-it-support/core-it-plugins/maven-it-plugin-core-stubs/maven-ear-plugin/target/surefire-reports/*.xml
[withMaven] junitPublisher - Archive test results for Maven artifact org.apache.maven.plugins:maven-ejb-plugin:maven-plugin:0.1-stub-SNAPSHOT generated by maven-surefire-plugin:test (default-test): core-it-support/core-it-plugins/maven-it-plugin-core-stubs/maven-ejb-plugin/target/surefire-reports/*.xml
[withMaven] junitPublisher - Archive test results for Maven artifact org.apache.maven.plugins:maven-install-plugin:maven-plugin:0.1-stub-SNAPSHOT generated by maven-surefire-plugin:test (default-test): core-it-support/core-it-plugins/maven-it-plugin-core-stubs/maven-install-plugin/target/surefire-reports/*.xml
[withMaven] junitPublisher - Archive test results for Maven artifact org.apache.maven.plugins:maven-jar-plugin:maven-plugin:0.1-stub-SNAPSHOT generated by maven-surefire-plugin:test (default-test): core-it-support/core-it-plugins/maven-it-plugin-core-stubs/maven-jar-plugin/target/surefire-reports/*.xml
[withMaven] junitPublisher - Archive test results for Maven artifact org.apache.maven.plugins:maven-javadoc-plugin:maven-plugin:0.1-stub-SNAPSHOT generated by maven-surefire-plugin:test (default-test): core-it-support/core-it-plugins/maven-it-plugin-core-stubs/maven-javadoc-plugin/target/surefire-reports/*.xml
[withMaven] junitPublisher - Archive test results for Maven artifact org.apache.maven.plugins:maven-plugin-plugin:maven-plugin:0.1-stub-SNAPSHOT generated by maven-surefire-plugin:test (default-test): core-it-support/core-it-plugins/maven-it-plugin-core-stubs/maven-plugin-plugin/target/surefire-reports/*.xml
[withMaven] junitPublisher - Archive test results for Maven artifact org.apache.maven.plugins:maven-rar-plugin:maven-plugin:0.1-stub-SNAPSHOT generated by maven-surefire-plugin:test (default-test): core-it-support/core-it-plugins/maven-it-plugin-core-stubs/maven-rar-plugin/target/surefire-reports/*.xml
[withMaven] junitPublisher - Archive test results for Maven artifact org.apache.maven.plugins:maven-resources-plugin:maven-plugin:0.1-stub-SNAPSHOT generated by maven-surefire-plugin:test (default-test): core-it-support/core-it-plugins/maven-it-plugin-core-stubs/maven-resources-plugin/target/surefire-reports/*.xml
[withMaven] junitPublisher - Archive test results for Maven artifact org.apache.maven.plugins:maven-site-plugin:maven-plugin:0.1-stub-SNAPSHOT generated by maven-surefire-plugin:test (default-test): core-it-support/core-it-plugins/maven-it-plugin-core-stubs/maven-site-plugin/target/surefire-reports/*.xml
[withMaven] junitPublisher - Archive test results for Maven artifact org.apache.maven.plugins:maven-source-plugin:maven-plugin:0.1-stub-SNAPSHOT generated by maven-surefire-plugin:test (default-test): core-it-support/core-it-plugins/maven-it-plugin-core-stubs/maven-source-plugin/target/surefire-reports/*.xml
[withMaven] junitPublisher - Archive test results for Maven artifact org.apache.maven.plugins:maven-surefire-plugin:maven-plugin:0.1-stub-SNAPSHOT generated by maven-surefire-plugin:test (default-test): core-it-support/core-it-plugins/maven-it-plugin-core-stubs/maven-surefire-plugin/target/surefire-reports/*.xml
[withMaven] junitPublisher - Archive test results for Maven artifact org.apache.maven.plugins:maven-war-plugin:maven-plugin:0.1-stub-SNAPSHOT generated by maven-surefire-plugin:test (default-test): core-it-support/core-it-plugins/maven-it-plugin-core-stubs/maven-war-plugin/target/surefire-reports/*.xml
[withMaven] junitPublisher - Archive test results for Maven artifact org.apache.maven.its.plugins:maven-it-plugin-dependency-collection:maven-plugin:2.1-SNAPSHOT generated by maven-surefire-plugin:test (default-test): core-it-support/core-it-plugins/maven-it-plugin-dependency-collection/target/surefire-reports/*.xml
[withMaven] junitPublisher - Archive test results for Maven artifact org.apache.maven.its.plugins:maven-it-plugin-dependency-resolution:maven-plugin:2.1-SNAPSHOT generated by maven-surefire-plugin:test (default-test): core-it-support/core-it-plugins/maven-it-plugin-dependency-resolution/target/surefire-reports/*.xml
[withMaven] junitPublisher - Archive test results for Maven artifact org.apache.maven.its.plugins:maven-it-plugin-expression:maven-plugin:2.1-SNAPSHOT generated by maven-surefire-plugin:test (default-test): core-it-support/core-it-plugins/maven-it-plugin-expression/target/surefire-reports/*.xml
[withMaven] junitPublisher - Archive test results for Maven artifact org.apache.maven.its.plugins:maven-it-plugin-error:maven-plugin:2.1-SNAPSHOT generated by maven-surefire-plugin:test (default-test): core-it-support/core-it-plugins/maven-it-plugin-error/target/surefire-reports/*.xml
[withMaven] junitPublisher - Archive test results for Maven artifact org.apache.maven.its:core-it-component:jar:2.1-SNAPSHOT generated by maven-surefire-plugin:test (default-test): core-it-support/core-it-component/target/surefire-reports/*.xml
[withMaven] junitPublisher - Archive test results for Maven artifact org.apache.maven.its.plugins:maven-it-plugin-extension-consumer:maven-plugin:2.1-SNAPSHOT generated by maven-surefire-plugin:test (default-test): core-it-support/core-it-plugins/maven-it-plugin-extension-consumer/target/surefire-reports/*.xml
[withMaven] junitPublisher - Archive test results for Maven artifact org.apache.maven.its.plugins:maven-it-plugin-extension-provider:maven-plugin:2.1-SNAPSHOT generated by maven-surefire-plugin:test (default-test): core-it-support/core-it-plugins/maven-it-plugin-extension-provider/target/surefire-reports/*.xml
[withMaven] junitPublisher - Archive test results for Maven artifact org.apache.maven.its.plugins:maven-it-plugin-fork:maven-plugin:2.1-SNAPSHOT generated by maven-surefire-plugin:test (default-test): core-it-support/core-it-plugins/maven-it-plugin-fork/target/surefire-reports/*.xml
[withMaven] junitPublisher - Archive test results for Maven artifact org.apache.maven.its.plugins:maven-it-plugin-invalid-descriptor:maven-plugin:2.1-SNAPSHOT generated by maven-surefire-plugin:test (default-test): core-it-support/core-it-plugins/maven-it-plugin-invalid-descriptor/target/surefire-reports/*.xml
[withMaven] junitPublisher - Archive test results for Maven artifact org.apache.maven.its.plugins:maven-it-plugin-log-file:maven-plugin:2.1-SNAPSHOT generated by maven-surefire-plugin:test (default-test): core-it-support/core-it-plugins/maven-it-plugin-log-file/target/surefire-reports/*.xml
[withMaven] junitPublisher - Archive test results for Maven artifact org.apache.maven.its:maven-it-helper:jar:2.1-SNAPSHOT generated by maven-surefire-plugin:test (default-test): core-it-support/maven-it-helper/target/surefire-reports/*.xml
[withMaven] junitPublisher - Archive test results for Maven artifact org.apache.maven.its.plugins:maven-it-plugin-model-interpolation:maven-plugin:2.1-SNAPSHOT generated by maven-surefire-plugin:test (default-test): core-it-support/core-it-plugins/maven-it-plugin-model-interpolation/target/surefire-reports/*.xml
[withMaven] junitPublisher - Archive test results for Maven artifact org.apache.maven.its.plugins:maven-it-plugin-no-default-comp:maven-plugin:2.1-SNAPSHOT generated by maven-surefire-plugin:test (default-test): core-it-support/core-it-plugins/maven-it-plugin-no-default-comp/target/surefire-reports/*.xml
[withMaven] junitPublisher - Archive test results for Maven artifact org.apache.maven.its.plugins:maven-it-plugin-no-project:maven-plugin:2.1-SNAPSHOT generated by maven-surefire-plugin:test (default-test): core-it-support/core-it-plugins/maven-it-plugin-no-project/target/surefire-reports/*.xml
[withMaven] junitPublisher - Archive test results for Maven artifact org.apache.maven.its.plugins:maven-it-plugin-online:maven-plugin:2.1-SNAPSHOT generated by maven-surefire-plugin:test (default-test): core-it-support/core-it-plugins/maven-it-plugin-online/target/surefire-reports/*.xml
[withMaven] junitPublisher - Archive test results for Maven artifact org.apache.maven.its.plugins:maven-it-plugin-optional-mojos:maven-plugin:2.1-SNAPSHOT generated by maven-surefire-plugin:test (default-test): core-it-support/core-it-plugins/maven-it-plugin-optional-mojos/target/surefire-reports/*.xml
[withMaven] junitPublisher - Archive test results for Maven artifact org.apache.maven.its.plugins:maven-it-plugin-packaging:maven-plugin:2.1-SNAPSHOT generated by maven-surefire-plugin:test (default-test): core-it-support/core-it-plugins/maven-it-plugin-packaging/target/surefire-reports/*.xml
[withMaven] junitPublisher - Archive test results for Maven artifact org.apache.maven.its.plugins:maven-it-plugin-parameter-implementation:maven-plugin:2.1-SNAPSHOT generated by maven-surefire-plugin:test (default-test): core-it-support/core-it-plugins/maven-it-plugin-parameter-implementation/target/surefire-reports/*.xml
[withMaven] junitPublisher - Archive test results for Maven artifact org.apache.maven.its.plugins:maven-it-plugin-plugin-dependency:maven-plugin:2.1-SNAPSHOT generated by maven-surefire-plugin:test (default-test): core-it-support/core-it-plugins/maven-it-plugin-plugin-dependency/target/surefire-reports/*.xml
[withMaven] junitPublisher - Archive test results for Maven artifact org.apache.maven.its.plugins:maven-it-plugin-project:maven-plugin:2.1-SNAPSHOT generated by maven-surefire-plugin:test (default-test): core-it-support/core-it-plugins/maven-it-plugin-project/target/surefire-reports/*.xml
[withMaven] junitPublisher - Archive test results for Maven artifact org.apache.maven.its.plugins:maven-it-plugin-project-interpolation:maven-plugin:2.1-SNAPSHOT generated by maven-surefire-plugin:test (default-test): core-it-support/core-it-plugins/maven-it-plugin-project-interpolation/target/surefire-reports/*.xml
[withMaven] junitPublisher - Archive test results for Maven artifact org.apache.maven.its.plugins:maven-it-plugin-setter:maven-plugin:2.1-SNAPSHOT generated by maven-surefire-plugin:test (default-test): core-it-support/core-it-plugins/maven-it-plugin-setter/target/surefire-reports/*.xml
[withMaven] junitPublisher - Archive test results for Maven artifact org.apache.maven.its.plugins:maven-it-plugin-singleton-component:maven-plugin:2.1-SNAPSHOT generated by maven-surefire-plugin:test (default-test): core-it-support/core-it-plugins/maven-it-plugin-singleton-component/target/surefire-reports/*.xml
[withMaven] junitPublisher - Archive test results for Maven artifact org.apache.maven.its.plugins:maven-it-plugin-site:maven-plugin:2.1-SNAPSHOT generated by maven-surefire-plugin:test (default-test): core-it-support/core-it-plugins/maven-it-plugin-site/target/surefire-reports/*.xml
[withMaven] junitPublisher - Archive test results for Maven artifact org.apache.maven.its.plugins:maven-it-plugin-toolchain:maven-plugin:2.1-SNAPSHOT generated by maven-surefire-plugin:test (default-test): core-it-support/core-it-plugins/maven-it-plugin-toolchain/target/surefire-reports/*.xml
[withMaven] junitPublisher - Archive test results for Maven artifact org.apache.maven.its.plugins:maven-it-plugin-touch:maven-plugin:2.1-SNAPSHOT generated by maven-surefire-plugin:test (default-test): core-it-support/core-it-plugins/maven-it-plugin-touch/target/surefire-reports/*.xml
[withMaven] junitPublisher - Archive test results for Maven artifact org.apache.maven.its.plugins:maven-it-plugin-uses-properties:maven-plugin:2.1-SNAPSHOT generated by maven-surefire-plugin:test (default-test): core-it-support/core-it-plugins/maven-it-plugin-uses-properties/target/surefire-reports/*.xml
[withMaven] junitPublisher - Archive test results for Maven artifact org.apache.maven.its.plugins:maven-it-plugin-uses-wagon:maven-plugin:2.1-SNAPSHOT generated by maven-surefire-plugin:test (default-test): core-it-support/core-it-plugins/maven-it-plugin-uses-wagon/target/surefire-reports/*.xml
[withMaven] junitPublisher - Archive test results for Maven artifact org.apache.maven.its.plugins:maven-it-plugin-all:maven-plugin:2.1-SNAPSHOT generated by maven-surefire-plugin:test (default-test): core-it-support/core-it-plugins/maven-it-plugin-all/target/surefire-reports/*.xml
[withMaven] junitPublisher - Archive test results for Maven artifact org.apache.maven.its.plugins:maven-it-plugin-plexus-utils-11:maven-plugin:2.1-SNAPSHOT generated by maven-surefire-plugin:test (default-test): core-it-support/core-it-plugins/maven-it-plugin-plexus-utils-11/target/surefire-reports/*.xml
[withMaven] junitPublisher - Archive test results for Maven artifact org.apache.maven.its.plugins:maven-it-plugin-plexus-utils-new:maven-plugin:2.1-SNAPSHOT generated by maven-surefire-plugin:test (default-test): core-it-support/core-it-plugins/maven-it-plugin-plexus-utils-new/target/surefire-reports/*.xml
[withMaven] junitPublisher - Archive test results for Maven artifact org.apache.maven.its.plugins:maven-it-plugin-plexus-component-api:maven-plugin:2.1-SNAPSHOT generated by maven-surefire-plugin:test (default-test): core-it-support/core-it-plugins/maven-it-plugin-plexus-component-api/target/surefire-reports/*.xml
[withMaven] junitPublisher - Archive test results for Maven artifact org.apache.maven.its.plugins:maven-it-plugin-log4j:maven-plugin:2.1-SNAPSHOT generated by maven-surefire-plugin:test (default-test): core-it-support/core-it-plugins/maven-it-plugin-log4j/target/surefire-reports/*.xml
[withMaven] junitPublisher - Archive test results for Maven artifact org.apache.maven.its.plugins:maven-it-plugin-extension1:maven-plugin:2.1-SNAPSHOT generated by maven-surefire-plugin:test (default-test): core-it-support/core-it-plugins/maven-it-plugin-extension1/target/surefire-reports/*.xml
[withMaven] junitPublisher - Archive test results for Maven artifact org.apache.maven.its.plugins:maven-it-plugin-extension2:maven-plugin:2.1-SNAPSHOT generated by maven-surefire-plugin:test (default-test): core-it-support/core-it-plugins/maven-it-plugin-extension2/target/surefire-reports/*.xml
[withMaven] junitPublisher - Archive test results for Maven artifact org.apache.maven.its.plugins:maven-it-plugin-plexus-lifecycle:maven-plugin:2.1-SNAPSHOT generated by maven-surefire-plugin:test (default-test): core-it-support/core-it-plugins/maven-it-plugin-plexus-lifecycle/target/surefire-reports/*.xml
[withMaven] junitPublisher - Archive test results for Maven artifact org.apache.maven.its.plugins:maven-it-plugin-settings:maven-plugin:2.1-SNAPSHOT generated by maven-surefire-plugin:test (default-test): core-it-support/core-it-plugins/maven-it-plugin-settings/target/surefire-reports/*.xml
[withMaven] junitPublisher - Archive test results for Maven artifact org.apache.maven.its.plugins:mng-5805-pkg-type-mojo-configuration-extension:jar:2.1-SNAPSHOT generated by maven-surefire-plugin:test (default-test): core-it-support/core-it-plugins/mng5805-extension/target/surefire-reports/*.xml
[withMaven] junitPublisher - Archive test results for Maven artifact org.apache.maven.its.plugins:mng-5805-pkg-type-mojo-configuration-extension2:jar:2.1-SNAPSHOT generated by maven-surefire-plugin:test (default-test): core-it-support/core-it-plugins/mng5805-extension2/target/surefire-reports/*.xml
[withMaven] junitPublisher - Archive test results for Maven artifact org.apache.maven.its.plugins:mng-5805-pkg-type-mojo-configuration-plugin:maven-plugin:2.1-SNAPSHOT generated by maven-surefire-plugin:test (default-test): core-it-support/core-it-plugins/mng5805-plugin/target/surefire-reports/*.xml
[withMaven] junitPublisher - Archive test results for Maven artifact org.apache.maven.its.plugins:mng-5805-pkg-type-mojo-configuration-plugin-dep:jar:2.1-SNAPSHOT generated by maven-surefire-plugin:test (default-test): core-it-support/core-it-plugins/mng5805-plugin-dep/target/surefire-reports/*.xml
[withMaven] junitPublisher - Archive test results for Maven artifact org.apache.maven.its.plugins:mng-5958-pkg-type-extension:jar:2.1-SNAPSHOT generated by maven-surefire-plugin:test (default-test): core-it-support/core-it-plugins/mng5958-extension/target/surefire-reports/*.xml
[withMaven] junitPublisher - Archive test results for Maven artifact org.apache.maven.its.plugins:mng-6759-resolves-project-dependencies-plugin:maven-plugin:2.1-SNAPSHOT generated by maven-surefire-plugin:test (default-test): core-it-support/core-it-plugins/mng6759-plugin-resolves-project-dependencies/target/surefire-reports/*.xml
[withMaven] junitPublisher - Archive test results for Maven artifact org.apache.maven.its:core-it-toolchain:jar:2.1-SNAPSHOT generated by maven-surefire-plugin:test (default-test): core-it-support/core-it-toolchain/target/surefire-reports/*.xml
[withMaven] junitPublisher - Archive test results for Maven artifact org.apache.maven.its:core-it-wagon:jar:2.1-SNAPSHOT generated by maven-surefire-plugin:test (default-test): core-it-support/core-it-wagon/target/surefire-reports/*.xml
[withMaven] junitPublisher - Archive test results for Maven artifact org.apache.maven.its:core-it-extension:jar:2.1-SNAPSHOT generated by maven-surefire-plugin:test (default-test): core-it-support/core-it-extension/target/surefire-reports/*.xml
[withMaven] junitPublisher - Archive test results for Maven artifact mng-coreit:javaagent:jar:1.0-SNAPSHOT generated by maven-surefire-plugin:test (default-test): core-it-support/core-it-javaagent/target/surefire-reports/*.xml
[withMaven] junitPublisher - Archive test results for Maven artifact org.apache.maven.its:core-it-suite:jar:2.1-SNAPSHOT generated by maven-surefire-plugin:test (default-test): core-it-suite/target/surefire-reports/*.xml
Recording test results
Zipped 6621 entries.
Archiving c:\mvn-it-1.tmp\core-it-suite-logs-windows-jdk14.zip
Zipped 6621 entries.
Archiving c:\mvn-it-0.tmp\core-it-suite-logs-windows-jdk15.zip
Zipped 6621 entries.
Archiving c:\mvn-it-0.tmp\core-it-suite-logs-windows-jdk8.zip
Zipped 6621 entries.
Archiving c:\mvn-it-1.tmp\core-it-suite-logs-windows-jdk11.zip
[Pipeline] }
[Pipeline] // dir
[Pipeline] }
[Pipeline] // stage
[Pipeline] }
[Pipeline] // node
[Pipeline] }
[Pipeline] fileExists
[Pipeline] zip
[Pipeline] fileExists
[Pipeline] zip
Writing zip file of c:\mvn-it-0.tmp\core-it-suite\target\surefire-reports to c:\mvn-it-0.tmp\core-it-suite-reports-windows-jdk8.zip
Writing zip file of c:\mvn-it-1.tmp\core-it-suite\target\surefire-reports to c:\mvn-it-1.tmp\core-it-suite-reports-windows-jdk11.zip
Zipped 4 entries.
Archiving c:\mvn-it-0.tmp\core-it-suite-reports-windows-jdk8.zip
Zipped 4 entries.
Archiving c:\mvn-it-1.tmp\core-it-suite-reports-windows-jdk11.zip
[Pipeline] fileExists
[Pipeline] zip
[Pipeline] fileExists
Writing zip file of c:\mvn-it-0.tmp\core-it-suite\target\surefire-reports to c:\mvn-it-0.tmp\core-it-suite-reports-windows-jdk15.zip
[Pipeline] zip
Zipped 4 entries.
Archiving c:\mvn-it-0.tmp\core-it-suite-reports-windows-jdk15.zip
Writing zip file of c:\mvn-it-1.tmp\core-it-suite\target\surefire-reports to c:\mvn-it-1.tmp\core-it-suite-reports-windows-jdk14.zip
Zipped 4 entries.
Archiving c:\mvn-it-1.tmp\core-it-suite-reports-windows-jdk14.zip
[Pipeline] deleteDir
[Pipeline] deleteDir
[Pipeline] deleteDir
[Pipeline] deleteDir
[withMaven] openTasksPublisher - Scan Tasks for Maven artifact org.apache.maven.its.plugins:maven-it-plugin-active-collection:maven-plugin:2.1-SNAPSHOT in source directory core-it-support/core-it-plugins/maven-it-plugin-active-collection/src/main/java
[withMaven] openTasksPublisher - Scan Tasks for Maven artifact org.apache.maven.its.plugins:maven-it-plugin-artifact:maven-plugin:2.1-SNAPSHOT in source directory core-it-support/core-it-plugins/maven-it-plugin-artifact/src/main/java
[withMaven] openTasksPublisher - Scan Tasks for Maven artifact org.apache.maven.its.plugins.class-loader:dep-a:jar:2.1-SNAPSHOT in source directory core-it-support/core-it-plugins/maven-it-plugin-class-loader/dep-a/src/main/java
[withMaven] openTasksPublisher - Scan Tasks for Maven artifact org.apache.maven.its.plugins.class-loader:dep-b:jar:2.1-SNAPSHOT in source directory core-it-support/core-it-plugins/maven-it-plugin-class-loader/dep-b/src/main/java
[withMaven] openTasksPublisher - Scan Tasks for Maven artifact org.apache.maven.its.plugins:maven-it-plugin-class-loader:maven-plugin:2.1-SNAPSHOT in source directory core-it-support/core-it-plugins/maven-it-plugin-class-loader/maven-it-plugin-class-loader/src/main/java
[withMaven] openTasksPublisher - Scan Tasks for Maven artifact org.apache.maven.its.plugins:maven-it-plugin-configuration:maven-plugin:2.1-SNAPSHOT in source directory core-it-support/core-it-plugins/maven-it-plugin-configuration/src/main/java
[withMaven] openTasksPublisher - Scan Tasks for Maven artifact org.apache.maven.its.plugins:maven-it-plugin-context-passing:maven-plugin:2.1-SNAPSHOT in source directory core-it-support/core-it-plugins/maven-it-plugin-context-passing/src/main/java
[withMaven] openTasksPublisher - Scan Tasks for Maven artifact org.apache.maven.plugins:maven-clean-plugin:maven-plugin:0.1-stub-SNAPSHOT in source directory core-it-support/core-it-plugins/maven-it-plugin-core-stubs/maven-clean-plugin/src/main/java
[withMaven] openTasksPublisher - Scan Tasks for Maven artifact org.apache.maven.plugins:maven-compiler-plugin:maven-plugin:0.1-stub-SNAPSHOT in source directory core-it-support/core-it-plugins/maven-it-plugin-core-stubs/maven-compiler-plugin/src/main/java
[withMaven] openTasksPublisher - Scan Tasks for Maven artifact org.apache.maven.plugins:maven-deploy-plugin:maven-plugin:0.1-stub-SNAPSHOT in source directory core-it-support/core-it-plugins/maven-it-plugin-core-stubs/maven-deploy-plugin/src/main/java
[withMaven] openTasksPublisher - Scan Tasks for Maven artifact org.apache.maven.plugins:maven-ear-plugin:maven-plugin:0.1-stub-SNAPSHOT in source directory core-it-support/core-it-plugins/maven-it-plugin-core-stubs/maven-ear-plugin/src/main/java
[withMaven] openTasksPublisher - Scan Tasks for Maven artifact org.apache.maven.plugins:maven-ejb-plugin:maven-plugin:0.1-stub-SNAPSHOT in source directory core-it-support/core-it-plugins/maven-it-plugin-core-stubs/maven-ejb-plugin/src/main/java
[withMaven] openTasksPublisher - Scan Tasks for Maven artifact org.apache.maven.plugins:maven-install-plugin:maven-plugin:0.1-stub-SNAPSHOT in source directory core-it-support/core-it-plugins/maven-it-plugin-core-stubs/maven-install-plugin/src/main/java
[withMaven] openTasksPublisher - Scan Tasks for Maven artifact org.apache.maven.plugins:maven-jar-plugin:maven-plugin:0.1-stub-SNAPSHOT in source directory core-it-support/core-it-plugins/maven-it-plugin-core-stubs/maven-jar-plugin/src/main/java
[withMaven] openTasksPublisher - Scan Tasks for Maven artifact org.apache.maven.plugins:maven-javadoc-plugin:maven-plugin:0.1-stub-SNAPSHOT in source directory core-it-support/core-it-plugins/maven-it-plugin-core-stubs/maven-javadoc-plugin/src/main/java
[withMaven] openTasksPublisher - Scan Tasks for Maven artifact org.apache.maven.plugins:maven-plugin-plugin:maven-plugin:0.1-stub-SNAPSHOT in source directory core-it-support/core-it-plugins/maven-it-plugin-core-stubs/maven-plugin-plugin/src/main/java
[withMaven] openTasksPublisher - Scan Tasks for Maven artifact org.apache.maven.plugins:maven-rar-plugin:maven-plugin:0.1-stub-SNAPSHOT in source directory core-it-support/core-it-plugins/maven-it-plugin-core-stubs/maven-rar-plugin/src/main/java
[withMaven] openTasksPublisher - Scan Tasks for Maven artifact org.apache.maven.plugins:maven-resources-plugin:maven-plugin:0.1-stub-SNAPSHOT in source directory core-it-support/core-it-plugins/maven-it-plugin-core-stubs/maven-resources-plugin/src/main/java
[withMaven] openTasksPublisher - Scan Tasks for Maven artifact org.apache.maven.plugins:maven-site-plugin:maven-plugin:0.1-stub-SNAPSHOT in source directory core-it-support/core-it-plugins/maven-it-plugin-core-stubs/maven-site-plugin/src/main/java
[withMaven] openTasksPublisher - Scan Tasks for Maven artifact org.apache.maven.plugins:maven-source-plugin:maven-plugin:0.1-stub-SNAPSHOT in source directory core-it-support/core-it-plugins/maven-it-plugin-core-stubs/maven-source-plugin/src/main/java
[withMaven] openTasksPublisher - Scan Tasks for Maven artifact org.apache.maven.plugins:maven-surefire-plugin:maven-plugin:0.1-stub-SNAPSHOT in source directory core-it-support/core-it-plugins/maven-it-plugin-core-stubs/maven-surefire-plugin/src/main/java
[withMaven] openTasksPublisher - Scan Tasks for Maven artifact org.apache.maven.plugins:maven-war-plugin:maven-plugin:0.1-stub-SNAPSHOT in source directory core-it-support/core-it-plugins/maven-it-plugin-core-stubs/maven-war-plugin/src/main/java
[withMaven] openTasksPublisher - Scan Tasks for Maven artifact org.apache.maven.its.plugins:maven-it-plugin-dependency-collection:maven-plugin:2.1-SNAPSHOT in source directory core-it-support/core-it-plugins/maven-it-plugin-dependency-collection/src/main/java
[withMaven] openTasksPublisher - Scan Tasks for Maven artifact org.apache.maven.its.plugins:maven-it-plugin-dependency-resolution:maven-plugin:2.1-SNAPSHOT in source directory core-it-support/core-it-plugins/maven-it-plugin-dependency-resolution/src/main/java
[withMaven] openTasksPublisher - Scan Tasks for Maven artifact org.apache.maven.its.plugins:maven-it-plugin-expression:maven-plugin:2.1-SNAPSHOT in source directory core-it-support/core-it-plugins/maven-it-plugin-expression/src/main/java
[withMaven] openTasksPublisher - Scan Tasks for Maven artifact org.apache.maven.its.plugins:maven-it-plugin-error:maven-plugin:2.1-SNAPSHOT in source directory core-it-support/core-it-plugins/maven-it-plugin-error/src/main/java
[withMaven] openTasksPublisher - Scan Tasks for Maven artifact org.apache.maven.its:core-it-component:jar:2.1-SNAPSHOT in source directory core-it-support/core-it-component/src/main/java
[withMaven] openTasksPublisher - Scan Tasks for Maven artifact org.apache.maven.its.plugins:maven-it-plugin-extension-consumer:maven-plugin:2.1-SNAPSHOT in source directory core-it-support/core-it-plugins/maven-it-plugin-extension-consumer/src/main/java
[withMaven] openTasksPublisher - Scan Tasks for Maven artifact org.apache.maven.its.plugins:maven-it-plugin-extension-provider:maven-plugin:2.1-SNAPSHOT in source directory core-it-support/core-it-plugins/maven-it-plugin-extension-provider/src/main/java
[withMaven] openTasksPublisher - Scan Tasks for Maven artifact org.apache.maven.its.plugins:maven-it-plugin-fork:maven-plugin:2.1-SNAPSHOT in source directory core-it-support/core-it-plugins/maven-it-plugin-fork/src/main/java
[withMaven] openTasksPublisher - Scan Tasks for Maven artifact org.apache.maven.its.plugins:maven-it-plugin-invalid-descriptor:maven-plugin:2.1-SNAPSHOT in source directory core-it-support/core-it-plugins/maven-it-plugin-invalid-descriptor/src/main/java
[withMaven] openTasksPublisher - Scan Tasks for Maven artifact org.apache.maven.its.plugins:maven-it-plugin-log-file:maven-plugin:2.1-SNAPSHOT in source directory core-it-support/core-it-plugins/maven-it-plugin-log-file/src/main/java
[withMaven] openTasksPublisher - Scan Tasks for Maven artifact org.apache.maven.its:maven-it-helper:jar:2.1-SNAPSHOT in source directory core-it-support/maven-it-helper/src/main/java
[withMaven] openTasksPublisher - Scan Tasks for Maven artifact org.apache.maven.its.plugins:maven-it-plugin-model-interpolation:maven-plugin:2.1-SNAPSHOT in source directory core-it-support/core-it-plugins/maven-it-plugin-model-interpolation/src/main/java
[withMaven] openTasksPublisher - Scan Tasks for Maven artifact org.apache.maven.its.plugins:maven-it-plugin-no-default-comp:maven-plugin:2.1-SNAPSHOT in source directory core-it-support/core-it-plugins/maven-it-plugin-no-default-comp/src/main/java
[withMaven] openTasksPublisher - Scan Tasks for Maven artifact org.apache.maven.its.plugins:maven-it-plugin-no-project:maven-plugin:2.1-SNAPSHOT in source directory core-it-support/core-it-plugins/maven-it-plugin-no-project/src/main/java
[withMaven] openTasksPublisher - Scan Tasks for Maven artifact org.apache.maven.its.plugins:maven-it-plugin-online:maven-plugin:2.1-SNAPSHOT in source directory core-it-support/core-it-plugins/maven-it-plugin-online/src/main/java
[withMaven] openTasksPublisher - Scan Tasks for Maven artifact org.apache.maven.its.plugins:maven-it-plugin-optional-mojos:maven-plugin:2.1-SNAPSHOT in source directory core-it-support/core-it-plugins/maven-it-plugin-optional-mojos/src/main/java
[withMaven] openTasksPublisher - Scan Tasks for Maven artifact org.apache.maven.its.plugins:maven-it-plugin-packaging:maven-plugin:2.1-SNAPSHOT in source directory core-it-support/core-it-plugins/maven-it-plugin-packaging/src/main/java
[withMaven] openTasksPublisher - Scan Tasks for Maven artifact org.apache.maven.its.plugins:maven-it-plugin-parameter-implementation:maven-plugin:2.1-SNAPSHOT in source directory core-it-support/core-it-plugins/maven-it-plugin-parameter-implementation/src/main/java
[withMaven] openTasksPublisher - Scan Tasks for Maven artifact org.apache.maven.its.plugins:maven-it-plugin-plugin-dependency:maven-plugin:2.1-SNAPSHOT in source directory core-it-support/core-it-plugins/maven-it-plugin-plugin-dependency/src/main/java
[withMaven] openTasksPublisher - Scan Tasks for Maven artifact org.apache.maven.its.plugins:maven-it-plugin-project:maven-plugin:2.1-SNAPSHOT in source directory core-it-support/core-it-plugins/maven-it-plugin-project/src/main/java
[withMaven] openTasksPublisher - Scan Tasks for Maven artifact org.apache.maven.its.plugins:maven-it-plugin-project-interpolation:maven-plugin:2.1-SNAPSHOT in source directory core-it-support/core-it-plugins/maven-it-plugin-project-interpolation/src/main/java
[withMaven] openTasksPublisher - Scan Tasks for Maven artifact org.apache.maven.its.plugins:maven-it-plugin-setter:maven-plugin:2.1-SNAPSHOT in source directory core-it-support/core-it-plugins/maven-it-plugin-setter/src/main/java
[withMaven] openTasksPublisher - Scan Tasks for Maven artifact org.apache.maven.its.plugins:maven-it-plugin-singleton-component:maven-plugin:2.1-SNAPSHOT in source directory core-it-support/core-it-plugins/maven-it-plugin-singleton-component/src/main/java
[withMaven] openTasksPublisher - Scan Tasks for Maven artifact org.apache.maven.its.plugins:maven-it-plugin-site:maven-plugin:2.1-SNAPSHOT in source directory core-it-support/core-it-plugins/maven-it-plugin-site/src/main/java
[withMaven] openTasksPublisher - Scan Tasks for Maven artifact org.apache.maven.its.plugins:maven-it-plugin-toolchain:maven-plugin:2.1-SNAPSHOT in source directory core-it-support/core-it-plugins/maven-it-plugin-toolchain/src/main/java
[withMaven] openTasksPublisher - Scan Tasks for Maven artifact org.apache.maven.its.plugins:maven-it-plugin-touch:maven-plugin:2.1-SNAPSHOT in source directory core-it-support/core-it-plugins/maven-it-plugin-touch/src/main/java
[withMaven] openTasksPublisher - Scan Tasks for Maven artifact org.apache.maven.its.plugins:maven-it-plugin-uses-properties:maven-plugin:2.1-SNAPSHOT in source directory core-it-support/core-it-plugins/maven-it-plugin-uses-properties/src/main/java
[withMaven] openTasksPublisher - Scan Tasks for Maven artifact org.apache.maven.its.plugins:maven-it-plugin-uses-wagon:maven-plugin:2.1-SNAPSHOT in source directory core-it-support/core-it-plugins/maven-it-plugin-uses-wagon/src/main/java
[withMaven] openTasksPublisher - Scan Tasks for Maven artifact org.apache.maven.its.plugins:maven-it-plugin-all:maven-plugin:2.1-SNAPSHOT in source directory core-it-support/core-it-plugins/maven-it-plugin-all/src/main/java
[withMaven] openTasksPublisher - Scan Tasks for Maven artifact org.apache.maven.its.plugins:maven-it-plugin-plexus-utils-11:maven-plugin:2.1-SNAPSHOT in source directory core-it-support/core-it-plugins/maven-it-plugin-plexus-utils-11/src/main/java
[withMaven] openTasksPublisher - Scan Tasks for Maven artifact org.apache.maven.its.plugins:maven-it-plugin-plexus-utils-new:maven-plugin:2.1-SNAPSHOT in source directory core-it-support/core-it-plugins/maven-it-plugin-plexus-utils-new/src/main/java
[withMaven] openTasksPublisher - Scan Tasks for Maven artifact org.apache.maven.its.plugins:maven-it-plugin-plexus-component-api:maven-plugin:2.1-SNAPSHOT in source directory core-it-support/core-it-plugins/maven-it-plugin-plexus-component-api/src/main/java
[withMaven] openTasksPublisher - Scan Tasks for Maven artifact org.apache.maven.its.plugins:maven-it-plugin-log4j:maven-plugin:2.1-SNAPSHOT in source directory core-it-support/core-it-plugins/maven-it-plugin-log4j/src/main/java
[withMaven] openTasksPublisher - Scan Tasks for Maven artifact org.apache.maven.its.plugins:maven-it-plugin-extension1:maven-plugin:2.1-SNAPSHOT in source directory core-it-support/core-it-plugins/maven-it-plugin-extension1/src/main/java
[withMaven] openTasksPublisher - Scan Tasks for Maven artifact org.apache.maven.its.plugins:maven-it-plugin-extension2:maven-plugin:2.1-SNAPSHOT in source directory core-it-support/core-it-plugins/maven-it-plugin-extension2/src/main/java
[withMaven] openTasksPublisher - Scan Tasks for Maven artifact org.apache.maven.its.plugins:maven-it-plugin-plexus-lifecycle:maven-plugin:2.1-SNAPSHOT in source directory core-it-support/core-it-plugins/maven-it-plugin-plexus-lifecycle/src/main/java
[withMaven] openTasksPublisher - Scan Tasks for Maven artifact org.apache.maven.its.plugins:maven-it-plugin-settings:maven-plugin:2.1-SNAPSHOT in source directory core-it-support/core-it-plugins/maven-it-plugin-settings/src/main/java
[withMaven] openTasksPublisher - Scan Tasks for Maven artifact org.apache.maven.its.plugins:mng-5805-pkg-type-mojo-configuration-plugin:maven-plugin:2.1-SNAPSHOT in source directory core-it-support/core-it-plugins/mng5805-plugin/src/main/java
[withMaven] openTasksPublisher - Scan Tasks for Maven artifact org.apache.maven.its.plugins:mng-5805-pkg-type-mojo-configuration-plugin-dep:jar:2.1-SNAPSHOT in source directory core-it-support/core-it-plugins/mng5805-plugin-dep/src/main/java
[withMaven] openTasksPublisher - Scan Tasks for Maven artifact org.apache.maven.its.plugins:mng-5958-pkg-type-extension:jar:2.1-SNAPSHOT in source directory core-it-support/core-it-plugins/mng5958-extension/src/main/java
[withMaven] openTasksPublisher - Scan Tasks for Maven artifact org.apache.maven.its.plugins:mng-6759-resolves-project-dependencies-plugin:maven-plugin:2.1-SNAPSHOT in source directory core-it-support/core-it-plugins/mng6759-plugin-resolves-project-dependencies/src/main/java
[withMaven] openTasksPublisher - Scan Tasks for Maven artifact org.apache.maven.its:core-it-toolchain:jar:2.1-SNAPSHOT in source directory core-it-support/core-it-toolchain/src/main/java
[withMaven] openTasksPublisher - Scan Tasks for Maven artifact org.apache.maven.its:core-it-wagon:jar:2.1-SNAPSHOT in source directory core-it-support/core-it-wagon/src/main/java
[withMaven] openTasksPublisher - Scan Tasks for Maven artifact mng-coreit:javaagent:jar:1.0-SNAPSHOT in source directory core-it-support/core-it-javaagent/src/main/java
[TASKS] Scanning folder '/home/jenkins/jenkins-slave/workspace/maven-box_maven_MNG-5937@2/test' for files matching the pattern 'core-it-support/core-it-plugins/maven-it-plugin-active-collection/src/main/java/**/*,core-it-support/core-it-plugins/maven-it-plugin-artifact/src/main/java/**/*,core-it-support/core-it-plugins/maven-it-plugin-class-loader/dep-a/src/main/java/**/*,core-it-support/core-it-plugins/maven-it-plugin-class-loader/dep-b/src/main/java/**/*,core-it-support/core-it-plugins/maven-it-plugin-class-loader/maven-it-plugin-class-loader/src/main/java/**/*,core-it-support/core-it-plugins/maven-it-plugin-configuration/src/main/java/**/*,core-it-support/core-it-plugins/maven-it-plugin-context-passing/src/main/java/**/*,core-it-support/core-it-plugins/maven-it-plugin-core-stubs/maven-clean-plugin/src/main/java/**/*,core-it-support/core-it-plugins/maven-it-plugin-core-stubs/maven-compiler-plugin/src/main/java/**/*,core-it-support/core-it-plugins/maven-it-plugin-core-stubs/maven-deploy-plugin/src/main/java/**/*,core-it-support/core-it-plugins/maven-it-plugin-core-stubs/maven-ear-plugin/src/main/java/**/*,core-it-support/core-it-plugins/maven-it-plugin-core-stubs/maven-ejb-plugin/src/main/java/**/*,core-it-support/core-it-plugins/maven-it-plugin-core-stubs/maven-install-plugin/src/main/java/**/*,core-it-support/core-it-plugins/maven-it-plugin-core-stubs/maven-jar-plugin/src/main/java/**/*,core-it-support/core-it-plugins/maven-it-plugin-core-stubs/maven-javadoc-plugin/src/main/java/**/*,core-it-support/core-it-plugins/maven-it-plugin-core-stubs/maven-plugin-plugin/src/main/java/**/*,core-it-support/core-it-plugins/maven-it-plugin-core-stubs/maven-rar-plugin/src/main/java/**/*,core-it-support/core-it-plugins/maven-it-plugin-core-stubs/maven-resources-plugin/src/main/java/**/*,core-it-support/core-it-plugins/maven-it-plugin-core-stubs/maven-site-plugin/src/main/java/**/*,core-it-support/core-it-plugins/maven-it-plugin-core-stubs/maven-source-plugin/src/main/java/**/*,core-it-support/core-it-plugins/maven-it-plugin-core-stubs/maven-surefire-plugin/src/main/java/**/*,core-it-support/core-it-plugins/maven-it-plugin-core-stubs/maven-war-plugin/src/main/java/**/*,core-it-support/core-it-plugins/maven-it-plugin-dependency-collection/src/main/java/**/*,core-it-support/core-it-plugins/maven-it-plugin-dependency-resolution/src/main/java/**/*,core-it-support/core-it-plugins/maven-it-plugin-expression/src/main/java/**/*,core-it-support/core-it-plugins/maven-it-plugin-error/src/main/java/**/*,core-it-support/core-it-component/src/main/java/**/*,core-it-support/core-it-plugins/maven-it-plugin-extension-consumer/src/main/java/**/*,core-it-support/core-it-plugins/maven-it-plugin-extension-provider/src/main/java/**/*,core-it-support/core-it-plugins/maven-it-plugin-fork/src/main/java/**/*,core-it-support/core-it-plugins/maven-it-plugin-invalid-descriptor/src/main/java/**/*,core-it-support/core-it-plugins/maven-it-plugin-log-file/src/main/java/**/*,core-it-support/maven-it-helper/src/main/java/**/*,core-it-support/core-it-plugins/maven-it-plugin-model-interpolation/src/main/java/**/*,core-it-support/core-it-plugins/maven-it-plugin-no-default-comp/src/main/java/**/*,core-it-support/core-it-plugins/maven-it-plugin-no-project/src/main/java/**/*,core-it-support/core-it-plugins/maven-it-plugin-online/src/main/java/**/*,core-it-support/core-it-plugins/maven-it-plugin-optional-mojos/src/main/java/**/*,core-it-support/core-it-plugins/maven-it-plugin-packaging/src/main/java/**/*,core-it-support/core-it-plugins/maven-it-plugin-parameter-implementation/src/main/java/**/*,core-it-support/core-it-plugins/maven-it-plugin-plugin-dependency/src/main/java/**/*,core-it-support/core-it-plugins/maven-it-plugin-project/src/main/java/**/*,core-it-support/core-it-plugins/maven-it-plugin-project-interpolation/src/main/java/**/*,core-it-support/core-it-plugins/maven-it-plugin-setter/src/main/java/**/*,core-it-support/core-it-plugins/maven-it-plugin-singleton-component/src/main/java/**/*,core-it-support/core-it-plugins/maven-it-plugin-site/src/main/java/**/*,core-it-support/core-it-plugins/maven-it-plugin-toolchain/src/main/java/**/*,core-it-support/core-it-plugins/maven-it-plugin-touch/src/main/java/**/*,core-it-support/core-it-plugins/maven-it-plugin-uses-properties/src/main/java/**/*,core-it-support/core-it-plugins/maven-it-plugin-uses-wagon/src/main/java/**/*,core-it-support/core-it-plugins/maven-it-plugin-all/src/main/java/**/*,core-it-support/core-it-plugins/maven-it-plugin-plexus-utils-11/src/main/java/**/*,core-it-support/core-it-plugins/maven-it-plugin-plexus-utils-new/src/main/java/**/*,core-it-support/core-it-plugins/maven-it-plugin-plexus-component-api/src/main/java/**/*,core-it-support/core-it-plugins/maven-it-plugin-log4j/src/main/java/**/*,core-it-support/core-it-plugins/maven-it-plugin-extension1/src/main/java/**/*,core-it-support/core-it-plugins/maven-it-plugin-extension2/src/main/java/**/*,core-it-support/core-it-plugins/maven-it-plugin-plexus-lifecycle/src/main/java/**/*,core-it-support/core-it-plugins/maven-it-plugin-settings/src/main/java/**/*,core-it-support/core-it-plugins/mng5805-plugin/src/main/java/**/*,core-it-support/core-it-plugins/mng5805-plugin-dep/src/main/java/**/*,core-it-support/core-it-plugins/mng5958-extension/src/main/java/**/*,core-it-support/core-it-plugins/mng6759-plugin-resolves-project-dependencies/src/main/java/**/*,core-it-support/core-it-toolchain/src/main/java/**/*,core-it-support/core-it-wagon/src/main/java/**/*,core-it-support/core-it-javaagent/src/main/java/**/*' - excludes: null
[TASKS] Found 166 files to scan for tasks
[TASKS] Found 0 open tasks.
Skipping warnings blame since pipelines do not have an SCM link.%n
[TASKS] Computing warning deltas based on reference build #3
[withMaven] Publishers: Pipeline Graph Publisher: 30 ms, Generated Artifacts Publisher: 632886 ms, Invoker Publisher: 15 ms, Junit Publisher: 286508 ms, Concordion Publisher: 8 ms, Dependencies Fingerprint Publisher: 2498 ms, Findbugs Publisher: 2 ms, JGiven Publisher: 3 ms, Jacoco Publisher: 3 ms, SpotBugs Publisher: 3 ms, Open Task Scanner Publisher: 12422 ms
[Pipeline] // withMaven
[Pipeline] fileExists
[Pipeline] zip
Writing zip file of /home/jenkins/jenkins-slave/workspace/maven-box_maven_MNG-5937@2/test/core-it-suite/target/test-classes to /home/jenkins/jenkins-slave/workspace/maven-box_maven_MNG-5937@2/test/core-it-suite-logs-linux-jdk11.zip
Zipped 6615 entries.
Archiving /home/jenkins/jenkins-slave/workspace/maven-box_maven_MNG-5937@2/test/core-it-suite-logs-linux-jdk11.zip
[Pipeline] }
[Pipeline] // dir
[Pipeline] }
[Pipeline] // stage
[Pipeline] }
[Pipeline] // node
[Pipeline] }
[Pipeline] }
[Pipeline] // dir
[Pipeline] }
[Pipeline] // stage
[Pipeline] }
[Pipeline] // node
[Pipeline] }
[Pipeline] fileExists
[Pipeline] zip
Writing zip file of /home/jenkins/jenkins-slave/workspace/maven-box_maven_MNG-5937@2/test/core-it-suite/target/surefire-reports to /home/jenkins/jenkins-slave/workspace/maven-box_maven_MNG-5937@2/test/core-it-suite-reports-linux-jdk11.zip
Zipped 4 entries.
Archiving /home/jenkins/jenkins-slave/workspace/maven-box_maven_MNG-5937@2/test/core-it-suite-reports-linux-jdk11.zip
[Pipeline] deleteDir
[Pipeline] }
[Pipeline] // dir
[Pipeline] }
[Pipeline] // stage
[Pipeline] }
[Pipeline] // node
[Pipeline] }
[Pipeline] }
[Pipeline] // dir
[Pipeline] }
[Pipeline] // stage
[Pipeline] }
[Pipeline] // node
[Pipeline] }
[Pipeline] }
[Pipeline] // dir
[Pipeline] }
[Pipeline] // stage
[Pipeline] }
[Pipeline] // node
[Pipeline] }
[Pipeline] // parallel
[Pipeline] stage
[Pipeline] { (Notifications)
[Pipeline] echo
Build result: UNSTABLE
[Pipeline] jiraIssueSelector
[Pipeline] jiraComment
[Pipeline] echo
The authors of changes [rfscholte].
[Pipeline] echo
Sending email ...
[Pipeline] emailext
Mime
  • Unnamed multipart/mixed (inline, None, 0 bytes)
View raw message