maven-notifications mailing list archives

Site index · List index
Message view « Date » · « Thread »
Top « Date » · « Thread »
From Apache Jenkins Server <jenk...@builds.apache.org>
Subject Build failed in Jenkins: Maven TLP » maven-dist-tool » master #511
Date Sun, 10 May 2020 13:27:17 GMT
See https://builds.apache.org/job/maven-box/job/maven-dist-tool/job/master/511/

Changes:

* Revert "add Maven core documentation urls for older releases"

All tests passed

Build log:
[...truncated 5191 lines...]
[2020-05-10T13:24:58.728Z] [INFO]   apache-maven [3.0,3.1.0-alpha-1)
[2020-05-10T13:24:58.728Z] [INFO]   apache-maven [3.1.0,3.2.0-alpha-1)
[2020-05-10T13:24:58.728Z] [INFO]   apache-maven [3.2.0,3.3.0-alpha-1)
[2020-05-10T13:24:58.728Z] [INFO]   apache-maven [3.3.0,3.4.0-alpha-1)
[2020-05-10T13:24:58.728Z] [INFO]   apache-maven [3.5.0,3.6.0-alpha-1)
[2020-05-10T13:24:58.728Z] [INFO]   apache-maven
[2020-05-10T13:24:58.728Z] [INFO] /jxr: org.apache.maven.jxr
[2020-05-10T13:24:58.728Z] [INFO]   jxr
[2020-05-10T13:24:58.728Z] [INFO] /plugin-testing: org.apache.maven.plugin-testing
[2020-05-10T13:24:58.728Z] [INFO]   maven-plugin-testing
[2020-05-10T13:24:58.728Z] [INFO] /plugin-tools: org.apache.maven.plugin-tools
[2020-05-10T13:24:58.728Z] [INFO]   maven-plugin-tools
[2020-05-10T13:24:58.728Z] [INFO] /plugins: org.apache.maven.plugins https://maven.apache.org/plugins/
[2020-05-10T13:24:58.728Z] [INFO]   maven-acr-plugin
[2020-05-10T13:25:00.207Z] [INFO]   maven-antrun-plugin
[2020-05-10T13:25:00.207Z] [INFO]   * maven-archetype-plugin
[2020-05-10T13:25:00.207Z] [INFO]   maven-assembly-plugin
[2020-05-10T13:25:00.207Z] [INFO]   maven-changelog-plugin
[2020-05-10T13:25:00.207Z] [INFO]   maven-changes-plugin
[2020-05-10T13:25:00.207Z] [INFO]   maven-checkstyle-plugin
[2020-05-10T13:25:00.207Z] [INFO]   maven-clean-plugin
[2020-05-10T13:25:00.207Z] [INFO]   maven-compiler-plugin
[2020-05-10T13:25:00.207Z] [INFO]   maven-dependency-plugin
[2020-05-10T13:25:00.207Z] [INFO]   maven-deploy-plugin
[2020-05-10T13:25:00.207Z] [INFO]   maven-doap-plugin
[2020-05-10T13:25:00.207Z] [INFO]   maven-docck-plugin
[2020-05-10T13:25:00.207Z] [INFO]   maven-ear-plugin
[2020-05-10T13:25:00.207Z] [INFO]   maven-ejb-plugin
[2020-05-10T13:25:00.207Z] [INFO]   * maven-enforcer-plugin 
[2020-05-10T13:25:00.207Z] [INFO]   * maven-failsafe-plugin
[2020-05-10T13:25:00.207Z] [INFO]   maven-gpg-plugin
[2020-05-10T13:25:00.207Z] [INFO]   maven-help-plugin
[2020-05-10T13:25:00.207Z] [INFO]   maven-install-plugin
[2020-05-10T13:25:00.207Z] [INFO]   maven-invoker-plugin
[2020-05-10T13:25:00.207Z] [INFO]   maven-jar-plugin
[2020-05-10T13:25:00.207Z] [INFO]   maven-jarsigner-plugin
[2020-05-10T13:25:00.207Z] [INFO]   maven-javadoc-plugin
[2020-05-10T13:25:00.207Z] [INFO]   maven-jdeps-plugin
[2020-05-10T13:25:00.207Z] [INFO]   maven-jdeprscan-plugin
[2020-05-10T13:25:00.207Z] [INFO]   maven-jlink-plugin
[2020-05-10T13:25:00.207Z] [INFO]   maven-jmod-plugin
[2020-05-10T13:25:00.207Z] [INFO]   * maven-jxr-plugin 
[2020-05-10T13:25:00.207Z] [INFO]   maven-linkcheck-plugin
[2020-05-10T13:25:00.207Z] [INFO]   maven-patch-plugin
[2020-05-10T13:25:00.207Z] [INFO]   maven-pdf-plugin
[2020-05-10T13:25:00.207Z] [INFO]   * maven-plugin-plugin
[2020-05-10T13:25:00.207Z] [INFO]   maven-pmd-plugin
[2020-05-10T13:25:00.207Z] [INFO]   maven-project-info-reports-plugin
[2020-05-10T13:25:00.207Z] [INFO]   maven-rar-plugin
[2020-05-10T13:25:00.207Z] [INFO]   * maven-release-plugin  
[2020-05-10T13:25:00.207Z] [INFO]   maven-remote-resources-plugin
[2020-05-10T13:25:00.207Z] [INFO]   maven-resources-plugin
[2020-05-10T13:25:00.207Z] [INFO]   * maven-scm-plugin
[2020-05-10T13:25:00.207Z] [INFO]   maven-scm-publish-plugin
[2020-05-10T13:25:00.207Z] [INFO]   maven-shade-plugin
[2020-05-10T13:25:00.207Z] [INFO]   maven-site-plugin
[2020-05-10T13:25:00.207Z] [INFO]   maven-source-plugin
[2020-05-10T13:25:00.207Z] [INFO]   maven-stage-plugin
[2020-05-10T13:25:00.207Z] [INFO]   * maven-surefire-plugin
[2020-05-10T13:25:00.207Z] [INFO]   * maven-surefire-report-plugin
[2020-05-10T13:25:00.207Z] [INFO]   maven-toolchains-plugin
[2020-05-10T13:25:00.207Z] [INFO]   maven-verifier-plugin
[2020-05-10T13:25:00.207Z] [INFO]   maven-war-plugin
[2020-05-10T13:25:00.207Z] [INFO] /pom: org.apache https://maven.apache.org/pom/
[2020-05-10T13:25:00.207Z] [INFO] > apache index-path = /asf/
[2020-05-10T13:25:00.207Z] [INFO] > apache site = https://maven.apache.org/pom/asf/
[2020-05-10T13:25:00.207Z] [INFO]   apache
[2020-05-10T13:25:00.207Z] [INFO] /pom: org.apache.maven https://maven.apache.org/pom/
[2020-05-10T13:25:00.207Z] [INFO] > maven-parent index-path = /maven/
[2020-05-10T13:25:00.207Z] [INFO] > maven-parent site = https://maven.apache.org/pom/maven/
[2020-05-10T13:25:00.207Z] [INFO]   maven-parent
[2020-05-10T13:25:00.207Z] [INFO] /release: org.apache.maven.release
[2020-05-10T13:25:00.207Z] [INFO]   maven-release (,3) 
[2020-05-10T13:25:00.207Z] [INFO] /reporting: org.apache.maven.reporting https://maven.apache.org/shared/
[2020-05-10T13:25:00.207Z] [INFO]   maven-reporting-api
[2020-05-10T13:25:00.207Z] [INFO]   maven-reporting-exec
[2020-05-10T13:25:00.207Z] [INFO]   maven-reporting-impl
[2020-05-10T13:25:00.207Z] [INFO] /resolver: org.apache.maven.resolver
[2020-05-10T13:25:00.207Z] [INFO]   maven-resolver
[2020-05-10T13:25:00.208Z] [INFO] /resources: org.apache.apache.resources
[2020-05-10T13:25:00.208Z] [INFO] > apache-source-release-assembly-descriptor site = http://maven.apache.org/apache-resource-bundles/
[2020-05-10T13:25:00.208Z] [INFO]   apache-source-release-assembly-descriptor
[2020-05-10T13:25:00.208Z] [INFO] /resources: org.apache
[2020-05-10T13:25:00.208Z] [INFO] > apache-incubator-disclaimer-resource-bundle site =
http://maven.apache.org/apache-resource-bundles/
[2020-05-10T13:25:00.208Z] [INFO]   apache-incubator-disclaimer-resource-bundle (,1.1]
[2020-05-10T13:25:00.208Z] [INFO] > apache-jar-resource-bundle site = http://maven.apache.org/apache-resource-bundles/
[2020-05-10T13:25:00.208Z] [INFO]   apache-jar-resource-bundle (,1.4]
[2020-05-10T13:25:00.208Z] [INFO] > apache-license-header-resource-bundle site = http://maven.apache.org/apache-resource-bundles/
[2020-05-10T13:25:00.208Z] [INFO]   apache-license-header-resource-bundle (,1.1]
[2020-05-10T13:25:00.208Z] [INFO] /scm: org.apache.maven.scm
[2020-05-10T13:25:00.208Z] [INFO]   maven-scm 
[2020-05-10T13:25:00.208Z] [INFO] /shared: org.apache.maven.shared https://maven.apache.org/shared/
[2020-05-10T13:25:00.208Z] [INFO]   file-management
[2020-05-10T13:25:00.208Z] [INFO]   maven-artifact-transfer
[2020-05-10T13:25:00.208Z] [INFO]   maven-common-artifact-filters
[2020-05-10T13:25:00.208Z] [INFO]   maven-dependency-analyzer
[2020-05-10T13:25:00.922Z] [INFO]   maven-dependency-tree
[2020-05-10T13:25:00.922Z] [INFO]   maven-filtering
[2020-05-10T13:25:00.922Z] [INFO]   maven-invoker
[2020-05-10T13:25:00.922Z] [INFO]   maven-jarsigner
[2020-05-10T13:25:00.922Z] [INFO]   maven-mapping
[2020-05-10T13:25:00.922Z] [INFO]   maven-script-interpreter
[2020-05-10T13:25:00.922Z] [INFO]   maven-shared-incremental
[2020-05-10T13:25:00.922Z] [INFO]   maven-shared-jar
[2020-05-10T13:25:00.922Z] [INFO]   maven-shared-resources
[2020-05-10T13:25:00.922Z] [INFO]   maven-shared-utils
[2020-05-10T13:25:00.922Z] [INFO]   maven-shared-io
[2020-05-10T13:25:00.922Z] [INFO]   maven-verifier
[2020-05-10T13:25:00.922Z] [INFO] /shared: org.apache.maven https://maven.apache.org/shared/
[2020-05-10T13:25:00.922Z] [INFO]   maven-archiver
[2020-05-10T13:25:00.922Z] [INFO] > maven-skins index-path = /skins/
[2020-05-10T13:25:00.922Z] [INFO] /skins: org.apache.maven.skins https://maven.apache.org/skins/
[2020-05-10T13:25:00.922Z] [INFO]   maven-default-skin
[2020-05-10T13:25:00.922Z] [INFO]   maven-fluido-skin
[2020-05-10T13:25:00.922Z] [INFO] /surefire: org.apache.maven.surefire
[2020-05-10T13:25:00.922Z] [INFO]   surefire
[2020-05-10T13:25:00.922Z] [INFO] /wagon: org.apache.maven.wagon
[2020-05-10T13:25:00.922Z] [INFO]   wagon
[2020-05-10T13:25:00.922Z] [INFO] 
[2020-05-10T13:25:00.922Z] [INFO] Generating "Dist Tool> Check Errors" report --- dist-tool-plugin:1.0-SNAPSHOT:check-errors
[2020-05-10T13:25:00.922Z] [INFO] Generating "Dist Tool> List Plugins Prerequisites" report
--- dist-tool-plugin:1.0-SNAPSHOT:list-plugins-prerequisites
[2020-05-10T13:25:05.120Z] [INFO] Generating "Dist Tool> List Master Jobs" report --- dist-tool-plugin:1.0-SNAPSHOT:list-master-jobs
[2020-05-10T13:26:00.982Z] IOException try 1 while reading https://builds.apache.org/job/maven-box/job/maven-metric:
class org.jsoup.HttpStatusException HTTP error fetching URL
[2020-05-10T13:26:06.312Z] IOException try 2 while reading https://builds.apache.org/job/maven-box/job/maven-metric:
class org.jsoup.HttpStatusException HTTP error fetching URL
[2020-05-10T13:26:17.441Z] IOException try 3 while reading https://builds.apache.org/job/maven-box/job/maven-metric:
class org.jsoup.HttpStatusException HTTP error fetching URL
[2020-05-10T13:26:17.441Z] [WARNING] Failed to read status for maven-metric Jenkins job https://builds.apache.org/job/maven-box/job/maven-metric
[2020-05-10T13:26:17.441Z] IOException try 1 while reading https://builds.apache.org/job/maven-box/job/maven-metric-extension:
class org.jsoup.HttpStatusException HTTP error fetching URL
[2020-05-10T13:26:26.828Z] IOException try 2 while reading https://builds.apache.org/job/maven-box/job/maven-metric-extension:
class org.jsoup.HttpStatusException HTTP error fetching URL
[2020-05-10T13:26:38.115Z] IOException try 3 while reading https://builds.apache.org/job/maven-box/job/maven-metric-extension:
class org.jsoup.HttpStatusException HTTP error fetching URL
[2020-05-10T13:26:38.115Z] [WARNING] Failed to read status for maven-metric-extension Jenkins
job https://builds.apache.org/job/maven-box/job/maven-metric-extension
[2020-05-10T13:27:12.598Z] [WARNING] https://builds.apache.org/job/maven-box/job/maven-wrapper-plugin
is missing id job_master
[2020-05-10T13:27:12.598Z] [INFO] Generating "Dist Tool> Failure Hack" report --- dist-tool-plugin:1.0-SNAPSHOT:failure-report
[2020-05-10T13:27:12.598Z] [ERROR] check-source-release.log error log not empty:
[2020-05-10T13:27:12.598Z] Missing file for apache-maven in https://repo.maven.apache.org/maven2/org/apache/maven/apache-maven/3.0.5/
[2020-05-10T13:27:12.598Z]  > apache-maven-3.0.5-src.zip.sha1 or .sha512 <
[2020-05-10T13:27:12.599Z] 
[2020-05-10T13:27:12.599Z] [INFO] ------------------------------------------------------------------------
[2020-05-10T13:27:12.599Z] [INFO] BUILD FAILURE
[2020-05-10T13:27:12.599Z] [INFO] ------------------------------------------------------------------------
[2020-05-10T13:27:12.599Z] [INFO] Total time:  04:16 min
[2020-05-10T13:27:12.599Z] [INFO] Finished at: 2020-05-10T13:27:11Z
[2020-05-10T13:27:12.599Z] [INFO] ------------------------------------------------------------------------
[2020-05-10T13:27:12.599Z] [WARNING] The requested profile "apache.snapshots" could not be
activated because it does not exist.
[2020-05-10T13:27:12.599Z] [INFO] [jenkins-event-spy] Generated /home/jenkins/jenkins-slave/workspace/maven-box_maven-dist-tool_master@tmp/withMavenca4efa02/maven-spy-20200510-132255-606774930415311630524.log
[2020-05-10T13:27:12.599Z] [ERROR] Failed to execute goal org.apache.maven.plugins:maven-site-plugin:3.7.1:site
(default-site) on project dist-tool-plugin: Error generating dist-tool-plugin:1.0-SNAPSHOT:failure-report
report: Dist Tool> Checks found inconsistencies in some released artifacts, see https://builds.apache.org/job/dist-tool-plugin/site/dist-tool-check-errors.html
for more information -> [Help 1]
[2020-05-10T13:27:12.599Z] org.apache.maven.lifecycle.LifecycleExecutionException: Failed
to execute goal org.apache.maven.plugins:maven-site-plugin:3.7.1:site (default-site) on project
dist-tool-plugin: Error generating dist-tool-plugin:1.0-SNAPSHOT:failure-report report
[2020-05-10T13:27:12.599Z]     at org.apache.maven.lifecycle.internal.MojoExecutor.execute
(MojoExecutor.java:215)
[2020-05-10T13:27:12.599Z]     at org.apache.maven.lifecycle.internal.MojoExecutor.execute
(MojoExecutor.java:156)
[2020-05-10T13:27:12.599Z]     at org.apache.maven.lifecycle.internal.MojoExecutor.execute
(MojoExecutor.java:148)
[2020-05-10T13:27:12.599Z]     at org.apache.maven.lifecycle.internal.LifecycleModuleBuilder.buildProject
(LifecycleModuleBuilder.java:117)
[2020-05-10T13:27:12.599Z]     at org.apache.maven.lifecycle.internal.LifecycleModuleBuilder.buildProject
(LifecycleModuleBuilder.java:81)
[2020-05-10T13:27:12.599Z]     at org.apache.maven.lifecycle.internal.builder.singlethreaded.SingleThreadedBuilder.build
(SingleThreadedBuilder.java:56)
[2020-05-10T13:27:12.599Z]     at org.apache.maven.lifecycle.internal.LifecycleStarter.execute
(LifecycleStarter.java:128)
[2020-05-10T13:27:12.599Z]     at org.apache.maven.DefaultMaven.doExecute (DefaultMaven.java:305)
[2020-05-10T13:27:12.599Z]     at org.apache.maven.DefaultMaven.doExecute (DefaultMaven.java:192)
[2020-05-10T13:27:12.599Z]     at org.apache.maven.DefaultMaven.execute (DefaultMaven.java:105)
[2020-05-10T13:27:12.599Z]     at org.apache.maven.cli.MavenCli.execute (MavenCli.java:957)
[2020-05-10T13:27:12.599Z]     at org.apache.maven.cli.MavenCli.doMain (MavenCli.java:289)
[2020-05-10T13:27:12.600Z]     at org.apache.maven.cli.MavenCli.main (MavenCli.java:193)
[2020-05-10T13:27:12.600Z]     at sun.reflect.NativeMethodAccessorImpl.invoke0 (Native Method)
[2020-05-10T13:27:12.600Z]     at sun.reflect.NativeMethodAccessorImpl.invoke (NativeMethodAccessorImpl.java:62)
[2020-05-10T13:27:12.600Z]     at sun.reflect.DelegatingMethodAccessorImpl.invoke (DelegatingMethodAccessorImpl.java:43)
[2020-05-10T13:27:12.600Z]     at java.lang.reflect.Method.invoke (Method.java:498)
[2020-05-10T13:27:12.600Z]     at org.codehaus.plexus.classworlds.launcher.Launcher.launchEnhanced
(Launcher.java:282)
[2020-05-10T13:27:12.600Z]     at org.codehaus.plexus.classworlds.launcher.Launcher.launch
(Launcher.java:225)
[2020-05-10T13:27:12.600Z]     at org.codehaus.plexus.classworlds.launcher.Launcher.mainWithExitCode
(Launcher.java:406)
[2020-05-10T13:27:12.600Z]     at org.codehaus.plexus.classworlds.launcher.Launcher.main (Launcher.java:347)
[2020-05-10T13:27:12.600Z] Caused by: org.apache.maven.plugin.MojoExecutionException: Error
generating dist-tool-plugin:1.0-SNAPSHOT:failure-report report
[2020-05-10T13:27:12.600Z]     at org.apache.maven.plugins.site.render.SiteMojo.execute (SiteMojo.java:155)
[2020-05-10T13:27:12.600Z]     at org.apache.maven.plugin.DefaultBuildPluginManager.executeMojo
(DefaultBuildPluginManager.java:137)
[2020-05-10T13:27:12.600Z]     at org.apache.maven.lifecycle.internal.MojoExecutor.execute
(MojoExecutor.java:210)
[2020-05-10T13:27:12.600Z]     at org.apache.maven.lifecycle.internal.MojoExecutor.execute
(MojoExecutor.java:156)
[2020-05-10T13:27:12.600Z]     at org.apache.maven.lifecycle.internal.MojoExecutor.execute
(MojoExecutor.java:148)
[2020-05-10T13:27:12.600Z]     at org.apache.maven.lifecycle.internal.LifecycleModuleBuilder.buildProject
(LifecycleModuleBuilder.java:117)
[2020-05-10T13:27:12.600Z]     at org.apache.maven.lifecycle.internal.LifecycleModuleBuilder.buildProject
(LifecycleModuleBuilder.java:81)
[2020-05-10T13:27:12.600Z]     at org.apache.maven.lifecycle.internal.builder.singlethreaded.SingleThreadedBuilder.build
(SingleThreadedBuilder.java:56)
[2020-05-10T13:27:12.600Z]     at org.apache.maven.lifecycle.internal.LifecycleStarter.execute
(LifecycleStarter.java:128)
[2020-05-10T13:27:12.600Z]     at org.apache.maven.DefaultMaven.doExecute (DefaultMaven.java:305)
[2020-05-10T13:27:12.600Z]     at org.apache.maven.DefaultMaven.doExecute (DefaultMaven.java:192)
[2020-05-10T13:27:12.600Z]     at org.apache.maven.DefaultMaven.execute (DefaultMaven.java:105)
[2020-05-10T13:27:12.600Z]     at org.apache.maven.cli.MavenCli.execute (MavenCli.java:957)
[2020-05-10T13:27:12.600Z]     at org.apache.maven.cli.MavenCli.doMain (MavenCli.java:289)
[2020-05-10T13:27:12.600Z]     at org.apache.maven.cli.MavenCli.main (MavenCli.java:193)
[2020-05-10T13:27:12.600Z]     at sun.reflect.NativeMethodAccessorImpl.invoke0 (Native Method)
[2020-05-10T13:27:12.600Z]     at sun.reflect.NativeMethodAccessorImpl.invoke (NativeMethodAccessorImpl.java:62)
[2020-05-10T13:27:12.600Z]     at sun.reflect.DelegatingMethodAccessorImpl.invoke (DelegatingMethodAccessorImpl.java:43)
[2020-05-10T13:27:12.600Z]     at java.lang.reflect.Method.invoke (Method.java:498)
[2020-05-10T13:27:12.601Z]     at org.codehaus.plexus.classworlds.launcher.Launcher.launchEnhanced
(Launcher.java:282)
[2020-05-10T13:27:12.601Z]     at org.codehaus.plexus.classworlds.launcher.Launcher.launch
(Launcher.java:225)
[2020-05-10T13:27:12.601Z]     at org.codehaus.plexus.classworlds.launcher.Launcher.mainWithExitCode
(Launcher.java:406)
[2020-05-10T13:27:12.601Z]     at org.codehaus.plexus.classworlds.launcher.Launcher.main (Launcher.java:347)
[2020-05-10T13:27:12.601Z] Caused by: org.apache.maven.reporting.MavenReportException: Dist
Tool> Checks found inconsistencies in some released artifacts, see https://builds.apache.org/job/dist-tool-plugin/site/dist-tool-check-errors.html
for more information
[2020-05-10T13:27:12.601Z]     at org.apache.maven.dist.tools.DistCheckErrorsMojo.executeReport
(DistCheckErrorsMojo.java:113)
[2020-05-10T13:27:12.601Z]     at org.apache.maven.reporting.AbstractMavenReport.generate
(AbstractMavenReport.java:251)
[2020-05-10T13:27:12.601Z]     at org.apache.maven.plugins.site.render.ReportDocumentRenderer.renderDocument
(ReportDocumentRenderer.java:230)
[2020-05-10T13:27:12.601Z]     at org.apache.maven.doxia.siterenderer.DefaultSiteRenderer.render
(DefaultSiteRenderer.java:349)
[2020-05-10T13:27:12.601Z]     at org.apache.maven.plugins.site.render.SiteMojo.renderLocale
(SiteMojo.java:198)
[2020-05-10T13:27:12.601Z]     at org.apache.maven.plugins.site.render.SiteMojo.execute (SiteMojo.java:147)
[2020-05-10T13:27:12.601Z]     at org.apache.maven.plugin.DefaultBuildPluginManager.executeMojo
(DefaultBuildPluginManager.java:137)
[2020-05-10T13:27:12.601Z]     at org.apache.maven.lifecycle.internal.MojoExecutor.execute
(MojoExecutor.java:210)
[2020-05-10T13:27:12.601Z]     at org.apache.maven.lifecycle.internal.MojoExecutor.execute
(MojoExecutor.java:156)
[2020-05-10T13:27:12.601Z]     at org.apache.maven.lifecycle.internal.MojoExecutor.execute
(MojoExecutor.java:148)
[2020-05-10T13:27:12.601Z]     at org.apache.maven.lifecycle.internal.LifecycleModuleBuilder.buildProject
(LifecycleModuleBuilder.java:117)
[2020-05-10T13:27:12.601Z]     at org.apache.maven.lifecycle.internal.LifecycleModuleBuilder.buildProject
(LifecycleModuleBuilder.java:81)
[2020-05-10T13:27:12.601Z]     at org.apache.maven.lifecycle.internal.builder.singlethreaded.SingleThreadedBuilder.build
(SingleThreadedBuilder.java:56)
[2020-05-10T13:27:12.601Z]     at org.apache.maven.lifecycle.internal.LifecycleStarter.execute
(LifecycleStarter.java:128)
[2020-05-10T13:27:12.601Z]     at org.apache.maven.DefaultMaven.doExecute (DefaultMaven.java:305)
[2020-05-10T13:27:12.601Z]     at org.apache.maven.DefaultMaven.doExecute (DefaultMaven.java:192)
[2020-05-10T13:27:12.601Z]     at org.apache.maven.DefaultMaven.execute (DefaultMaven.java:105)
[2020-05-10T13:27:12.601Z]     at org.apache.maven.cli.MavenCli.execute (MavenCli.java:957)
[2020-05-10T13:27:12.601Z]     at org.apache.maven.cli.MavenCli.doMain (MavenCli.java:289)
[2020-05-10T13:27:12.601Z]     at org.apache.maven.cli.MavenCli.main (MavenCli.java:193)
[2020-05-10T13:27:12.601Z]     at sun.reflect.NativeMethodAccessorImpl.invoke0 (Native Method)
[2020-05-10T13:27:12.601Z]     at sun.reflect.NativeMethodAccessorImpl.invoke (NativeMethodAccessorImpl.java:62)
[2020-05-10T13:27:12.601Z]     at sun.reflect.DelegatingMethodAccessorImpl.invoke (DelegatingMethodAccessorImpl.java:43)
[2020-05-10T13:27:12.602Z]     at java.lang.reflect.Method.invoke (Method.java:498)
[2020-05-10T13:27:12.602Z]     at org.codehaus.plexus.classworlds.launcher.Launcher.launchEnhanced
(Launcher.java:282)
[2020-05-10T13:27:12.602Z]     at org.codehaus.plexus.classworlds.launcher.Launcher.launch
(Launcher.java:225)
[2020-05-10T13:27:12.602Z]     at org.codehaus.plexus.classworlds.launcher.Launcher.mainWithExitCode
(Launcher.java:406)
[2020-05-10T13:27:12.602Z]     at org.codehaus.plexus.classworlds.launcher.Launcher.main (Launcher.java:347)
[2020-05-10T13:27:12.602Z] [ERROR] 
[2020-05-10T13:27:12.602Z] [ERROR] Re-run Maven using the -X switch to enable full debug logging.
[2020-05-10T13:27:12.602Z] [ERROR] 
[2020-05-10T13:27:12.602Z] [ERROR] For more information about the errors and possible solutions,
please read the following articles:
[2020-05-10T13:27:12.602Z] [ERROR] [Help 1] http://cwiki.apache.org/confluence/display/MAVEN/MojoExecutionException
[Pipeline] }
[2020-05-10T13:27:14.418Z] [withMaven] junitPublisher - Archive test results for Maven artifact
org.apache.maven.dist.tools:dist-tool-plugin:maven-plugin:1.0-SNAPSHOT generated by maven-surefire-plugin:test
(default-test): target/surefire-reports/*.xml
[2020-05-10T13:27:14.418Z] [withMaven] junitPublisher - Archive test results for Maven artifact
org.apache.maven.dist.tools:dist-tool-plugin:maven-plugin:1.0-SNAPSHOT generated by maven-surefire-plugin:test
(default-test): target/surefire-reports/*.xml
[2020-05-10T13:27:14.419Z] Recording test results
[2020-05-10T13:27:16.320Z] [withMaven] openTasksPublisher - Scan Tasks for Maven artifact
org.apache.maven.dist.tools:dist-tool-plugin:maven-plugin:1.0-SNAPSHOT in source directory
src/main/java
[2020-05-10T13:27:16.500Z] [TASKS] Scanning folder '/home/jenkins/jenkins-slave/workspace/maven-box_maven-dist-tool_master'
for files matching the pattern 'src/main/java/**/*' - excludes: null
[2020-05-10T13:27:16.500Z] [TASKS] Found 22 files to scan for tasks
[2020-05-10T13:27:16.500Z] [TASKS] Found 2 open tasks.
[2020-05-10T13:27:16.500Z] Skipping warnings blame since pipelines do not have an SCM link.%n
[2020-05-10T13:27:16.572Z] [TASKS] Computing warning deltas based on reference build #510
[2020-05-10T13:27:16.729Z] [withMaven] Publishers: Pipeline Graph Publisher: 2 ms, Junit Publisher:
628 ms, Open Task Scanner Publisher: 581 ms
[Pipeline] // withMaven
[Pipeline] }
[Pipeline] // stage
[Pipeline] stage
[Pipeline] { (Declarative: Post Actions)
[Pipeline] echo
[2020-05-10T13:27:17.207Z] Build result: FAILURE
[Pipeline] jiraIssueSelector
[Pipeline] echo
[2020-05-10T13:27:17.493Z] The authors of changes [hboutemy].
[Pipeline] echo
[2020-05-10T13:27:17.508Z] Sending email ...
[Pipeline] emailext
Mime
  • Unnamed multipart/mixed (inline, None, 0 bytes)
View raw message