maven-notifications mailing list archives

Site index · List index
Message view « Date » · « Thread »
Top « Date » · « Thread »
From Apache Jenkins Server <jenk...@builds.apache.org>
Subject Build failed in Jenkins: Maven TLP » maven-surefire » SUREFIRE-1733 #6
Date Wed, 20 May 2020 13:26:14 GMT
See https://builds.apache.org/job/maven-box/job/maven-surefire/job/SUREFIRE-1733/6/

Changes:

* forkedbooter must use app loader + ensure modular classpath split

1 tests failed.
FAILED:  org.apache.maven.plugin.surefire.booterclient.ModularClasspathForkConfigurationTest.shouldCreateModularArgsFile

Error Message:
expected size:<1> but was:<4> for <['--show-module-resolution', '--add-modules',
'ALL-MODULE-PATH', '@/home/jenkins/jenkins-slave/workspace/box_maven-surefire_SUREFIRE-1733@2/maven-surefire-common/target/surefire/surefireargs5773587909279673443']>

Stack Trace:
java.lang.AssertionError: expected size:<1> but was:<4> for <['--show-module-resolution',
'--add-modules', 'ALL-MODULE-PATH', '@/home/jenkins/jenkins-slave/workspace/box_maven-surefire_SUREFIRE-1733@2/maven-surefire-common/target/surefire/surefireargs5773587909279673443']>
	at org.fest.assertions.Fail.failure(Fail.java:228)
	at org.fest.assertions.Assert.failure(Assert.java:149)
	at org.fest.assertions.GroupAssert.hasSize(GroupAssert.java:89)
	at org.apache.maven.plugin.surefire.booterclient.ModularClasspathForkConfigurationTest.shouldCreateModularArgsFile(ModularClasspathForkConfigurationTest.java:153)
	at java.base/jdk.internal.reflect.NativeMethodAccessorImpl.invoke0(Native Method)
	at java.base/jdk.internal.reflect.NativeMethodAccessorImpl.invoke(NativeMethodAccessorImpl.java:62)
	at java.base/jdk.internal.reflect.DelegatingMethodAccessorImpl.invoke(DelegatingMethodAccessorImpl.java:43)
	at java.base/java.lang.reflect.Method.invoke(Method.java:564)
	at org.junit.runners.model.FrameworkMethod$1.runReflectiveCall(FrameworkMethod.java:59)
	at org.junit.internal.runners.model.ReflectiveCallable.run(ReflectiveCallable.java:12)
	at org.junit.runners.model.FrameworkMethod.invokeExplosively(FrameworkMethod.java:56)
	at org.junit.internal.runners.statements.InvokeMethod.evaluate(InvokeMethod.java:17)
	at org.junit.runners.ParentRunner$3.evaluate(ParentRunner.java:306)
	at org.junit.runners.BlockJUnit4ClassRunner$1.evaluate(BlockJUnit4ClassRunner.java:100)
	at org.junit.runners.ParentRunner.runLeaf(ParentRunner.java:366)
	at org.junit.runners.BlockJUnit4ClassRunner.runChild(BlockJUnit4ClassRunner.java:103)
	at org.junit.runners.BlockJUnit4ClassRunner.runChild(BlockJUnit4ClassRunner.java:63)
	at org.junit.runners.ParentRunner$4.run(ParentRunner.java:331)
	at org.junit.runners.ParentRunner$1.schedule(ParentRunner.java:79)
	at org.junit.runners.ParentRunner.runChildren(ParentRunner.java:329)
	at org.junit.runners.ParentRunner.access$100(ParentRunner.java:66)
	at org.junit.runners.ParentRunner$2.evaluate(ParentRunner.java:293)
	at org.junit.runners.ParentRunner$3.evaluate(ParentRunner.java:306)
	at org.junit.runners.ParentRunner.run(ParentRunner.java:413)
	at junit.framework.JUnit4TestAdapter.run(JUnit4TestAdapter.java:50)
	at junit.framework.TestSuite.runTest(TestSuite.java:241)
	at junit.framework.TestSuite.run(TestSuite.java:236)
	at java.base/jdk.internal.reflect.NativeMethodAccessorImpl.invoke0(Native Method)
	at java.base/jdk.internal.reflect.NativeMethodAccessorImpl.invoke(NativeMethodAccessorImpl.java:62)
	at java.base/jdk.internal.reflect.DelegatingMethodAccessorImpl.invoke(DelegatingMethodAccessorImpl.java:43)
	at java.base/java.lang.reflect.Method.invoke(Method.java:564)
	at org.apache.maven.shadefire.surefire.junit.JUnitTestSet.execute(JUnitTestSet.java:99)
	at org.apache.maven.shadefire.surefire.junit.JUnit3Provider.executeTestSet(JUnit3Provider.java:141)
	at org.apache.maven.shadefire.surefire.junit.JUnit3Provider.invoke(JUnit3Provider.java:114)
	at org.apache.maven.shadefire.surefire.booter.ForkedBooter.runSuitesInProcess(ForkedBooter.java:377)
	at org.apache.maven.shadefire.surefire.booter.ForkedBooter.execute(ForkedBooter.java:138)
	at org.apache.maven.shadefire.surefire.booter.ForkedBooter.run(ForkedBooter.java:465)
	at org.apache.maven.shadefire.surefire.booter.ForkedBooter.main(ForkedBooter.java:451)




Build log:
[...truncated 15187 lines...]
[2020-05-20T13:25:27.567Z] [INFO] --- maven-clean-plugin:3.1.0:clean (default-clean) @ maven-surefire-common
---
[2020-05-20T13:25:27.567Z] [INFO] 
[2020-05-20T13:25:27.567Z] [INFO] --- maven-enforcer-plugin:3.0.0-M3:enforce (enforce-maven-version)
@ maven-surefire-common ---
[2020-05-20T13:25:27.567Z] [INFO] 
[2020-05-20T13:25:27.567Z] [INFO] --- maven-enforcer-plugin:3.0.0-M3:enforce (enforce-bytecode-version)
@ maven-surefire-common ---
[2020-05-20T13:25:27.850Z] [INFO] Adding ignore: module-info
[2020-05-20T13:25:29.288Z] [INFO] 
[2020-05-20T13:25:29.288Z] [INFO] --- maven-enforcer-plugin:3.0.0-M3:enforce (enforce-java)
@ maven-surefire-common ---
[2020-05-20T13:25:29.288Z] [INFO] 
[2020-05-20T13:25:29.288Z] [INFO] --- maven-enforcer-plugin:3.0.0-M3:enforce (enforce-maven)
@ maven-surefire-common ---
[2020-05-20T13:25:29.288Z] [INFO] 
[2020-05-20T13:25:29.288Z] [INFO] --- apache-rat-plugin:0.13:check (rat-check) @ maven-surefire-common
---
[2020-05-20T13:25:29.288Z] [INFO] Enabled default license matchers.
[2020-05-20T13:25:29.288Z] [INFO] Will parse SCM ignores for exclusions...
[2020-05-20T13:25:29.288Z] [INFO] Finished adding exclusions from SCM ignore files.
[2020-05-20T13:25:29.288Z] [INFO] 62 implicit excludes (use -debug for more details).
[2020-05-20T13:25:29.289Z] [INFO] 27 explicit excludes (use -debug for more details).
[2020-05-20T13:25:29.289Z] [INFO] 153 resources included (use -debug for more details)
[2020-05-20T13:25:30.727Z] [INFO] Rat check: Summary over all files. Unapproved: 0, unknown:
0, generated: 0, approved: 153 licenses.
[2020-05-20T13:25:30.727Z] [INFO] 
[2020-05-20T13:25:30.727Z] [INFO] --- maven-compiler-plugin:3.8.1:compile (compile-generated)
@ maven-surefire-common ---
[2020-05-20T13:25:30.727Z] [INFO] Nothing to compile - all classes are up to date
[2020-05-20T13:25:30.727Z] [INFO] 
[2020-05-20T13:25:30.727Z] [INFO] --- maven-remote-resources-plugin:1.7.0:process (process-resource-bundles)
@ maven-surefire-common ---
[2020-05-20T13:25:30.727Z] [INFO] Preparing remote bundle org.apache:apache-jar-resource-bundle:1.4
[2020-05-20T13:25:30.727Z] [INFO] Copying 3 resources from 1 bundle.
[2020-05-20T13:25:31.015Z] [INFO] 
[2020-05-20T13:25:31.015Z] [INFO] --- maven-resources-plugin:3.1.0:resources (default-resources)
@ maven-surefire-common ---
[2020-05-20T13:25:31.015Z] [INFO] Using 'UTF-8' encoding to copy filtered resources.
[2020-05-20T13:25:31.015Z] [INFO] skip non existing resourceDirectory C:\Users\jenkins\AppData\Local\Temp\2\jenkins-maven-box-maven-surefire-SUREFIRE-1733-6@2\maven-surefire-common\src\main\resources
[2020-05-20T13:25:31.015Z] [INFO] Copying 3 resources
[2020-05-20T13:25:31.015Z] [INFO] 
[2020-05-20T13:25:31.015Z] [INFO] --- maven-compiler-plugin:3.8.1:compile (default-compile)
@ maven-surefire-common ---
[2020-05-20T13:25:31.015Z] [INFO] Changes detected - recompiling the module!
[2020-05-20T13:25:31.015Z] [INFO] Compiling 95 source files to C:\Users\jenkins\AppData\Local\Temp\2\jenkins-maven-box-maven-surefire-SUREFIRE-1733-6@2\maven-surefire-common\target\classes
[2020-05-20T13:25:36.409Z] [INFO] 
[2020-05-20T13:25:36.409Z] [INFO] --- animal-sniffer-maven-plugin:1.17:check (signature-check)
@ maven-surefire-common ---
[2020-05-20T13:25:36.409Z] [INFO] Checking unresolved references to org.codehaus.mojo.signature:java17:1.0
[2020-05-20T13:25:37.011Z] [INFO] 
[2020-05-20T13:25:37.011Z] [INFO] --- jacoco-maven-plugin:0.8.5:instrument (jacoco-instrumentation)
@ maven-surefire-common ---
[2020-05-20T13:25:37.011Z] [INFO] Skipping JaCoCo execution because property jacoco.skip is
set.
[2020-05-20T13:25:37.011Z] [INFO] 
[2020-05-20T13:25:37.011Z] [INFO] --- maven-resources-plugin:3.1.0:testResources (default-testResources)
@ maven-surefire-common ---
[2020-05-20T13:25:37.011Z] [INFO] Using 'UTF-8' encoding to copy filtered resources.
[2020-05-20T13:25:37.011Z] [INFO] Copying 4 resources
[2020-05-20T13:25:37.011Z] [INFO] Copying 3 resources
[2020-05-20T13:25:37.011Z] [INFO] 
[2020-05-20T13:25:37.011Z] [INFO] --- maven-compiler-plugin:3.8.1:testCompile (default-testCompile)
@ maven-surefire-common ---
[2020-05-20T13:25:37.011Z] [INFO] Changes detected - recompiling the module!
[2020-05-20T13:25:37.011Z] [INFO] Compiling 57 source files to C:\Users\jenkins\AppData\Local\Temp\2\jenkins-maven-box-maven-surefire-SUREFIRE-1733-6@2\maven-surefire-common\target\test-classes
[2020-05-20T13:25:42.765Z] [INFO] 
[2020-05-20T13:25:42.765Z] [INFO] --- maven-surefire-plugin:3.0.0-M4:test (default-test) @
maven-surefire-common ---
[2020-05-20T13:25:42.765Z] [INFO] Surefire report directory: C:\Users\jenkins\AppData\Local\Temp\2\jenkins-maven-box-maven-surefire-SUREFIRE-1733-6@2\maven-surefire-common\target\surefire-reports
[2020-05-20T13:25:42.765Z] [INFO] Using configured provider org.apache.maven.shadefire.surefire.junit.JUnit3Provider
[2020-05-20T13:25:42.765Z] [WARNING] The system property java.awt.headless is configured twice!
The property appears in <argLine/> and any of <systemPropertyVariables/>, <systemProperties/>
or user property.
[2020-05-20T13:25:42.765Z] [INFO] parallel='none', perCoreThreadCount=true, threadCount=0,
useUnlimitedThreads=false, threadCountSuites=0, threadCountClasses=0, threadCountMethods=0,
parallelOptimized=true
[2020-05-20T13:25:42.765Z] [INFO] 
[2020-05-20T13:25:42.765Z] [INFO] -------------------------------------------------------
[2020-05-20T13:25:42.765Z] [INFO]  T E S T S
[2020-05-20T13:25:42.765Z] [INFO] -------------------------------------------------------
[2020-05-20T13:25:43.071Z] [INFO] Running org.apache.maven.surefire.JUnit4SuiteTest
[2020-05-20T13:26:05.190Z] Hi There!
[2020-05-20T13:26:09.503Z] 1078ms: 100000
[2020-05-20T13:26:10.507Z] 2051ms: 200000
[2020-05-20T13:26:11.491Z] 3004ms: 300000
[2020-05-20T13:26:11.491Z] 3187ms on read
[2020-05-20T13:26:12.113Z] 3885ms on write
[2020-05-20T13:26:12.113Z] [ERROR] Tests run: 263, Failures: 0, Errors: 1, Skipped: 0, Time
elapsed: 29.174 s <<< FAILURE! - in org.apache.maven.surefire.JUnit4SuiteTest
[2020-05-20T13:26:12.113Z] [ERROR] org.apache.maven.plugin.surefire.booterclient.ModularClasspathForkConfigurationTest.shouldCreateModularArgsFile
 Time elapsed: 0.014 s  <<< ERROR!
[2020-05-20T13:26:12.113Z] java.lang.AssertionError: expected size:<1> but was:<4>
for <['--show-module-resolution', '--add-modules', 'ALL-MODULE-PATH', '@C:\Users\jenkins\AppData\Local\Temp\2\jenkins-maven-box-maven-surefire-SUREFIRE-1733-6@2\maven-surefire-common\target\surefire\surefireargs4822496386655069932']>
[2020-05-20T13:26:12.113Z] 	at org.fest.assertions.Fail.failure(Fail.java:228)
[2020-05-20T13:26:12.113Z] 	at org.fest.assertions.Assert.failure(Assert.java:149)
[2020-05-20T13:26:12.113Z] 	at org.fest.assertions.GroupAssert.hasSize(GroupAssert.java:89)
[2020-05-20T13:26:12.113Z] 	at org.apache.maven.plugin.surefire.booterclient.ModularClasspathForkConfigurationTest.shouldCreateModularArgsFile(ModularClasspathForkConfigurationTest.java:153)
[2020-05-20T13:26:12.113Z] 	at sun.reflect.NativeMethodAccessorImpl.invoke0(Native Method)
[2020-05-20T13:26:12.113Z] 	at sun.reflect.NativeMethodAccessorImpl.invoke(NativeMethodAccessorImpl.java:57)
[2020-05-20T13:26:12.113Z] 	at sun.reflect.DelegatingMethodAccessorImpl.invoke(DelegatingMethodAccessorImpl.java:43)
[2020-05-20T13:26:12.113Z] 	at java.lang.reflect.Method.invoke(Method.java:606)
[2020-05-20T13:26:12.113Z] 	at org.junit.runners.model.FrameworkMethod$1.runReflectiveCall(FrameworkMethod.java:59)
[2020-05-20T13:26:12.113Z] 	at org.junit.internal.runners.model.ReflectiveCallable.run(ReflectiveCallable.java:12)
[2020-05-20T13:26:12.113Z] 	at org.junit.runners.model.FrameworkMethod.invokeExplosively(FrameworkMethod.java:56)
[2020-05-20T13:26:12.113Z] 	at org.junit.internal.runners.statements.InvokeMethod.evaluate(InvokeMethod.java:17)
[2020-05-20T13:26:12.113Z] 	at org.junit.runners.ParentRunner$3.evaluate(ParentRunner.java:306)
[2020-05-20T13:26:12.113Z] 	at org.junit.runners.BlockJUnit4ClassRunner$1.evaluate(BlockJUnit4ClassRunner.java:100)
[2020-05-20T13:26:12.113Z] 	at org.junit.runners.ParentRunner.runLeaf(ParentRunner.java:366)
[2020-05-20T13:26:12.113Z] 	at org.junit.runners.BlockJUnit4ClassRunner.runChild(BlockJUnit4ClassRunner.java:103)
[2020-05-20T13:26:12.113Z] 	at org.junit.runners.BlockJUnit4ClassRunner.runChild(BlockJUnit4ClassRunner.java:63)
[2020-05-20T13:26:12.113Z] 	at org.junit.runners.ParentRunner$4.run(ParentRunner.java:331)
[2020-05-20T13:26:12.113Z] 	at org.junit.runners.ParentRunner$1.schedule(ParentRunner.java:79)
[2020-05-20T13:26:12.113Z] 	at org.junit.runners.ParentRunner.runChildren(ParentRunner.java:329)
[2020-05-20T13:26:12.113Z] 	at org.junit.runners.ParentRunner.access$100(ParentRunner.java:66)
[2020-05-20T13:26:12.113Z] 	at org.junit.runners.ParentRunner$2.evaluate(ParentRunner.java:293)
[2020-05-20T13:26:12.113Z] 	at org.junit.runners.ParentRunner$3.evaluate(ParentRunner.java:306)
[2020-05-20T13:26:12.113Z] 	at org.junit.runners.ParentRunner.run(ParentRunner.java:413)
[2020-05-20T13:26:12.113Z] 	at junit.framework.JUnit4TestAdapter.run(JUnit4TestAdapter.java:50)
[2020-05-20T13:26:12.113Z] 	at junit.framework.TestSuite.runTest(TestSuite.java:241)
[2020-05-20T13:26:12.113Z] 	at junit.framework.TestSuite.run(TestSuite.java:236)
[2020-05-20T13:26:12.113Z] 	at sun.reflect.NativeMethodAccessorImpl.invoke0(Native Method)
[2020-05-20T13:26:12.113Z] 	at sun.reflect.NativeMethodAccessorImpl.invoke(NativeMethodAccessorImpl.java:57)
[2020-05-20T13:26:12.113Z] 	at sun.reflect.DelegatingMethodAccessorImpl.invoke(DelegatingMethodAccessorImpl.java:43)
[2020-05-20T13:26:12.113Z] 	at java.lang.reflect.Method.invoke(Method.java:606)
[2020-05-20T13:26:12.113Z] 	at org.apache.maven.shadefire.surefire.junit.JUnitTestSet.execute(JUnitTestSet.java:99)
[2020-05-20T13:26:12.113Z] 	at org.apache.maven.shadefire.surefire.junit.JUnit3Provider.executeTestSet(JUnit3Provider.java:141)
[2020-05-20T13:26:12.113Z] 	at org.apache.maven.shadefire.surefire.junit.JUnit3Provider.invoke(JUnit3Provider.java:114)
[2020-05-20T13:26:12.113Z] 	at org.apache.maven.shadefire.surefire.booter.ForkedBooter.runSuitesInProcess(ForkedBooter.java:377)
[2020-05-20T13:26:12.113Z] 	at org.apache.maven.shadefire.surefire.booter.ForkedBooter.execute(ForkedBooter.java:138)
[2020-05-20T13:26:12.113Z] 	at org.apache.maven.shadefire.surefire.booter.ForkedBooter.run(ForkedBooter.java:465)
[2020-05-20T13:26:12.113Z] 	at org.apache.maven.shadefire.surefire.booter.ForkedBooter.main(ForkedBooter.java:451)
[2020-05-20T13:26:12.113Z] 
[2020-05-20T13:26:12.703Z] [INFO] 
[2020-05-20T13:26:12.703Z] [INFO] Results:
[2020-05-20T13:26:12.703Z] [INFO] 
[2020-05-20T13:26:12.703Z] [ERROR] Errors: 
[2020-05-20T13:26:12.703Z] [ERROR]   junit.framework.JUnit4TestCaseFacade#UNKNOWN  expected
size:<1> but was:<4> fo...
[2020-05-20T13:26:12.703Z] [INFO] 
[2020-05-20T13:26:12.703Z] [ERROR] Tests run: 263, Failures: 0, Errors: 1, Skipped: 0
[2020-05-20T13:26:12.703Z] [INFO] 
[2020-05-20T13:26:12.703Z] [INFO] ------------------------------------------------------------------------
[2020-05-20T13:26:12.703Z] [INFO] Reactor Summary for Apache Maven Surefire 3.0.0-SNAPSHOT:
[2020-05-20T13:26:12.703Z] [INFO] 
[2020-05-20T13:26:12.703Z] [INFO] Apache Maven Surefire .............................. SUCCESS
[ 49.012 s]
[2020-05-20T13:26:12.703Z] [INFO] SureFire Logger API ................................ SUCCESS
[ 17.470 s]
[2020-05-20T13:26:12.703Z] [INFO] SureFire API ....................................... SUCCESS
[ 22.066 s]
[2020-05-20T13:26:12.703Z] [INFO] Surefire Extensions API ............................ SUCCESS
[  6.043 s]
[2020-05-20T13:26:12.704Z] [INFO] Surefire Extensions SPI ............................ SUCCESS
[  2.023 s]
[2020-05-20T13:26:12.704Z] [INFO] SureFire Booter .................................... SUCCESS
[ 19.463 s]
[2020-05-20T13:26:12.704Z] [INFO] Maven Surefire Test-Grouping Support ............... SUCCESS
[  8.398 s]
[2020-05-20T13:26:12.704Z] [INFO] SureFire Providers ................................. SUCCESS
[  0.913 s]
[2020-05-20T13:26:12.704Z] [INFO] Shared JUnit3 Provider Code ........................ SUCCESS
[  3.863 s]
[2020-05-20T13:26:12.704Z] [INFO] Shared Java 5 Provider Base ........................ SUCCESS
[  5.231 s]
[2020-05-20T13:26:12.704Z] [INFO] Shared JUnit4 Provider Code ........................ SUCCESS
[  5.555 s]
[2020-05-20T13:26:12.704Z] [INFO] Shared JUnit48 Provider Code ....................... SUCCESS
[  9.202 s]
[2020-05-20T13:26:12.704Z] [INFO] SureFire JUnit Runner .............................. SUCCESS
[  4.371 s]
[2020-05-20T13:26:12.704Z] [INFO] SureFire JUnit4 Runner ............................. SUCCESS
[  4.480 s]
[2020-05-20T13:26:12.704Z] [INFO] Maven Surefire Common .............................. FAILURE
[ 45.862 s]
[2020-05-20T13:26:12.704Z] [INFO] SureFire JUnitCore Runner .......................... SKIPPED
[2020-05-20T13:26:12.704Z] [INFO] SureFire JUnit Platform Runner ..................... SKIPPED
[2020-05-20T13:26:12.704Z] [INFO] SureFire TestNG Utils .............................. SKIPPED
[2020-05-20T13:26:12.704Z] [INFO] SureFire TestNG Runner ............................. SKIPPED
[2020-05-20T13:26:12.704Z] [INFO] ShadeFire JUnit3 Provider .......................... SKIPPED
[2020-05-20T13:26:12.704Z] [INFO] Surefire Report Parser ............................. SKIPPED
[2020-05-20T13:26:12.704Z] [INFO] Maven Surefire Plugin .............................. SKIPPED
[2020-05-20T13:26:12.704Z] [INFO] Maven Failsafe Plugin .............................. SKIPPED
[2020-05-20T13:26:12.704Z] [INFO] Maven Surefire Report Plugin ....................... SKIPPED
[2020-05-20T13:26:12.704Z] [INFO] Maven Surefire Integration Tests ................... SKIPPED
[2020-05-20T13:26:12.704Z] [INFO] Surefire Shared Utils .............................. SKIPPED
[2020-05-20T13:26:12.704Z] [INFO] ------------------------------------------------------------------------
[2020-05-20T13:26:12.704Z] [INFO] BUILD FAILURE
[2020-05-20T13:26:12.704Z] [INFO] ------------------------------------------------------------------------
[2020-05-20T13:26:12.704Z] [INFO] Total time:  03:25 min
[2020-05-20T13:26:12.704Z] [INFO] Finished at: 2020-05-20T06:26:12-07:00
[2020-05-20T13:26:12.704Z] [INFO] ------------------------------------------------------------------------
[2020-05-20T13:26:12.704Z] [ERROR] Failed to execute goal org.apache.maven.plugins:maven-surefire-plugin:3.0.0-M4:test
(default-test) on project maven-surefire-common: There are test failures.
[2020-05-20T13:26:12.704Z] [ERROR] 
[2020-05-20T13:26:12.704Z] [ERROR] Please refer to C:\Users\jenkins\AppData\Local\Temp\2\jenkins-maven-box-maven-surefire-SUREFIRE-1733-6@2\maven-surefire-common\target\surefire-reports
for the individual test results.
[2020-05-20T13:26:12.704Z] [ERROR] Please refer to dump files (if any exist) [date].dump,
[date]-jvmRun[N].dump and [date].dumpstream.
[2020-05-20T13:26:12.704Z] [ERROR] -> [Help 1]
[2020-05-20T13:26:12.704Z] org.apache.maven.lifecycle.LifecycleExecutionException: Failed
to execute goal org.apache.maven.plugins:maven-surefire-plugin:3.0.0-M4:test (default-test)
on project maven-surefire-common: There are test failures.
[2020-05-20T13:26:12.704Z] 
[2020-05-20T13:26:12.704Z] Please refer to C:\Users\jenkins\AppData\Local\Temp\2\jenkins-maven-box-maven-surefire-SUREFIRE-1733-6@2\maven-surefire-common\target\surefire-reports
for the individual test results.
[2020-05-20T13:26:12.704Z] Please refer to dump files (if any exist) [date].dump, [date]-jvmRun[N].dump
and [date].dumpstream.
[2020-05-20T13:26:12.704Z]     at org.apache.maven.lifecycle.internal.MojoExecutor.execute
(MojoExecutor.java:215)
[2020-05-20T13:26:12.704Z]     at org.apache.maven.lifecycle.internal.MojoExecutor.execute
(MojoExecutor.java:156)
[2020-05-20T13:26:12.704Z]     at org.apache.maven.lifecycle.internal.MojoExecutor.execute
(MojoExecutor.java:148)
[2020-05-20T13:26:12.704Z]     at org.apache.maven.lifecycle.internal.LifecycleModuleBuilder.buildProject
(LifecycleModuleBuilder.java:117)
[2020-05-20T13:26:12.704Z]     at org.apache.maven.lifecycle.internal.LifecycleModuleBuilder.buildProject
(LifecycleModuleBuilder.java:81)
[2020-05-20T13:26:12.704Z]     at org.apache.maven.lifecycle.internal.builder.singlethreaded.SingleThreadedBuilder.build
(SingleThreadedBuilder.java:56)
[2020-05-20T13:26:12.704Z]     at org.apache.maven.lifecycle.internal.LifecycleStarter.execute
(LifecycleStarter.java:128)
[2020-05-20T13:26:12.704Z]     at org.apache.maven.DefaultMaven.doExecute (DefaultMaven.java:305)
[2020-05-20T13:26:12.704Z]     at org.apache.maven.DefaultMaven.doExecute (DefaultMaven.java:192)
[2020-05-20T13:26:12.704Z]     at org.apache.maven.DefaultMaven.execute (DefaultMaven.java:105)
[2020-05-20T13:26:12.704Z]     at org.apache.maven.cli.MavenCli.execute (MavenCli.java:956)
[2020-05-20T13:26:12.704Z]     at org.apache.maven.cli.MavenCli.doMain (MavenCli.java:288)
[2020-05-20T13:26:12.704Z]     at org.apache.maven.cli.MavenCli.main (MavenCli.java:192)
[2020-05-20T13:26:12.704Z]     at sun.reflect.NativeMethodAccessorImpl.invoke0 (Native Method)
[2020-05-20T13:26:12.704Z]     at sun.reflect.NativeMethodAccessorImpl.invoke (NativeMethodAccessorImpl.java:62)
[2020-05-20T13:26:12.704Z]     at sun.reflect.DelegatingMethodAccessorImpl.invoke (DelegatingMethodAccessorImpl.java:43)
[2020-05-20T13:26:12.704Z]     at java.lang.reflect.Method.invoke (Method.java:498)
[2020-05-20T13:26:12.704Z]     at org.codehaus.plexus.classworlds.launcher.Launcher.launchEnhanced
(Launcher.java:282)
[2020-05-20T13:26:12.704Z]     at org.codehaus.plexus.classworlds.launcher.Launcher.launch
(Launcher.java:225)
[2020-05-20T13:26:12.704Z]     at org.codehaus.plexus.classworlds.launcher.Launcher.mainWithExitCode
(Launcher.java:406)
[2020-05-20T13:26:12.704Z]     at org.codehaus.plexus.classworlds.launcher.Launcher.main (Launcher.java:347)
[2020-05-20T13:26:12.704Z] Caused by: org.apache.maven.plugin.MojoFailureException: There
are test failures.
[2020-05-20T13:26:12.704Z] 
[2020-05-20T13:26:12.704Z] Please refer to C:\Users\jenkins\AppData\Local\Temp\2\jenkins-maven-box-maven-surefire-SUREFIRE-1733-6@2\maven-surefire-common\target\surefire-reports
for the individual test results.
[2020-05-20T13:26:12.704Z] Please refer to dump files (if any exist) [date].dump, [date]-jvmRun[N].dump
and [date].dumpstream.
[2020-05-20T13:26:12.705Z]     at org.apache.maven.plugin.surefire.SurefireHelper.throwException
(SurefireHelper.java:271)
[2020-05-20T13:26:12.705Z]     at org.apache.maven.plugin.surefire.SurefireHelper.reportExecution
(SurefireHelper.java:159)
[2020-05-20T13:26:12.705Z]     at org.apache.maven.plugin.surefire.SurefirePlugin.handleSummary
(SurefirePlugin.java:435)
[2020-05-20T13:26:12.705Z]     at org.apache.maven.plugin.surefire.AbstractSurefireMojo.executeAfterPreconditionsChecked
(AbstractSurefireMojo.java:1079)
[2020-05-20T13:26:12.705Z]     at org.apache.maven.plugin.surefire.AbstractSurefireMojo.execute
(AbstractSurefireMojo.java:889)
[2020-05-20T13:26:12.705Z]     at org.apache.maven.plugin.DefaultBuildPluginManager.executeMojo
(DefaultBuildPluginManager.java:137)
[2020-05-20T13:26:12.705Z]     at org.apache.maven.lifecycle.internal.MojoExecutor.execute
(MojoExecutor.java:210)
[2020-05-20T13:26:12.705Z]     at org.apache.maven.lifecycle.internal.MojoExecutor.execute
(MojoExecutor.java:156)
[2020-05-20T13:26:12.705Z]     at org.apache.maven.lifecycle.internal.MojoExecutor.execute
(MojoExecutor.java:148)
[2020-05-20T13:26:12.705Z]     at org.apache.maven.lifecycle.internal.LifecycleModuleBuilder.buildProject
(LifecycleModuleBuilder.java:117)
[2020-05-20T13:26:12.705Z]     at org.apache.maven.lifecycle.internal.LifecycleModuleBuilder.buildProject
(LifecycleModuleBuilder.java:81)
[2020-05-20T13:26:12.705Z]     at org.apache.maven.lifecycle.internal.builder.singlethreaded.SingleThreadedBuilder.build
(SingleThreadedBuilder.java:56)
[2020-05-20T13:26:12.705Z]     at org.apache.maven.lifecycle.internal.LifecycleStarter.execute
(LifecycleStarter.java:128)
[2020-05-20T13:26:12.705Z]     at org.apache.maven.DefaultMaven.doExecute (DefaultMaven.java:305)
[2020-05-20T13:26:12.705Z]     at org.apache.maven.DefaultMaven.doExecute (DefaultMaven.java:192)
[2020-05-20T13:26:12.705Z]     at org.apache.maven.DefaultMaven.execute (DefaultMaven.java:105)
[2020-05-20T13:26:12.705Z]     at org.apache.maven.cli.MavenCli.execute (MavenCli.java:956)
[2020-05-20T13:26:12.705Z]     at org.apache.maven.cli.MavenCli.doMain (MavenCli.java:288)
[2020-05-20T13:26:12.705Z]     at org.apache.maven.cli.MavenCli.main (MavenCli.java:192)
[2020-05-20T13:26:12.705Z]     at sun.reflect.NativeMethodAccessorImpl.invoke0 (Native Method)
[2020-05-20T13:26:12.705Z]     at sun.reflect.NativeMethodAccessorImpl.invoke (NativeMethodAccessorImpl.java:62)
[2020-05-20T13:26:12.705Z]     at sun.reflect.DelegatingMethodAccessorImpl.invoke (DelegatingMethodAccessorImpl.java:43)
[2020-05-20T13:26:12.705Z]     at java.lang.reflect.Method.invoke (Method.java:498)
[2020-05-20T13:26:12.705Z]     at org.codehaus.plexus.classworlds.launcher.Launcher.launchEnhanced
(Launcher.java:282)
[2020-05-20T13:26:12.705Z]     at org.codehaus.plexus.classworlds.launcher.Launcher.launch
(Launcher.java:225)
[2020-05-20T13:26:12.705Z]     at org.codehaus.plexus.classworlds.launcher.Launcher.mainWithExitCode
(Launcher.java:406)
[2020-05-20T13:26:12.705Z]     at org.codehaus.plexus.classworlds.launcher.Launcher.main (Launcher.java:347)
[2020-05-20T13:26:12.705Z] [ERROR] 
[2020-05-20T13:26:12.705Z] [ERROR] Re-run Maven using the -X switch to enable full debug logging.
[2020-05-20T13:26:12.705Z] [ERROR] 
[2020-05-20T13:26:12.705Z] [ERROR] For more information about the errors and possible solutions,
please read the following articles:
[2020-05-20T13:26:12.705Z] [ERROR] [Help 1] http://cwiki.apache.org/confluence/display/MAVEN/MojoFailureException
[2020-05-20T13:26:12.705Z] [ERROR] 
[2020-05-20T13:26:12.705Z] [ERROR] After correcting the problems, you can resume the build
with the command
[2020-05-20T13:26:12.705Z] [ERROR]   mvn <args> -rf :maven-surefire-common
[Pipeline] }
[Pipeline] // withEnv
[Pipeline] }
[Pipeline] // stage
[Pipeline] fileExists
[Pipeline] fileExists
[Pipeline] archiveArtifacts
[2020-05-20T13:26:13.003Z] Archiving artifacts
[Pipeline] cleanWs
[2020-05-20T13:26:13.069Z] [WS-CLEANUP] Deleting project workspace...
[2020-05-20T13:26:13.069Z] [WS-CLEANUP] Deferred wipeout is used...
[2020-05-20T13:26:13.110Z] [WS-CLEANUP] done
[Pipeline] }
[Pipeline] // ws
[Pipeline] }
[Pipeline] // timestamps
[Pipeline] }
[Pipeline] // node
[Pipeline] }
[Pipeline] // parallel
[Pipeline] echo
Build result: FAILURE
[Pipeline] jiraIssueSelector
[Pipeline] echo
The authors of changes [rmannibucau].
[Pipeline] echo
Sending email ...
[Pipeline] emailext
Mime
  • Unnamed multipart/mixed (inline, None, 0 bytes)
View raw message