maven-notifications mailing list archives

Site index · List index
Message view « Date » · « Thread »
Top « Date » · « Thread »
From Apache Jenkins Server <jenk...@builds.apache.org>
Subject Build unstable in Jenkins: Maven TLP » maven-scm » master #44
Date Sun, 17 May 2020 22:10:41 GMT
See https://builds.apache.org/job/maven-box/job/maven-scm/job/master/44/

Changes:

* update plexus-utils

6 tests failed.
FAILED:  org.apache.maven.scm.plugin.BranchMojoTest.windows-jdk7 / Build windows-jdk7 / testBranch

Error Message:
Command failed.The svn branch command failed.

Stack Trace:
org.apache.maven.plugin.MojoExecutionException: Command failed.The svn branch command failed.
	at org.apache.maven.scm.plugin.BranchMojoTest.testBranch(BranchMojoTest.java:94)


FAILED:  org.apache.maven.scm.plugin.BranchMojoTest.windows-jdk8 / Build windows-jdk8 / testBranch

Error Message:
Command failed.The svn branch command failed.

Stack Trace:
org.apache.maven.plugin.MojoExecutionException: Command failed.The svn branch command failed.
	at org.apache.maven.scm.plugin.BranchMojoTest.testBranch(BranchMojoTest.java:94)


FAILED:  org.apache.maven.scm.plugin.TagMojoTest.windows-jdk7 / Build windows-jdk7 / testTag

Error Message:
Command failed.The svn tag command failed.

Stack Trace:
org.apache.maven.plugin.MojoExecutionException: Command failed.The svn tag command failed.
	at org.apache.maven.scm.plugin.TagMojoTest.testTag(TagMojoTest.java:86)


FAILED:  org.apache.maven.scm.plugin.TagMojoTest.windows-jdk7 / Build windows-jdk7 / testTagWithTimestamp

Error Message:
Command failed.The svn tag command failed.

Stack Trace:
org.apache.maven.plugin.MojoExecutionException: Command failed.The svn tag command failed.
	at org.apache.maven.scm.plugin.TagMojoTest.testTagWithTimestamp(TagMojoTest.java:116)


FAILED:  org.apache.maven.scm.plugin.TagMojoTest.windows-jdk8 / Build windows-jdk8 / testTag

Error Message:
Command failed.The svn tag command failed.

Stack Trace:
org.apache.maven.plugin.MojoExecutionException: Command failed.The svn tag command failed.
	at org.apache.maven.scm.plugin.TagMojoTest.testTag(TagMojoTest.java:86)


FAILED:  org.apache.maven.scm.plugin.TagMojoTest.windows-jdk8 / Build windows-jdk8 / testTagWithTimestamp

Error Message:
Command failed.The svn tag command failed.

Stack Trace:
org.apache.maven.plugin.MojoExecutionException: Command failed.The svn tag command failed.
	at org.apache.maven.scm.plugin.TagMojoTest.testTagWithTimestamp(TagMojoTest.java:116)




Build log:
[...truncated 83861 lines...]
[INFO] 
[INFO] --- maven-invoker-plugin:3.2.1:install (integration-test) @ maven-scm-plugin ---
[INFO] Downloading from central: https://repo.maven.apache.org/maven2/org/apache/maven/shared/maven-invoker/3.0.1/maven-invoker-3.0.1.pom
[INFO] Downloaded from central: https://repo.maven.apache.org/maven2/org/apache/maven/shared/maven-invoker/3.0.1/maven-invoker-3.0.1.pom
(4.9 kB at 48 kB/s)
[INFO] Downloading from central: https://repo.maven.apache.org/maven2/org/apache/maven/shared/maven-shared-components/31/maven-shared-components-31.pom
[INFO] Downloaded from central: https://repo.maven.apache.org/maven2/org/apache/maven/shared/maven-shared-components/31/maven-shared-components-31.pom
(5.1 kB at 165 kB/s)
[INFO] Downloading from central: https://repo.maven.apache.org/maven2/org/apache/maven/reporting/maven-reporting-impl/2.4/maven-reporting-impl-2.4.pom
[INFO] Downloaded from central: https://repo.maven.apache.org/maven2/org/apache/maven/reporting/maven-reporting-impl/2.4/maven-reporting-impl-2.4.pom
(6.1 kB at 233 kB/s)
[INFO] Downloading from central: https://repo.maven.apache.org/maven2/commons-validator/commons-validator/1.4.1/commons-validator-1.4.1.pom
[INFO] Downloaded from central: https://repo.maven.apache.org/maven2/commons-validator/commons-validator/1.4.1/commons-validator-1.4.1.pom
(13 kB at 528 kB/s)
[INFO] Downloading from central: https://repo.maven.apache.org/maven2/org/apache/commons/commons-parent/36/commons-parent-36.pom
[INFO] Downloaded from central: https://repo.maven.apache.org/maven2/org/apache/commons/commons-parent/36/commons-parent-36.pom
(58 kB at 1.6 MB/s)
[INFO] Downloading from central: https://repo.maven.apache.org/maven2/commons-beanutils/commons-beanutils/1.8.3/commons-beanutils-1.8.3.pom
[INFO] Downloaded from central: https://repo.maven.apache.org/maven2/commons-beanutils/commons-beanutils/1.8.3/commons-beanutils-1.8.3.pom
(11 kB at 589 kB/s)
[INFO] Downloading from central: https://repo.maven.apache.org/maven2/org/apache/commons/commons-parent/14/commons-parent-14.pom
[INFO] Downloaded from central: https://repo.maven.apache.org/maven2/org/apache/commons/commons-parent/14/commons-parent-14.pom
(31 kB at 1.2 MB/s)
[INFO] Downloading from central: https://repo.maven.apache.org/maven2/commons-digester/commons-digester/1.8.1/commons-digester-1.8.1.pom
[INFO] Downloaded from central: https://repo.maven.apache.org/maven2/commons-digester/commons-digester/1.8.1/commons-digester-1.8.1.pom
(10 kB at 418 kB/s)
[INFO] Downloading from central: https://repo.maven.apache.org/maven2/org/apache/maven/shared/maven-script-interpreter/1.2/maven-script-interpreter-1.2.pom
[INFO] Downloaded from central: https://repo.maven.apache.org/maven2/org/apache/maven/shared/maven-script-interpreter/1.2/maven-script-interpreter-1.2.pom
(4.0 kB at 148 kB/s)
[INFO] Downloading from central: https://repo.maven.apache.org/maven2/org/apache/ant/ant/1.8.1/ant-1.8.1.pom
[INFO] Downloaded from central: https://repo.maven.apache.org/maven2/org/apache/ant/ant/1.8.1/ant-1.8.1.pom
(8.8 kB at 293 kB/s)
[INFO] Downloading from central: https://repo.maven.apache.org/maven2/org/apache/ant/ant-parent/1.8.1/ant-parent-1.8.1.pom
[INFO] Downloaded from central: https://repo.maven.apache.org/maven2/org/apache/ant/ant-parent/1.8.1/ant-parent-1.8.1.pom
(4.3 kB at 143 kB/s)
[INFO] Downloading from central: https://repo.maven.apache.org/maven2/org/apache/maven/doxia/doxia-sink-api/1.7/doxia-sink-api-1.7.pom
[INFO] Downloaded from central: https://repo.maven.apache.org/maven2/org/apache/maven/doxia/doxia-sink-api/1.7/doxia-sink-api-1.7.pom
(1.5 kB at 17 kB/s)
[INFO] Downloading from central: https://repo.maven.apache.org/maven2/org/apache/maven/doxia/doxia/1.7/doxia-1.7.pom
[INFO] Downloaded from central: https://repo.maven.apache.org/maven2/org/apache/maven/doxia/doxia/1.7/doxia-1.7.pom
(15 kB at 526 kB/s)
[INFO] Downloading from central: https://repo.maven.apache.org/maven2/org/apache/maven/doxia/doxia-logging-api/1.7/doxia-logging-api-1.7.pom
[INFO] Downloaded from central: https://repo.maven.apache.org/maven2/org/apache/maven/doxia/doxia-logging-api/1.7/doxia-logging-api-1.7.pom
(1.5 kB at 55 kB/s)
[INFO] Downloading from central: https://repo.maven.apache.org/maven2/org/apache/maven/doxia/doxia-site-renderer/1.7.4/doxia-site-renderer-1.7.4.pom
[INFO] Downloaded from central: https://repo.maven.apache.org/maven2/org/apache/maven/doxia/doxia-site-renderer/1.7.4/doxia-site-renderer-1.7.4.pom
(6.7 kB at 278 kB/s)
[INFO] Downloading from central: https://repo.maven.apache.org/maven2/org/apache/maven/doxia/doxia-sitetools/1.7.4/doxia-sitetools-1.7.4.pom
[INFO] Downloaded from central: https://repo.maven.apache.org/maven2/org/apache/maven/doxia/doxia-sitetools/1.7.4/doxia-sitetools-1.7.4.pom
(14 kB at 467 kB/s)
[INFO] Downloading from central: https://repo.maven.apache.org/maven2/org/apache/maven/doxia/doxia-core/1.7/doxia-core-1.7.pom
[INFO] Downloaded from central: https://repo.maven.apache.org/maven2/org/apache/maven/doxia/doxia-core/1.7/doxia-core-1.7.pom
(4.1 kB at 150 kB/s)
[INFO] Downloading from central: https://repo.maven.apache.org/maven2/org/apache/maven/doxia/doxia-decoration-model/1.7.4/doxia-decoration-model-1.7.4.pom
[INFO] Downloaded from central: https://repo.maven.apache.org/maven2/org/apache/maven/doxia/doxia-decoration-model/1.7.4/doxia-decoration-model-1.7.4.pom
(3.4 kB at 121 kB/s)
[INFO] Downloading from central: https://repo.maven.apache.org/maven2/org/apache/maven/doxia/doxia-skin-model/1.7.4/doxia-skin-model-1.7.4.pom
[INFO] Downloaded from central: https://repo.maven.apache.org/maven2/org/apache/maven/doxia/doxia-skin-model/1.7.4/doxia-skin-model-1.7.4.pom
(3.0 kB at 112 kB/s)
[INFO] Downloading from central: https://repo.maven.apache.org/maven2/org/apache/maven/doxia/doxia-module-xhtml/1.7/doxia-module-xhtml-1.7.pom
[INFO] Downloaded from central: https://repo.maven.apache.org/maven2/org/apache/maven/doxia/doxia-module-xhtml/1.7/doxia-module-xhtml-1.7.pom
(1.6 kB at 91 kB/s)
[INFO] Downloading from central: https://repo.maven.apache.org/maven2/org/apache/maven/doxia/doxia-modules/1.7/doxia-modules-1.7.pom
[INFO] Downloaded from central: https://repo.maven.apache.org/maven2/org/apache/maven/doxia/doxia-modules/1.7/doxia-modules-1.7.pom
(2.6 kB at 105 kB/s)
[INFO] Downloading from central: https://repo.maven.apache.org/maven2/org/codehaus/groovy/groovy-all/2.4.8/groovy-all-2.4.8.pom
[INFO] Downloaded from central: https://repo.maven.apache.org/maven2/org/codehaus/groovy/groovy-all/2.4.8/groovy-all-2.4.8.pom
(21 kB at 689 kB/s)
[INFO] Downloading from central: https://repo.maven.apache.org/maven2/org/codehaus/plexus/plexus-interpolation/1.26/plexus-interpolation-1.26.pom
[INFO] Downloaded from central: https://repo.maven.apache.org/maven2/org/codehaus/plexus/plexus-interpolation/1.26/plexus-interpolation-1.26.pom
(2.7 kB at 98 kB/s)
[INFO] Downloading from central: https://repo.maven.apache.org/maven2/org/apache/maven/shared/maven-invoker/3.0.1/maven-invoker-3.0.1.jar
[INFO] Downloading from central: https://repo.maven.apache.org/maven2/org/apache/maven/reporting/maven-reporting-impl/2.4/maven-reporting-impl-2.4.jar
[INFO] Downloading from central: https://repo.maven.apache.org/maven2/commons-digester/commons-digester/1.8.1/commons-digester-1.8.1.jar
[INFO] Downloading from central: https://repo.maven.apache.org/maven2/commons-validator/commons-validator/1.4.1/commons-validator-1.4.1.jar
[INFO] Downloading from central: https://repo.maven.apache.org/maven2/commons-beanutils/commons-beanutils/1.8.3/commons-beanutils-1.8.3.jar
[INFO] Downloaded from central: https://repo.maven.apache.org/maven2/org/apache/maven/shared/maven-invoker/3.0.1/maven-invoker-3.0.1.jar
(33 kB at 500 kB/s)
[INFO] Downloading from central: https://repo.maven.apache.org/maven2/commons-logging/commons-logging/1.2/commons-logging-1.2.jar
[INFO] Downloaded from central: https://repo.maven.apache.org/maven2/org/apache/maven/reporting/maven-reporting-impl/2.4/maven-reporting-impl-2.4.jar
(20 kB at 243 kB/s)
[INFO] Downloading from central: https://repo.maven.apache.org/maven2/org/apache/maven/shared/maven-script-interpreter/1.2/maven-script-interpreter-1.2.jar
[INFO] Downloaded from central: https://repo.maven.apache.org/maven2/commons-digester/commons-digester/1.8.1/commons-digester-1.8.1.jar
(146 kB at 1.5 MB/s)
[INFO] Downloading from central: https://repo.maven.apache.org/maven2/org/apache/ant/ant/1.8.1/ant-1.8.1.jar
[INFO] Downloaded from central: https://repo.maven.apache.org/maven2/commons-logging/commons-logging/1.2/commons-logging-1.2.jar
(62 kB at 595 kB/s)
[INFO] Downloading from central: https://repo.maven.apache.org/maven2/org/apache/maven/shared/maven-common-artifact-filters/3.0.1/maven-common-artifact-filters-3.0.1.jar
[INFO] Downloaded from central: https://repo.maven.apache.org/maven2/commons-beanutils/commons-beanutils/1.8.3/commons-beanutils-1.8.3.jar
(232 kB at 2.0 MB/s)
[INFO] Downloading from central: https://repo.maven.apache.org/maven2/org/apache/maven/doxia/doxia-sink-api/1.7/doxia-sink-api-1.7.jar
[INFO] Downloaded from central: https://repo.maven.apache.org/maven2/org/apache/maven/shared/maven-script-interpreter/1.2/maven-script-interpreter-1.2.jar
(22 kB at 171 kB/s)
[INFO] Downloading from central: https://repo.maven.apache.org/maven2/org/apache/maven/doxia/doxia-logging-api/1.7/doxia-logging-api-1.7.jar
[INFO] Downloaded from central: https://repo.maven.apache.org/maven2/commons-validator/commons-validator/1.4.1/commons-validator-1.4.1.jar
(190 kB at 1.4 MB/s)
[INFO] Downloading from central: https://repo.maven.apache.org/maven2/org/apache/maven/doxia/doxia-site-renderer/1.7.4/doxia-site-renderer-1.7.4.jar
[INFO] Downloaded from central: https://repo.maven.apache.org/maven2/org/apache/maven/shared/maven-common-artifact-filters/3.0.1/maven-common-artifact-filters-3.0.1.jar
(61 kB at 427 kB/s)
[INFO] Downloading from central: https://repo.maven.apache.org/maven2/org/apache/maven/doxia/doxia-decoration-model/1.7.4/doxia-decoration-model-1.7.4.jar
[INFO] Downloaded from central: https://repo.maven.apache.org/maven2/org/apache/maven/doxia/doxia-sink-api/1.7/doxia-sink-api-1.7.jar
(11 kB at 78 kB/s)
[INFO] Downloading from central: https://repo.maven.apache.org/maven2/org/apache/maven/doxia/doxia-skin-model/1.7.4/doxia-skin-model-1.7.4.jar
[INFO] Downloaded from central: https://repo.maven.apache.org/maven2/org/apache/maven/doxia/doxia-logging-api/1.7/doxia-logging-api-1.7.jar
(12 kB at 71 kB/s)
[INFO] Downloading from central: https://repo.maven.apache.org/maven2/org/apache/maven/doxia/doxia-module-xhtml/1.7/doxia-module-xhtml-1.7.jar
[INFO] Downloaded from central: https://repo.maven.apache.org/maven2/org/apache/maven/doxia/doxia-site-renderer/1.7.4/doxia-site-renderer-1.7.4.jar
(64 kB at 376 kB/s)
[INFO] Downloading from central: https://repo.maven.apache.org/maven2/org/codehaus/groovy/groovy-all/2.4.8/groovy-all-2.4.8.jar
[INFO] Downloaded from central: https://repo.maven.apache.org/maven2/org/apache/maven/doxia/doxia-skin-model/1.7.4/doxia-skin-model-1.7.4.jar
(16 kB at 90 kB/s)
[INFO] Downloading from central: https://repo.maven.apache.org/maven2/org/codehaus/plexus/plexus-interpolation/1.26/plexus-interpolation-1.26.jar
[INFO] Downloaded from central: https://repo.maven.apache.org/maven2/org/apache/maven/doxia/doxia-decoration-model/1.7.4/doxia-decoration-model-1.7.4.jar
(61 kB at 337 kB/s)
[INFO] Downloaded from central: https://repo.maven.apache.org/maven2/org/apache/maven/doxia/doxia-module-xhtml/1.7/doxia-module-xhtml-1.7.jar
(17 kB at 89 kB/s)
[INFO] Downloaded from central: https://repo.maven.apache.org/maven2/org/codehaus/plexus/plexus-interpolation/1.26/plexus-interpolation-1.26.jar
(85 kB at 390 kB/s)
[INFO] Downloaded from central: https://repo.maven.apache.org/maven2/org/apache/ant/ant/1.8.1/ant-1.8.1.jar
(1.5 MB at 6.3 MB/s)
[INFO] Downloaded from central: https://repo.maven.apache.org/maven2/org/codehaus/groovy/groovy-all/2.4.8/groovy-all-2.4.8.jar
(7.0 MB at 17 MB/s)
[INFO] Installing F:\jenkins\jenkins-slave\workspace\maven-box_maven-scm_master@2\m\maven-scm-providers\maven-scm-providers-svn\maven-scm-provider-svn-commons\pom.xml
to F:\jenkins\jenkins-slave\workspace\maven-box_maven-scm_master@2\m\maven-scm-plugin\target\local-repo\org\apache\maven\scm\maven-scm-provider-svn-commons\1.11.3-SNAPSHOT\maven-scm-provider-svn-commons-1.11.3-SNAPSHOT.pom
[INFO] Installing F:\jenkins\jenkins-slave\workspace\maven-box_maven-scm_master@2\m\maven-scm-providers\maven-scm-providers-svn\maven-scm-provider-svn-commons\target\maven-scm-provider-svn-commons-1.11.3-SNAPSHOT.jar
to F:\jenkins\jenkins-slave\workspace\maven-box_maven-scm_master@2\m\maven-scm-plugin\target\local-repo\org\apache\maven\scm\maven-scm-provider-svn-commons\1.11.3-SNAPSHOT\maven-scm-provider-svn-commons-1.11.3-SNAPSHOT.jar
[INFO] Installing F:\jenkins\jenkins-slave\workspace\maven-box_maven-scm_master@2\m\maven-scm-providers\maven-scm-providers-svn\pom.xml
to F:\jenkins\jenkins-slave\workspace\maven-box_maven-scm_master@2\m\maven-scm-plugin\target\local-repo\org\apache\maven\scm\maven-scm-providers-svn\1.11.3-SNAPSHOT\maven-scm-providers-svn-1.11.3-SNAPSHOT.pom
[INFO] Installing F:\jenkins\jenkins-slave\workspace\maven-box_maven-scm_master@2\m\maven-scm-providers\pom.xml
to F:\jenkins\jenkins-slave\workspace\maven-box_maven-scm_master@2\m\maven-scm-plugin\target\local-repo\org\apache\maven\scm\maven-scm-providers\1.11.3-SNAPSHOT\maven-scm-providers-1.11.3-SNAPSHOT.pom
[INFO] Installing f:\jenkins\jenkins-slave\workspace\maven-box_maven-scm_master@2\m\pom.xml
to F:\jenkins\jenkins-slave\workspace\maven-box_maven-scm_master@2\m\maven-scm-plugin\target\local-repo\org\apache\maven\scm\maven-scm\1.11.3-SNAPSHOT\maven-scm-1.11.3-SNAPSHOT.pom
[INFO] Installing F:\jenkins\jenkins-slave\workspace\maven-box_maven-scm_master@2\m\maven-scm-api\pom.xml
to F:\jenkins\jenkins-slave\workspace\maven-box_maven-scm_master@2\m\maven-scm-plugin\target\local-repo\org\apache\maven\scm\maven-scm-api\1.11.3-SNAPSHOT\maven-scm-api-1.11.3-SNAPSHOT.pom
[INFO] Installing F:\jenkins\jenkins-slave\workspace\maven-box_maven-scm_master@2\m\maven-scm-api\target\maven-scm-api-1.11.3-SNAPSHOT.jar
to F:\jenkins\jenkins-slave\workspace\maven-box_maven-scm_master@2\m\maven-scm-plugin\target\local-repo\org\apache\maven\scm\maven-scm-api\1.11.3-SNAPSHOT\maven-scm-api-1.11.3-SNAPSHOT.jar
[INFO] Installing F:\jenkins\jenkins-slave\workspace\maven-box_maven-scm_master@2\m\maven-scm-test\pom.xml
to F:\jenkins\jenkins-slave\workspace\maven-box_maven-scm_master@2\m\maven-scm-plugin\target\local-repo\org\apache\maven\scm\maven-scm-test\1.11.3-SNAPSHOT\maven-scm-test-1.11.3-SNAPSHOT.pom
[INFO] Installing F:\jenkins\jenkins-slave\workspace\maven-box_maven-scm_master@2\m\maven-scm-test\target\maven-scm-test-1.11.3-SNAPSHOT.jar
to F:\jenkins\jenkins-slave\workspace\maven-box_maven-scm_master@2\m\maven-scm-plugin\target\local-repo\org\apache\maven\scm\maven-scm-test\1.11.3-SNAPSHOT\maven-scm-test-1.11.3-SNAPSHOT.jar
[INFO] Installing F:\jenkins\jenkins-slave\workspace\maven-box_maven-scm_master@2\m\maven-scm-managers\maven-scm-manager-plexus\pom.xml
to F:\jenkins\jenkins-slave\workspace\maven-box_maven-scm_master@2\m\maven-scm-plugin\target\local-repo\org\apache\maven\scm\maven-scm-manager-plexus\1.11.3-SNAPSHOT\maven-scm-manager-plexus-1.11.3-SNAPSHOT.pom
[INFO] Installing F:\jenkins\jenkins-slave\workspace\maven-box_maven-scm_master@2\m\maven-scm-managers\maven-scm-manager-plexus\target\maven-scm-manager-plexus-1.11.3-SNAPSHOT.jar
to F:\jenkins\jenkins-slave\workspace\maven-box_maven-scm_master@2\m\maven-scm-plugin\target\local-repo\org\apache\maven\scm\maven-scm-manager-plexus\1.11.3-SNAPSHOT\maven-scm-manager-plexus-1.11.3-SNAPSHOT.jar
[INFO] Installing F:\jenkins\jenkins-slave\workspace\maven-box_maven-scm_master@2\m\maven-scm-managers\pom.xml
to F:\jenkins\jenkins-slave\workspace\maven-box_maven-scm_master@2\m\maven-scm-plugin\target\local-repo\org\apache\maven\scm\maven-scm-managers\1.11.3-SNAPSHOT\maven-scm-managers-1.11.3-SNAPSHOT.pom
[INFO] Installing F:\jenkins\jenkins-slave\workspace\maven-box_maven-scm_master@2\m\maven-scm-providers\maven-scm-providers-standard\pom.xml
to F:\jenkins\jenkins-slave\workspace\maven-box_maven-scm_master@2\m\maven-scm-plugin\target\local-repo\org\apache\maven\scm\maven-scm-providers-standard\1.11.3-SNAPSHOT\maven-scm-providers-standard-1.11.3-SNAPSHOT.pom
[INFO] Installing F:\jenkins\jenkins-slave\workspace\maven-box_maven-scm_master@2\m\maven-scm-providers\maven-scm-provider-hg\pom.xml
to F:\jenkins\jenkins-slave\workspace\maven-box_maven-scm_master@2\m\maven-scm-plugin\target\local-repo\org\apache\maven\scm\maven-scm-provider-hg\1.11.3-SNAPSHOT\maven-scm-provider-hg-1.11.3-SNAPSHOT.pom
[INFO] Installing F:\jenkins\jenkins-slave\workspace\maven-box_maven-scm_master@2\m\maven-scm-providers\maven-scm-provider-hg\target\maven-scm-provider-hg-1.11.3-SNAPSHOT.jar
to F:\jenkins\jenkins-slave\workspace\maven-box_maven-scm_master@2\m\maven-scm-plugin\target\local-repo\org\apache\maven\scm\maven-scm-provider-hg\1.11.3-SNAPSHOT\maven-scm-provider-hg-1.11.3-SNAPSHOT.jar
[INFO] Installing F:\jenkins\jenkins-slave\workspace\maven-box_maven-scm_master@2\m\maven-scm-providers\maven-scm-providers-svn\maven-scm-provider-svnexe\pom.xml
to F:\jenkins\jenkins-slave\workspace\maven-box_maven-scm_master@2\m\maven-scm-plugin\target\local-repo\org\apache\maven\scm\maven-scm-provider-svnexe\1.11.3-SNAPSHOT\maven-scm-provider-svnexe-1.11.3-SNAPSHOT.pom
[INFO] Installing F:\jenkins\jenkins-slave\workspace\maven-box_maven-scm_master@2\m\maven-scm-providers\maven-scm-providers-svn\maven-scm-provider-svnexe\target\maven-scm-provider-svnexe-1.11.3-SNAPSHOT.jar
to F:\jenkins\jenkins-slave\workspace\maven-box_maven-scm_master@2\m\maven-scm-plugin\target\local-repo\org\apache\maven\scm\maven-scm-provider-svnexe\1.11.3-SNAPSHOT\maven-scm-provider-svnexe-1.11.3-SNAPSHOT.jar
[INFO] Installing F:\jenkins\jenkins-slave\workspace\maven-box_maven-scm_master@2\m\maven-scm-providers\maven-scm-providers-svn\maven-scm-provider-svntest\pom.xml
to F:\jenkins\jenkins-slave\workspace\maven-box_maven-scm_master@2\m\maven-scm-plugin\target\local-repo\org\apache\maven\scm\maven-scm-provider-svntest\1.11.3-SNAPSHOT\maven-scm-provider-svntest-1.11.3-SNAPSHOT.pom
[INFO] Installing F:\jenkins\jenkins-slave\workspace\maven-box_maven-scm_master@2\m\maven-scm-providers\maven-scm-providers-svn\maven-scm-provider-svntest\target\maven-scm-provider-svntest-1.11.3-SNAPSHOT.jar
to F:\jenkins\jenkins-slave\workspace\maven-box_maven-scm_master@2\m\maven-scm-plugin\target\local-repo\org\apache\maven\scm\maven-scm-provider-svntest\1.11.3-SNAPSHOT\maven-scm-provider-svntest-1.11.3-SNAPSHOT.jar
[INFO] Installing F:\jenkins\jenkins-slave\workspace\maven-box_maven-scm_master@2\m\maven-scm-providers\maven-scm-providers-cvs\maven-scm-provider-cvsjava\pom.xml
to F:\jenkins\jenkins-slave\workspace\maven-box_maven-scm_master@2\m\maven-scm-plugin\target\local-repo\org\apache\maven\scm\maven-scm-provider-cvsjava\1.11.3-SNAPSHOT\maven-scm-provider-cvsjava-1.11.3-SNAPSHOT.pom
[INFO] Installing F:\jenkins\jenkins-slave\workspace\maven-box_maven-scm_master@2\m\maven-scm-providers\maven-scm-providers-cvs\maven-scm-provider-cvsjava\target\maven-scm-provider-cvsjava-1.11.3-SNAPSHOT.jar
to F:\jenkins\jenkins-slave\workspace\maven-box_maven-scm_master@2\m\maven-scm-plugin\target\local-repo\org\apache\maven\scm\maven-scm-provider-cvsjava\1.11.3-SNAPSHOT\maven-scm-provider-cvsjava-1.11.3-SNAPSHOT.jar
[INFO] Installing F:\jenkins\jenkins-slave\workspace\maven-box_maven-scm_master@2\m\maven-scm-providers\maven-scm-providers-cvs\pom.xml
to F:\jenkins\jenkins-slave\workspace\maven-box_maven-scm_master@2\m\maven-scm-plugin\target\local-repo\org\apache\maven\scm\maven-scm-providers-cvs\1.11.3-SNAPSHOT\maven-scm-providers-cvs-1.11.3-SNAPSHOT.pom
[INFO] Installing F:\jenkins\jenkins-slave\workspace\maven-box_maven-scm_master@2\m\maven-scm-providers\maven-scm-providers-cvs\maven-scm-provider-cvs-commons\pom.xml
to F:\jenkins\jenkins-slave\workspace\maven-box_maven-scm_master@2\m\maven-scm-plugin\target\local-repo\org\apache\maven\scm\maven-scm-provider-cvs-commons\1.11.3-SNAPSHOT\maven-scm-provider-cvs-commons-1.11.3-SNAPSHOT.pom
[INFO] Installing F:\jenkins\jenkins-slave\workspace\maven-box_maven-scm_master@2\m\maven-scm-providers\maven-scm-providers-cvs\maven-scm-provider-cvs-commons\target\maven-scm-provider-cvs-commons-1.11.3-SNAPSHOT.jar
to F:\jenkins\jenkins-slave\workspace\maven-box_maven-scm_master@2\m\maven-scm-plugin\target\local-repo\org\apache\maven\scm\maven-scm-provider-cvs-commons\1.11.3-SNAPSHOT\maven-scm-provider-cvs-commons-1.11.3-SNAPSHOT.jar
[INFO] Installing F:\jenkins\jenkins-slave\workspace\maven-box_maven-scm_master@2\m\maven-scm-providers\maven-scm-providers-cvs\maven-scm-provider-cvstest\pom.xml
to F:\jenkins\jenkins-slave\workspace\maven-box_maven-scm_master@2\m\maven-scm-plugin\target\local-repo\org\apache\maven\scm\maven-scm-provider-cvstest\1.11.3-SNAPSHOT\maven-scm-provider-cvstest-1.11.3-SNAPSHOT.pom
[INFO] Installing F:\jenkins\jenkins-slave\workspace\maven-box_maven-scm_master@2\m\maven-scm-providers\maven-scm-providers-cvs\maven-scm-provider-cvstest\target\maven-scm-provider-cvstest-1.11.3-SNAPSHOT.jar
to F:\jenkins\jenkins-slave\workspace\maven-box_maven-scm_master@2\m\maven-scm-plugin\target\local-repo\org\apache\maven\scm\maven-scm-provider-cvstest\1.11.3-SNAPSHOT\maven-scm-provider-cvstest-1.11.3-SNAPSHOT.jar
[INFO] Installing F:\jenkins\jenkins-slave\workspace\maven-box_maven-scm_master@2\m\maven-scm-providers\maven-scm-provider-integrity\pom.xml
to F:\jenkins\jenkins-slave\workspace\maven-box_maven-scm_master@2\m\maven-scm-plugin\target\local-repo\org\apache\maven\scm\maven-scm-provider-integrity\1.11.3-SNAPSHOT\maven-scm-provider-integrity-1.11.3-SNAPSHOT.pom
[INFO] Installing F:\jenkins\jenkins-slave\workspace\maven-box_maven-scm_master@2\m\maven-scm-providers\maven-scm-provider-integrity\target\maven-scm-provider-integrity-1.11.3-SNAPSHOT.jar
to F:\jenkins\jenkins-slave\workspace\maven-box_maven-scm_master@2\m\maven-scm-plugin\target\local-repo\org\apache\maven\scm\maven-scm-provider-integrity\1.11.3-SNAPSHOT\maven-scm-provider-integrity-1.11.3-SNAPSHOT.jar
[INFO] Installing F:\jenkins\jenkins-slave\workspace\maven-box_maven-scm_master@2\m\maven-scm-providers\maven-scm-provider-synergy\pom.xml
to F:\jenkins\jenkins-slave\workspace\maven-box_maven-scm_master@2\m\maven-scm-plugin\target\local-repo\org\apache\maven\scm\maven-scm-provider-synergy\1.11.3-SNAPSHOT\maven-scm-provider-synergy-1.11.3-SNAPSHOT.pom
[INFO] Installing F:\jenkins\jenkins-slave\workspace\maven-box_maven-scm_master@2\m\maven-scm-providers\maven-scm-provider-synergy\target\maven-scm-provider-synergy-1.11.3-SNAPSHOT.jar
to F:\jenkins\jenkins-slave\workspace\maven-box_maven-scm_master@2\m\maven-scm-plugin\target\local-repo\org\apache\maven\scm\maven-scm-provider-synergy\1.11.3-SNAPSHOT\maven-scm-provider-synergy-1.11.3-SNAPSHOT.jar
[INFO] Installing F:\jenkins\jenkins-slave\workspace\maven-box_maven-scm_master@2\m\maven-scm-providers\maven-scm-provider-perforce\pom.xml
to F:\jenkins\jenkins-slave\workspace\maven-box_maven-scm_master@2\m\maven-scm-plugin\target\local-repo\org\apache\maven\scm\maven-scm-provider-perforce\1.11.3-SNAPSHOT\maven-scm-provider-perforce-1.11.3-SNAPSHOT.pom
[INFO] Installing F:\jenkins\jenkins-slave\workspace\maven-box_maven-scm_master@2\m\maven-scm-providers\maven-scm-provider-perforce\target\maven-scm-provider-perforce-1.11.3-SNAPSHOT.jar
to F:\jenkins\jenkins-slave\workspace\maven-box_maven-scm_master@2\m\maven-scm-plugin\target\local-repo\org\apache\maven\scm\maven-scm-provider-perforce\1.11.3-SNAPSHOT\maven-scm-provider-perforce-1.11.3-SNAPSHOT.jar
[INFO] Installing F:\jenkins\jenkins-slave\workspace\maven-box_maven-scm_master@2\m\maven-scm-providers\maven-scm-provider-jazz\pom.xml
to F:\jenkins\jenkins-slave\workspace\maven-box_maven-scm_master@2\m\maven-scm-plugin\target\local-repo\org\apache\maven\scm\maven-scm-provider-jazz\1.11.3-SNAPSHOT\maven-scm-provider-jazz-1.11.3-SNAPSHOT.pom
[INFO] Installing F:\jenkins\jenkins-slave\workspace\maven-box_maven-scm_master@2\m\maven-scm-providers\maven-scm-provider-jazz\target\maven-scm-provider-jazz-1.11.3-SNAPSHOT.jar
to F:\jenkins\jenkins-slave\workspace\maven-box_maven-scm_master@2\m\maven-scm-plugin\target\local-repo\org\apache\maven\scm\maven-scm-provider-jazz\1.11.3-SNAPSHOT\maven-scm-provider-jazz-1.11.3-SNAPSHOT.jar
[INFO] Installing F:\jenkins\jenkins-slave\workspace\maven-box_maven-scm_master@2\m\maven-scm-providers\maven-scm-providers-git\maven-scm-provider-jgit\pom.xml
to F:\jenkins\jenkins-slave\workspace\maven-box_maven-scm_master@2\m\maven-scm-plugin\target\local-repo\org\apache\maven\scm\maven-scm-provider-jgit\1.11.3-SNAPSHOT\maven-scm-provider-jgit-1.11.3-SNAPSHOT.pom
[INFO] Installing F:\jenkins\jenkins-slave\workspace\maven-box_maven-scm_master@2\m\maven-scm-providers\maven-scm-providers-git\maven-scm-provider-jgit\target\maven-scm-provider-jgit-1.11.3-SNAPSHOT.jar
to F:\jenkins\jenkins-slave\workspace\maven-box_maven-scm_master@2\m\maven-scm-plugin\target\local-repo\org\apache\maven\scm\maven-scm-provider-jgit\1.11.3-SNAPSHOT\maven-scm-provider-jgit-1.11.3-SNAPSHOT.jar
[INFO] Installing F:\jenkins\jenkins-slave\workspace\maven-box_maven-scm_master@2\m\maven-scm-providers\maven-scm-providers-git\pom.xml
to F:\jenkins\jenkins-slave\workspace\maven-box_maven-scm_master@2\m\maven-scm-plugin\target\local-repo\org\apache\maven\scm\maven-scm-providers-git\1.11.3-SNAPSHOT\maven-scm-providers-git-1.11.3-SNAPSHOT.pom
[INFO] Installing F:\jenkins\jenkins-slave\workspace\maven-box_maven-scm_master@2\m\maven-scm-providers\maven-scm-providers-git\maven-scm-provider-gittest\pom.xml
to F:\jenkins\jenkins-slave\workspace\maven-box_maven-scm_master@2\m\maven-scm-plugin\target\local-repo\org\apache\maven\scm\maven-scm-provider-gittest\1.11.3-SNAPSHOT\maven-scm-provider-gittest-1.11.3-SNAPSHOT.pom
[INFO] Installing F:\jenkins\jenkins-slave\workspace\maven-box_maven-scm_master@2\m\maven-scm-providers\maven-scm-providers-git\maven-scm-provider-gittest\target\maven-scm-provider-gittest-1.11.3-SNAPSHOT.jar
to F:\jenkins\jenkins-slave\workspace\maven-box_maven-scm_master@2\m\maven-scm-plugin\target\local-repo\org\apache\maven\scm\maven-scm-provider-gittest\1.11.3-SNAPSHOT\maven-scm-provider-gittest-1.11.3-SNAPSHOT.jar
[INFO] Installing F:\jenkins\jenkins-slave\workspace\maven-box_maven-scm_master@2\m\maven-scm-providers\maven-scm-providers-git\maven-scm-provider-git-commons\pom.xml
to F:\jenkins\jenkins-slave\workspace\maven-box_maven-scm_master@2\m\maven-scm-plugin\target\local-repo\org\apache\maven\scm\maven-scm-provider-git-commons\1.11.3-SNAPSHOT\maven-scm-provider-git-commons-1.11.3-SNAPSHOT.pom
[INFO] Installing F:\jenkins\jenkins-slave\workspace\maven-box_maven-scm_master@2\m\maven-scm-providers\maven-scm-providers-git\maven-scm-provider-git-commons\target\maven-scm-provider-git-commons-1.11.3-SNAPSHOT.jar
to F:\jenkins\jenkins-slave\workspace\maven-box_maven-scm_master@2\m\maven-scm-plugin\target\local-repo\org\apache\maven\scm\maven-scm-provider-git-commons\1.11.3-SNAPSHOT\maven-scm-provider-git-commons-1.11.3-SNAPSHOT.jar
[INFO] Installing F:\jenkins\jenkins-slave\workspace\maven-box_maven-scm_master@2\m\maven-scm-providers\maven-scm-provider-tfs\pom.xml
to F:\jenkins\jenkins-slave\workspace\maven-box_maven-scm_master@2\m\maven-scm-plugin\target\local-repo\org\apache\maven\scm\maven-scm-provider-tfs\1.11.3-SNAPSHOT\maven-scm-provider-tfs-1.11.3-SNAPSHOT.pom
[INFO] Installing F:\jenkins\jenkins-slave\workspace\maven-box_maven-scm_master@2\m\maven-scm-providers\maven-scm-provider-tfs\target\maven-scm-provider-tfs-1.11.3-SNAPSHOT.jar
to F:\jenkins\jenkins-slave\workspace\maven-box_maven-scm_master@2\m\maven-scm-plugin\target\local-repo\org\apache\maven\scm\maven-scm-provider-tfs\1.11.3-SNAPSHOT\maven-scm-provider-tfs-1.11.3-SNAPSHOT.jar
[INFO] Installing F:\jenkins\jenkins-slave\workspace\maven-box_maven-scm_master@2\m\maven-scm-providers\maven-scm-provider-clearcase\pom.xml
to F:\jenkins\jenkins-slave\workspace\maven-box_maven-scm_master@2\m\maven-scm-plugin\target\local-repo\org\apache\maven\scm\maven-scm-provider-clearcase\1.11.3-SNAPSHOT\maven-scm-provider-clearcase-1.11.3-SNAPSHOT.pom
[INFO] Installing F:\jenkins\jenkins-slave\workspace\maven-box_maven-scm_master@2\m\maven-scm-providers\maven-scm-provider-clearcase\target\maven-scm-provider-clearcase-1.11.3-SNAPSHOT.jar
to F:\jenkins\jenkins-slave\workspace\maven-box_maven-scm_master@2\m\maven-scm-plugin\target\local-repo\org\apache\maven\scm\maven-scm-provider-clearcase\1.11.3-SNAPSHOT\maven-scm-provider-clearcase-1.11.3-SNAPSHOT.jar
[INFO] Installing F:\jenkins\jenkins-slave\workspace\maven-box_maven-scm_master@2\m\maven-scm-providers\maven-scm-provider-bazaar\pom.xml
to F:\jenkins\jenkins-slave\workspace\maven-box_maven-scm_master@2\m\maven-scm-plugin\target\local-repo\org\apache\maven\scm\maven-scm-provider-bazaar\1.11.3-SNAPSHOT\maven-scm-provider-bazaar-1.11.3-SNAPSHOT.pom
[INFO] Installing F:\jenkins\jenkins-slave\workspace\maven-box_maven-scm_master@2\m\maven-scm-providers\maven-scm-provider-bazaar\target\maven-scm-provider-bazaar-1.11.3-SNAPSHOT.jar
to F:\jenkins\jenkins-slave\workspace\maven-box_maven-scm_master@2\m\maven-scm-plugin\target\local-repo\org\apache\maven\scm\maven-scm-provider-bazaar\1.11.3-SNAPSHOT\maven-scm-provider-bazaar-1.11.3-SNAPSHOT.jar
[INFO] Installing F:\jenkins\jenkins-slave\workspace\maven-box_maven-scm_master@2\m\maven-scm-providers\maven-scm-provider-starteam\pom.xml
to F:\jenkins\jenkins-slave\workspace\maven-box_maven-scm_master@2\m\maven-scm-plugin\target\local-repo\org\apache\maven\scm\maven-scm-provider-starteam\1.11.3-SNAPSHOT\maven-scm-provider-starteam-1.11.3-SNAPSHOT.pom
[INFO] Installing F:\jenkins\jenkins-slave\workspace\maven-box_maven-scm_master@2\m\maven-scm-providers\maven-scm-provider-starteam\target\maven-scm-provider-starteam-1.11.3-SNAPSHOT.jar
to F:\jenkins\jenkins-slave\workspace\maven-box_maven-scm_master@2\m\maven-scm-plugin\target\local-repo\org\apache\maven\scm\maven-scm-provider-starteam\1.11.3-SNAPSHOT\maven-scm-provider-starteam-1.11.3-SNAPSHOT.jar
[INFO] Installing F:\jenkins\jenkins-slave\workspace\maven-box_maven-scm_master@2\m\maven-scm-providers\maven-scm-provider-vss\pom.xml
to F:\jenkins\jenkins-slave\workspace\maven-box_maven-scm_master@2\m\maven-scm-plugin\target\local-repo\org\apache\maven\scm\maven-scm-provider-vss\1.11.3-SNAPSHOT\maven-scm-provider-vss-1.11.3-SNAPSHOT.pom
[INFO] Installing F:\jenkins\jenkins-slave\workspace\maven-box_maven-scm_master@2\m\maven-scm-providers\maven-scm-provider-vss\target\maven-scm-provider-vss-1.11.3-SNAPSHOT.jar
to F:\jenkins\jenkins-slave\workspace\maven-box_maven-scm_master@2\m\maven-scm-plugin\target\local-repo\org\apache\maven\scm\maven-scm-provider-vss\1.11.3-SNAPSHOT\maven-scm-provider-vss-1.11.3-SNAPSHOT.jar
[INFO] Installing F:\jenkins\jenkins-slave\workspace\maven-box_maven-scm_master@2\m\maven-scm-providers\maven-scm-providers-cvs\maven-scm-provider-cvsexe\pom.xml
to F:\jenkins\jenkins-slave\workspace\maven-box_maven-scm_master@2\m\maven-scm-plugin\target\local-repo\org\apache\maven\scm\maven-scm-provider-cvsexe\1.11.3-SNAPSHOT\maven-scm-provider-cvsexe-1.11.3-SNAPSHOT.pom
[INFO] Installing F:\jenkins\jenkins-slave\workspace\maven-box_maven-scm_master@2\m\maven-scm-providers\maven-scm-providers-cvs\maven-scm-provider-cvsexe\target\maven-scm-provider-cvsexe-1.11.3-SNAPSHOT.jar
to F:\jenkins\jenkins-slave\workspace\maven-box_maven-scm_master@2\m\maven-scm-plugin\target\local-repo\org\apache\maven\scm\maven-scm-provider-cvsexe\1.11.3-SNAPSHOT\maven-scm-provider-cvsexe-1.11.3-SNAPSHOT.jar
[INFO] Installing F:\jenkins\jenkins-slave\workspace\maven-box_maven-scm_master@2\m\maven-scm-providers\maven-scm-provider-accurev\pom.xml
to F:\jenkins\jenkins-slave\workspace\maven-box_maven-scm_master@2\m\maven-scm-plugin\target\local-repo\org\apache\maven\scm\maven-scm-provider-accurev\1.11.3-SNAPSHOT\maven-scm-provider-accurev-1.11.3-SNAPSHOT.pom
[INFO] Installing F:\jenkins\jenkins-slave\workspace\maven-box_maven-scm_master@2\m\maven-scm-providers\maven-scm-provider-accurev\target\maven-scm-provider-accurev-1.11.3-SNAPSHOT.jar
to F:\jenkins\jenkins-slave\workspace\maven-box_maven-scm_master@2\m\maven-scm-plugin\target\local-repo\org\apache\maven\scm\maven-scm-provider-accurev\1.11.3-SNAPSHOT\maven-scm-provider-accurev-1.11.3-SNAPSHOT.jar
[INFO] Installing F:\jenkins\jenkins-slave\workspace\maven-box_maven-scm_master@2\m\maven-scm-providers\maven-scm-providers-git\maven-scm-provider-gitexe\pom.xml
to F:\jenkins\jenkins-slave\workspace\maven-box_maven-scm_master@2\m\maven-scm-plugin\target\local-repo\org\apache\maven\scm\maven-scm-provider-gitexe\1.11.3-SNAPSHOT\maven-scm-provider-gitexe-1.11.3-SNAPSHOT.pom
[INFO] Installing F:\jenkins\jenkins-slave\workspace\maven-box_maven-scm_master@2\m\maven-scm-providers\maven-scm-providers-git\maven-scm-provider-gitexe\target\maven-scm-provider-gitexe-1.11.3-SNAPSHOT.jar
to F:\jenkins\jenkins-slave\workspace\maven-box_maven-scm_master@2\m\maven-scm-plugin\target\local-repo\org\apache\maven\scm\maven-scm-provider-gitexe\1.11.3-SNAPSHOT\maven-scm-provider-gitexe-1.11.3-SNAPSHOT.jar
[INFO] Installing F:\jenkins\jenkins-slave\workspace\maven-box_maven-scm_master@2\m\maven-scm-providers\maven-scm-provider-local\pom.xml
to F:\jenkins\jenkins-slave\workspace\maven-box_maven-scm_master@2\m\maven-scm-plugin\target\local-repo\org\apache\maven\scm\maven-scm-provider-local\1.11.3-SNAPSHOT\maven-scm-provider-local-1.11.3-SNAPSHOT.pom
[INFO] Installing F:\jenkins\jenkins-slave\workspace\maven-box_maven-scm_master@2\m\maven-scm-providers\maven-scm-provider-local\target\maven-scm-provider-local-1.11.3-SNAPSHOT.jar
to F:\jenkins\jenkins-slave\workspace\maven-box_maven-scm_master@2\m\maven-scm-plugin\target\local-repo\org\apache\maven\scm\maven-scm-provider-local\1.11.3-SNAPSHOT\maven-scm-provider-local-1.11.3-SNAPSHOT.jar
[INFO] Installing F:\jenkins\jenkins-slave\workspace\maven-box_maven-scm_master@2\m\maven-scm-plugin\pom.xml
to F:\jenkins\jenkins-slave\workspace\maven-box_maven-scm_master@2\m\maven-scm-plugin\target\local-repo\org\apache\maven\plugins\maven-scm-plugin\1.11.3-SNAPSHOT\maven-scm-plugin-1.11.3-SNAPSHOT.pom
[INFO] Installing F:\jenkins\jenkins-slave\workspace\maven-box_maven-scm_master@2\m\maven-scm-plugin\target\maven-scm-plugin-1.11.3-SNAPSHOT.jar
to F:\jenkins\jenkins-slave\workspace\maven-box_maven-scm_master@2\m\maven-scm-plugin\target\local-repo\org\apache\maven\plugins\maven-scm-plugin\1.11.3-SNAPSHOT\maven-scm-plugin-1.11.3-SNAPSHOT.jar
[INFO] 
[INFO] --- maven-invoker-plugin:3.2.1:run (integration-test) @ maven-scm-plugin ---
[INFO] No projects were selected for execution.
[INFO] 
[INFO] --- maven-checkstyle-plugin:3.0.0:check (checkstyle-check) @ maven-scm-plugin ---
[INFO] ------------------------------------------------------------------------
[INFO] Reactor Summary for Maven SCM 1.11.3-SNAPSHOT:
[INFO] 
[INFO] Maven SCM .......................................... SUCCESS [ 45.414 s]
[INFO] Maven SCM API ...................................... SUCCESS [ 14.229 s]
[INFO] Maven SCM Managers ................................. SUCCESS [  0.518 s]
[INFO] Maven SCM Manager for Plexus ....................... SUCCESS [  2.044 s]
[INFO] Maven SCM Test ..................................... SUCCESS [  3.167 s]
[INFO] Maven SCM Providers ................................ SUCCESS [  1.021 s]
[INFO] Maven SCM AccuRev Provider ......................... SUCCESS [  9.196 s]
[INFO] Maven SCM Bazaar Provider .......................... SUCCESS [  3.794 s]
[INFO] Maven SCM Clearcase Provider ....................... SUCCESS [  8.466 s]
[INFO] Maven SCM CVS Provider - Parent .................... SUCCESS [  0.743 s]
[INFO] Maven SCM CVS Provider TCK tests ................... SUCCESS [  2.323 s]
[INFO] Maven SCM CVS Provider - Common library ............ SUCCESS [  4.636 s]
[INFO] Maven SCM CVS Provider - CVS Executable Impl. ...... SUCCESS [  3.715 s]
[INFO] Maven SCM CVS Provider - CVS Java Impl. ............ SUCCESS [  4.005 s]
[INFO] Maven SCM Mercurial (Hg) Provider .................. SUCCESS [  3.674 s]
[INFO] Maven SCM Git Provider - Parent .................... SUCCESS [  0.667 s]
[INFO] Maven SCM Git Provider - Common library ............ SUCCESS [  2.805 s]
[INFO] Maven SCM Git Provider TCK Tests ................... SUCCESS [  1.395 s]
[INFO] Maven SCM Git Provider - Git Executable Impl. ...... SUCCESS [ 15.864 s]
[INFO] Maven SCM Git Provider - JGit Impl. ................ SUCCESS [ 46.549 s]
[INFO] Maven SCM Local Provider ........................... SUCCESS [  2.916 s]
[INFO] Maven SCM Perforce Provider ........................ SUCCESS [  5.905 s]
[INFO] Maven SCM Starteam Provider ........................ SUCCESS [  7.439 s]
[INFO] Maven SCM Subversion Provider - Parent ............. SUCCESS [  0.656 s]
[INFO] Maven SCM Subversion Provider - Common library ..... SUCCESS [  3.929 s]
[INFO] Maven SCM Subversion Provider TCK Tests ............ SUCCESS [  2.149 s]
[INFO] Maven SCM Subversion Provider - SVN Executable Impl. SUCCESS [  7.453 s]
[INFO] Maven SCM Synergy Provider ......................... SUCCESS [  4.564 s]
[INFO] Maven SCM Visual Source Safe Provider .............. SUCCESS [  4.610 s]
[INFO] Maven SCM TFS Provider ............................. SUCCESS [  4.239 s]
[INFO] Maven SCM MKS Integrity Provider ................... SUCCESS [  5.491 s]
[INFO] Maven SCM Jazz/Rational Team Concert Provider ...... SUCCESS [  6.571 s]
[INFO] Maven SCM Standard Providers ....................... SUCCESS [  2.344 s]
[INFO] Maven SCM Client ................................... SUCCESS [  3.720 s]
[INFO] Maven SCM Plugin ................................... SUCCESS [01:31 min]
[INFO] ------------------------------------------------------------------------
[INFO] BUILD SUCCESS
[INFO] ------------------------------------------------------------------------
[INFO] Total time:  05:29 min
[INFO] Finished at: 2020-05-17T15:10:31-07:00
[INFO] ------------------------------------------------------------------------
[WARNING] The requested profile "run-its" could not be activated because it does not exist.
[INFO] [jenkins-event-spy] Generated F:\jenkins\jenkins-slave\workspace\maven-box_maven-scm_master@2@tmp\withMavenf8fc0c5b\maven-spy-20200517-150501-2502217259680267822488.log
[Pipeline] }
[Pipeline] // dir
[Pipeline] }
[withMaven] invokerPublisher - Archive invoker results for Maven artifact MavenArtifact{org.apache.maven.plugins:maven-scm-plugin:maven-plugin:1.11.3-SNAPSHOT(version:
1.11.3-SNAPSHOT, snapshot:false) } generated by PluginInvocation{org.apache.maven.plugins:maven-invoker-plugin:3.2.1@run
 integration-test}: m\maven-scm-plugin\target\invoker-reports\*.xml
[withMaven] junitPublisher - Archive test results for Maven artifact org.apache.maven.scm:maven-scm-api:jar:1.11.3-SNAPSHOT
generated by maven-surefire-plugin:test (default-test): m\maven-scm-api\target\surefire-reports\*.xml
[withMaven] junitPublisher - Archive test results for Maven artifact org.apache.maven.scm:maven-scm-manager-plexus:jar:1.11.3-SNAPSHOT
generated by maven-surefire-plugin:test (default-test): m\maven-scm-managers\maven-scm-manager-plexus\target\surefire-reports\*.xml
[withMaven] junitPublisher - Archive test results for Maven artifact org.apache.maven.scm:maven-scm-test:jar:1.11.3-SNAPSHOT
generated by maven-surefire-plugin:test (default-test): m\maven-scm-test\target\surefire-reports\*.xml
[withMaven] junitPublisher - Archive test results for Maven artifact org.apache.maven.scm:maven-scm-provider-accurev:jar:1.11.3-SNAPSHOT
generated by maven-surefire-plugin:test (default-test): m\maven-scm-providers\maven-scm-provider-accurev\target\surefire-reports\*.xml
[withMaven] junitPublisher - Archive test results for Maven artifact org.apache.maven.scm:maven-scm-provider-bazaar:jar:1.11.3-SNAPSHOT
generated by maven-surefire-plugin:test (default-test): m\maven-scm-providers\maven-scm-provider-bazaar\target\surefire-reports\*.xml
[withMaven] junitPublisher - Archive test results for Maven artifact org.apache.maven.scm:maven-scm-provider-clearcase:jar:1.11.3-SNAPSHOT
generated by maven-surefire-plugin:test (default-test): m\maven-scm-providers\maven-scm-provider-clearcase\target\surefire-reports\*.xml
[withMaven] junitPublisher - Archive test results for Maven artifact org.apache.maven.scm:maven-scm-provider-cvstest:jar:1.11.3-SNAPSHOT
generated by maven-surefire-plugin:test (default-test): m\maven-scm-providers\maven-scm-providers-cvs\maven-scm-provider-cvstest\target\surefire-reports\*.xml
[withMaven] junitPublisher - Archive test results for Maven artifact org.apache.maven.scm:maven-scm-provider-cvs-commons:jar:1.11.3-SNAPSHOT
generated by maven-surefire-plugin:test (default-test): m\maven-scm-providers\maven-scm-providers-cvs\maven-scm-provider-cvs-commons\target\surefire-reports\*.xml
[withMaven] junitPublisher - Archive test results for Maven artifact org.apache.maven.scm:maven-scm-provider-cvsexe:jar:1.11.3-SNAPSHOT
generated by maven-surefire-plugin:test (default-test): m\maven-scm-providers\maven-scm-providers-cvs\maven-scm-provider-cvsexe\target\surefire-reports\*.xml
[withMaven] junitPublisher - Archive test results for Maven artifact org.apache.maven.scm:maven-scm-provider-cvsjava:jar:1.11.3-SNAPSHOT
generated by maven-surefire-plugin:test (default-test): m\maven-scm-providers\maven-scm-providers-cvs\maven-scm-provider-cvsjava\target\surefire-reports\*.xml
[withMaven] junitPublisher - Archive test results for Maven artifact org.apache.maven.scm:maven-scm-provider-hg:jar:1.11.3-SNAPSHOT
generated by maven-surefire-plugin:test (default-test): m\maven-scm-providers\maven-scm-provider-hg\target\surefire-reports\*.xml
[withMaven] junitPublisher - Archive test results for Maven artifact org.apache.maven.scm:maven-scm-provider-git-commons:jar:1.11.3-SNAPSHOT
generated by maven-surefire-plugin:test (default-test): m\maven-scm-providers\maven-scm-providers-git\maven-scm-provider-git-commons\target\surefire-reports\*.xml
[withMaven] junitPublisher - Archive test results for Maven artifact org.apache.maven.scm:maven-scm-provider-gittest:jar:1.11.3-SNAPSHOT
generated by maven-surefire-plugin:test (default-test): m\maven-scm-providers\maven-scm-providers-git\maven-scm-provider-gittest\target\surefire-reports\*.xml
[withMaven] junitPublisher - Archive test results for Maven artifact org.apache.maven.scm:maven-scm-provider-gitexe:jar:1.11.3-SNAPSHOT
generated by maven-surefire-plugin:test (default-test): m\maven-scm-providers\maven-scm-providers-git\maven-scm-provider-gitexe\target\surefire-reports\*.xml
[withMaven] junitPublisher - Archive test results for Maven artifact org.apache.maven.scm:maven-scm-provider-jgit:jar:1.11.3-SNAPSHOT
generated by maven-surefire-plugin:test (default-test): m\maven-scm-providers\maven-scm-providers-git\maven-scm-provider-jgit\target\surefire-reports\*.xml
[withMaven] junitPublisher - Archive test results for Maven artifact org.apache.maven.scm:maven-scm-provider-local:jar:1.11.3-SNAPSHOT
generated by maven-surefire-plugin:test (default-test): m\maven-scm-providers\maven-scm-provider-local\target\surefire-reports\*.xml
[withMaven] junitPublisher - Archive test results for Maven artifact org.apache.maven.scm:maven-scm-provider-perforce:jar:1.11.3-SNAPSHOT
generated by maven-surefire-plugin:test (default-test): m\maven-scm-providers\maven-scm-provider-perforce\target\surefire-reports\*.xml
[withMaven] junitPublisher - Archive test results for Maven artifact org.apache.maven.scm:maven-scm-provider-starteam:jar:1.11.3-SNAPSHOT
generated by maven-surefire-plugin:test (default-test): m\maven-scm-providers\maven-scm-provider-starteam\target\surefire-reports\*.xml
[withMaven] junitPublisher - Archive test results for Maven artifact org.apache.maven.scm:maven-scm-provider-svn-commons:jar:1.11.3-SNAPSHOT
generated by maven-surefire-plugin:test (default-test): m\maven-scm-providers\maven-scm-providers-svn\maven-scm-provider-svn-commons\target\surefire-reports\*.xml
[withMaven] junitPublisher - Archive test results for Maven artifact org.apache.maven.scm:maven-scm-provider-svntest:jar:1.11.3-SNAPSHOT
generated by maven-surefire-plugin:test (default-test): m\maven-scm-providers\maven-scm-providers-svn\maven-scm-provider-svntest\target\surefire-reports\*.xml
[withMaven] junitPublisher - Archive test results for Maven artifact org.apache.maven.scm:maven-scm-provider-svnexe:jar:1.11.3-SNAPSHOT
generated by maven-surefire-plugin:test (default-test): m\maven-scm-providers\maven-scm-providers-svn\maven-scm-provider-svnexe\target\surefire-reports\*.xml
[withMaven] junitPublisher - Archive test results for Maven artifact org.apache.maven.scm:maven-scm-provider-synergy:jar:1.11.3-SNAPSHOT
generated by maven-surefire-plugin:test (default-test): m\maven-scm-providers\maven-scm-provider-synergy\target\surefire-reports\*.xml
[withMaven] junitPublisher - Archive test results for Maven artifact org.apache.maven.scm:maven-scm-provider-vss:jar:1.11.3-SNAPSHOT
generated by maven-surefire-plugin:test (default-test): m\maven-scm-providers\maven-scm-provider-vss\target\surefire-reports\*.xml
[withMaven] junitPublisher - Archive test results for Maven artifact org.apache.maven.scm:maven-scm-provider-tfs:jar:1.11.3-SNAPSHOT
generated by maven-surefire-plugin:test (default-test): m\maven-scm-providers\maven-scm-provider-tfs\target\surefire-reports\*.xml
[withMaven] junitPublisher - Archive test results for Maven artifact org.apache.maven.scm:maven-scm-provider-integrity:jar:1.11.3-SNAPSHOT
generated by maven-surefire-plugin:test (default-test): m\maven-scm-providers\maven-scm-provider-integrity\target\surefire-reports\*.xml
[withMaven] junitPublisher - Archive test results for Maven artifact org.apache.maven.scm:maven-scm-provider-jazz:jar:1.11.3-SNAPSHOT
generated by maven-surefire-plugin:test (default-test): m\maven-scm-providers\maven-scm-provider-jazz\target\surefire-reports\*.xml
[withMaven] junitPublisher - Archive test results for Maven artifact org.apache.maven.scm:maven-scm-client:jar:1.11.3-SNAPSHOT
generated by maven-surefire-plugin:test (default-test): m\maven-scm-client\target\surefire-reports\*.xml
[withMaven] junitPublisher - Archive test results for Maven artifact org.apache.maven.plugins:maven-scm-plugin:maven-plugin:1.11.3-SNAPSHOT
generated by maven-surefire-plugin:test (default-test): m\maven-scm-plugin\target\surefire-reports\*.xml
Recording test results
[withMaven] Publishers: Pipeline Graph Publisher: 12 ms, Invoker Publisher: 456 ms, Junit
Publisher: 7242 ms, Concordion Publisher: 1 ms, Dependencies Fingerprint Publisher: 924 ms,
JGiven Publisher: 1 ms, Jacoco Publisher: 1 ms, SpotBugs Publisher: 1 ms
[Pipeline] // withMaven
[Pipeline] cleanWs
[WS-CLEANUP] Deleting project workspace...
[WS-CLEANUP] Deferred wipeout is used...
[WS-CLEANUP] done
[Pipeline] }
[Pipeline] // stage
[Pipeline] }
[Pipeline] // node
[Pipeline] }
[Pipeline] // parallel
[Pipeline] stage
[Pipeline] { (Notifications)
[Pipeline] echo
Build result: UNSTABLE
[Pipeline] jiraIssueSelector
[Pipeline] echo
The authors of changes [elharo].
[Pipeline] echo
Sending email ...
[Pipeline] emailext
Mime
  • Unnamed multipart/mixed (inline, None, 0 bytes)
View raw message