maven-notifications mailing list archives

Site index · List index
Message view « Date » · « Thread »
Top « Date » · « Thread »
From Apache Jenkins Server <jenk...@builds.apache.org>
Subject Build failed in Jenkins: Maven TLP » maven » MNG-5937 #32
Date Thu, 21 May 2020 10:15:46 GMT
See https://builds.apache.org/job/maven-box/job/maven/job/MNG-5937/32/

Changes:

* set MAVENHOME_CONFIG=

12 tests failed.
FAILED:  org.apache.maven.it.MavenITmng5937MavenWrapper.linux-jdk15 / Run ITs Linux Java 15 / testitMNG5937Bin

Error Message:
Exit code was non-zero: 1; command line and log = 
/home/jenkins/jenkins-slave/workspace/maven-box_maven_MNG-5937/test/core-it-suite/target/apache-maven/bin/mvn --global-settings /home/jenkins/jenkins-slave/workspace/maven-box_maven_MNG-5937/test/core-it-suite/target/test-classes/settings.xml -e --batch-mode -Dmaven.repo.local=/home/jenkins/jenkins-slave/workspace/maven-box_maven_MNG-5937/test/it-local-repo validate
Picked up JAVA_TOOL_OPTIONS: -Dmaven.ext.class.path="/home/jenkins/jenkins-slave/workspace/maven-box_maven_MNG-5937/test@tmp/withMavenc3c0f348/pipeline-maven-spy.jar" -Dorg.jenkinsci.plugins.pipeline.maven.reportsFolder="/home/jenkins/jenkins-slave/workspace/maven-box_maven_MNG-5937/test@tmp/withMavenc3c0f348" 
Error: Could not find or load main class  
Caused by: java.lang.ClassNotFoundException:  


Stack Trace:
org.apache.maven.it.VerificationException: 
Exit code was non-zero: 1; command line and log = 
/home/jenkins/jenkins-slave/workspace/maven-box_maven_MNG-5937/test/core-it-suite/target/apache-maven/bin/mvn --global-settings /home/jenkins/jenkins-slave/workspace/maven-box_maven_MNG-5937/test/core-it-suite/target/test-classes/settings.xml -e --batch-mode -Dmaven.repo.local=/home/jenkins/jenkins-slave/workspace/maven-box_maven_MNG-5937/test/it-local-repo validate
Picked up JAVA_TOOL_OPTIONS: -Dmaven.ext.class.path="/home/jenkins/jenkins-slave/workspace/maven-box_maven_MNG-5937/test@tmp/withMavenc3c0f348/pipeline-maven-spy.jar" -Dorg.jenkinsci.plugins.pipeline.maven.reportsFolder="/home/jenkins/jenkins-slave/workspace/maven-box_maven_MNG-5937/test@tmp/withMavenc3c0f348" 
Error: Could not find or load main class  
Caused by: java.lang.ClassNotFoundException:  

	at org.apache.maven.it.MavenITmng5937MavenWrapper.testitMNG5937Bin(MavenITmng5937MavenWrapper.java:99)


FAILED:  org.apache.maven.it.MavenITmng5937MavenWrapper.linux-jdk15 / Run ITs Linux Java 15 / testitMNG5937Script

Error Message:
Exit code was non-zero: 1; command line and log = 
/home/jenkins/jenkins-slave/workspace/maven-box_maven_MNG-5937/test/core-it-suite/target/apache-maven/bin/mvn --global-settings /home/jenkins/jenkins-slave/workspace/maven-box_maven_MNG-5937/test/core-it-suite/target/test-classes/settings.xml -e --batch-mode -Dmaven.repo.local=/home/jenkins/jenkins-slave/workspace/maven-box_maven_MNG-5937/test/it-local-repo validate
Couldn't find .mvn/wrapper/maven-wrapper.jar, downloading it ...
Downloading from: file:/home/jenkins/jenkins-slave/workspace/maven-box_maven_MNG-5937/test/it-local-repo//org/apache/maven/maven-wrapper/3.7.0-SNAPSHOT/maven-wrapper-3.7.0-SNAPSHOT.jar
Found curl ... using curl
  % Total    % Received % Xferd  Average Speed   Time    Time     Time  Current
                                 Dload  Upload   Total   Spent    Left  Speed

  0     0    0     0    0     0      0      0 --:--:-- --:--:-- --:--:--     0
100 29428  100 29428    0     0  28.0M      0 --:--:-- --:--:-- --:--:-- 28.0M
Picked up JAVA_TOOL_OPTIONS: -Dmaven.ext.class.path="/home/jenkins/jenkins-slave/workspace/maven-box_maven_MNG-5937/test@tmp/withMavenc3c0f348/pipeline-maven-spy.jar" -Dorg.jenkinsci.plugins.pipeline.maven.reportsFolder="/home/jenkins/jenkins-slave/workspace/maven-box_maven_MNG-5937/test@tmp/withMavenc3c0f348" 
Error: Could not find or load main class  
Caused by: java.lang.ClassNotFoundException:  


Stack Trace:
org.apache.maven.it.VerificationException: 
Exit code was non-zero: 1; command line and log = 
/home/jenkins/jenkins-slave/workspace/maven-box_maven_MNG-5937/test/core-it-suite/target/apache-maven/bin/mvn --global-settings /home/jenkins/jenkins-slave/workspace/maven-box_maven_MNG-5937/test/core-it-suite/target/test-classes/settings.xml -e --batch-mode -Dmaven.repo.local=/home/jenkins/jenkins-slave/workspace/maven-box_maven_MNG-5937/test/it-local-repo validate
Couldn't find .mvn/wrapper/maven-wrapper.jar, downloading it ...
Downloading from: file:/home/jenkins/jenkins-slave/workspace/maven-box_maven_MNG-5937/test/it-local-repo//org/apache/maven/maven-wrapper/3.7.0-SNAPSHOT/maven-wrapper-3.7.0-SNAPSHOT.jar
Found curl ... using curl
  % Total    % Received % Xferd  Average Speed   Time    Time     Time  Current
                                 Dload  Upload   Total   Spent    Left  Speed

  0     0    0     0    0     0      0      0 --:--:-- --:--:-- --:--:--     0
100 29428  100 29428    0     0  28.0M      0 --:--:-- --:--:-- --:--:-- 28.0M
Picked up JAVA_TOOL_OPTIONS: -Dmaven.ext.class.path="/home/jenkins/jenkins-slave/workspace/maven-box_maven_MNG-5937/test@tmp/withMavenc3c0f348/pipeline-maven-spy.jar" -Dorg.jenkinsci.plugins.pipeline.maven.reportsFolder="/home/jenkins/jenkins-slave/workspace/maven-box_maven_MNG-5937/test@tmp/withMavenc3c0f348" 
Error: Could not find or load main class  
Caused by: java.lang.ClassNotFoundException:  

	at org.apache.maven.it.MavenITmng5937MavenWrapper.testitMNG5937Script(MavenITmng5937MavenWrapper.java:116)


FAILED:  org.apache.maven.it.MavenITmng5937MavenWrapper.linux-jdk15 / Run ITs Linux Java 15 / testitMNG5937Source

Error Message:
Exit code was non-zero: 1; command line and log = 
/home/jenkins/jenkins-slave/workspace/maven-box_maven_MNG-5937/test/core-it-suite/target/apache-maven/bin/mvn --global-settings /home/jenkins/jenkins-slave/workspace/maven-box_maven_MNG-5937/test/core-it-suite/target/test-classes/settings.xml -e --batch-mode -Dmaven.repo.local=/home/jenkins/jenkins-slave/workspace/maven-box_maven_MNG-5937/test/it-local-repo validate
 - Compiling MavenWrapperDownloader.java ...
Picked up JAVA_TOOL_OPTIONS: -Dmaven.ext.class.path="/home/jenkins/jenkins-slave/workspace/maven-box_maven_MNG-5937/test@tmp/withMavenc3c0f348/pipeline-maven-spy.jar" -Dorg.jenkinsci.plugins.pipeline.maven.reportsFolder="/home/jenkins/jenkins-slave/workspace/maven-box_maven_MNG-5937/test@tmp/withMavenc3c0f348" 
 - Running MavenWrapperDownloader.java ...
Picked up JAVA_TOOL_OPTIONS: -Dmaven.ext.class.path="/home/jenkins/jenkins-slave/workspace/maven-box_maven_MNG-5937/test@tmp/withMavenc3c0f348/pipeline-maven-spy.jar" -Dorg.jenkinsci.plugins.pipeline.maven.reportsFolder="/home/jenkins/jenkins-slave/workspace/maven-box_maven_MNG-5937/test@tmp/withMavenc3c0f348" 
- Downloader started
- Using base directory: /home/jenkins/jenkins-slave/workspace/maven-box_maven_MNG-5937/test/core-it-suite/target/test-classes/mng-5937-wrapper/source
- Downloading from: file:/home/jenkins/jenkins-slave/workspace/maven-box_maven_MNG-5937/test/it-local-repo//org/apache/maven/maven-wrapper/3.7.0-SNAPSHOT/maven-wrapper-3.7.0-SNAPSHOT.jar
- Downloading to: /home/jenkins/jenkins-slave/workspace/maven-box_maven_MNG-5937/test/core-it-suite/target/test-classes/mng-5937-wrapper/source/.mvn/wrapper/maven-wrapper.jar
Done
Picked up JAVA_TOOL_OPTIONS: -Dmaven.ext.class.path="/home/jenkins/jenkins-slave/workspace/maven-box_maven_MNG-5937/test@tmp/withMavenc3c0f348/pipeline-maven-spy.jar" -Dorg.jenkinsci.plugins.pipeline.maven.reportsFolder="/home/jenkins/jenkins-slave/workspace/maven-box_maven_MNG-5937/test@tmp/withMavenc3c0f348" 
Error: Could not find or load main class  
Caused by: java.lang.ClassNotFoundException:  


Stack Trace:
org.apache.maven.it.VerificationException: 
Exit code was non-zero: 1; command line and log = 
/home/jenkins/jenkins-slave/workspace/maven-box_maven_MNG-5937/test/core-it-suite/target/apache-maven/bin/mvn --global-settings /home/jenkins/jenkins-slave/workspace/maven-box_maven_MNG-5937/test/core-it-suite/target/test-classes/settings.xml -e --batch-mode -Dmaven.repo.local=/home/jenkins/jenkins-slave/workspace/maven-box_maven_MNG-5937/test/it-local-repo validate
 - Compiling MavenWrapperDownloader.java ...
Picked up JAVA_TOOL_OPTIONS: -Dmaven.ext.class.path="/home/jenkins/jenkins-slave/workspace/maven-box_maven_MNG-5937/test@tmp/withMavenc3c0f348/pipeline-maven-spy.jar" -Dorg.jenkinsci.plugins.pipeline.maven.reportsFolder="/home/jenkins/jenkins-slave/workspace/maven-box_maven_MNG-5937/test@tmp/withMavenc3c0f348" 
 - Running MavenWrapperDownloader.java ...
Picked up JAVA_TOOL_OPTIONS: -Dmaven.ext.class.path="/home/jenkins/jenkins-slave/workspace/maven-box_maven_MNG-5937/test@tmp/withMavenc3c0f348/pipeline-maven-spy.jar" -Dorg.jenkinsci.plugins.pipeline.maven.reportsFolder="/home/jenkins/jenkins-slave/workspace/maven-box_maven_MNG-5937/test@tmp/withMavenc3c0f348" 
- Downloader started
- Using base directory: /home/jenkins/jenkins-slave/workspace/maven-box_maven_MNG-5937/test/core-it-suite/target/test-classes/mng-5937-wrapper/source
- Downloading from: file:/home/jenkins/jenkins-slave/workspace/maven-box_maven_MNG-5937/test/it-local-repo//org/apache/maven/maven-wrapper/3.7.0-SNAPSHOT/maven-wrapper-3.7.0-SNAPSHOT.jar
- Downloading to: /home/jenkins/jenkins-slave/workspace/maven-box_maven_MNG-5937/test/core-it-suite/target/test-classes/mng-5937-wrapper/source/.mvn/wrapper/maven-wrapper.jar
Done
Picked up JAVA_TOOL_OPTIONS: -Dmaven.ext.class.path="/home/jenkins/jenkins-slave/workspace/maven-box_maven_MNG-5937/test@tmp/withMavenc3c0f348/pipeline-maven-spy.jar" -Dorg.jenkinsci.plugins.pipeline.maven.reportsFolder="/home/jenkins/jenkins-slave/workspace/maven-box_maven_MNG-5937/test@tmp/withMavenc3c0f348" 
Error: Could not find or load main class  
Caused by: java.lang.ClassNotFoundException:  

	at org.apache.maven.it.MavenITmng5937MavenWrapper.testitMNG5937Source(MavenITmng5937MavenWrapper.java:133)


FAILED:  org.apache.maven.it.MavenITmng5937MavenWrapper.linux-jdk14 / Run ITs Linux Java 14 / testitMNG5937Bin

Error Message:
Exit code was non-zero: 1; command line and log = 
/home/jenkins/jenkins-slave/workspace/maven-box_maven_MNG-5937/test/core-it-suite/target/apache-maven/bin/mvn --global-settings /home/jenkins/jenkins-slave/workspace/maven-box_maven_MNG-5937/test/core-it-suite/target/test-classes/settings.xml -e --batch-mode -Dmaven.repo.local=/home/jenkins/jenkins-slave/workspace/maven-box_maven_MNG-5937/test/it-local-repo validate
Picked up JAVA_TOOL_OPTIONS: -Dmaven.ext.class.path="/home/jenkins/jenkins-slave/workspace/maven-box_maven_MNG-5937/test@tmp/withMavend026cbcd/pipeline-maven-spy.jar" -Dorg.jenkinsci.plugins.pipeline.maven.reportsFolder="/home/jenkins/jenkins-slave/workspace/maven-box_maven_MNG-5937/test@tmp/withMavend026cbcd" 
Error: Could not find or load main class  
Caused by: java.lang.ClassNotFoundException:  


Stack Trace:
org.apache.maven.it.VerificationException: 
Exit code was non-zero: 1; command line and log = 
/home/jenkins/jenkins-slave/workspace/maven-box_maven_MNG-5937/test/core-it-suite/target/apache-maven/bin/mvn --global-settings /home/jenkins/jenkins-slave/workspace/maven-box_maven_MNG-5937/test/core-it-suite/target/test-classes/settings.xml -e --batch-mode -Dmaven.repo.local=/home/jenkins/jenkins-slave/workspace/maven-box_maven_MNG-5937/test/it-local-repo validate
Picked up JAVA_TOOL_OPTIONS: -Dmaven.ext.class.path="/home/jenkins/jenkins-slave/workspace/maven-box_maven_MNG-5937/test@tmp/withMavend026cbcd/pipeline-maven-spy.jar" -Dorg.jenkinsci.plugins.pipeline.maven.reportsFolder="/home/jenkins/jenkins-slave/workspace/maven-box_maven_MNG-5937/test@tmp/withMavend026cbcd" 
Error: Could not find or load main class  
Caused by: java.lang.ClassNotFoundException:  

	at org.apache.maven.it.MavenITmng5937MavenWrapper.testitMNG5937Bin(MavenITmng5937MavenWrapper.java:99)


FAILED:  org.apache.maven.it.MavenITmng5937MavenWrapper.linux-jdk14 / Run ITs Linux Java 14 / testitMNG5937Script

Error Message:
Exit code was non-zero: 1; command line and log = 
/home/jenkins/jenkins-slave/workspace/maven-box_maven_MNG-5937/test/core-it-suite/target/apache-maven/bin/mvn --global-settings /home/jenkins/jenkins-slave/workspace/maven-box_maven_MNG-5937/test/core-it-suite/target/test-classes/settings.xml -e --batch-mode -Dmaven.repo.local=/home/jenkins/jenkins-slave/workspace/maven-box_maven_MNG-5937/test/it-local-repo validate
Couldn't find .mvn/wrapper/maven-wrapper.jar, downloading it ...
Downloading from: file:/home/jenkins/jenkins-slave/workspace/maven-box_maven_MNG-5937/test/it-local-repo//org/apache/maven/maven-wrapper/3.7.0-SNAPSHOT/maven-wrapper-3.7.0-SNAPSHOT.jar
Found curl ... using curl
  % Total    % Received % Xferd  Average Speed   Time    Time     Time  Current
                                 Dload  Upload   Total   Spent    Left  Speed

  0     0    0     0    0     0      0      0 --:--:-- --:--:-- --:--:--     0
100 29428  100 29428    0     0  28.0M      0 --:--:-- --:--:-- --:--:-- 28.0M
Picked up JAVA_TOOL_OPTIONS: -Dmaven.ext.class.path="/home/jenkins/jenkins-slave/workspace/maven-box_maven_MNG-5937/test@tmp/withMavend026cbcd/pipeline-maven-spy.jar" -Dorg.jenkinsci.plugins.pipeline.maven.reportsFolder="/home/jenkins/jenkins-slave/workspace/maven-box_maven_MNG-5937/test@tmp/withMavend026cbcd" 
Error: Could not find or load main class  
Caused by: java.lang.ClassNotFoundException:  


Stack Trace:
org.apache.maven.it.VerificationException: 
Exit code was non-zero: 1; command line and log = 
/home/jenkins/jenkins-slave/workspace/maven-box_maven_MNG-5937/test/core-it-suite/target/apache-maven/bin/mvn --global-settings /home/jenkins/jenkins-slave/workspace/maven-box_maven_MNG-5937/test/core-it-suite/target/test-classes/settings.xml -e --batch-mode -Dmaven.repo.local=/home/jenkins/jenkins-slave/workspace/maven-box_maven_MNG-5937/test/it-local-repo validate
Couldn't find .mvn/wrapper/maven-wrapper.jar, downloading it ...
Downloading from: file:/home/jenkins/jenkins-slave/workspace/maven-box_maven_MNG-5937/test/it-local-repo//org/apache/maven/maven-wrapper/3.7.0-SNAPSHOT/maven-wrapper-3.7.0-SNAPSHOT.jar
Found curl ... using curl
  % Total    % Received % Xferd  Average Speed   Time    Time     Time  Current
                                 Dload  Upload   Total   Spent    Left  Speed

  0     0    0     0    0     0      0      0 --:--:-- --:--:-- --:--:--     0
100 29428  100 29428    0     0  28.0M      0 --:--:-- --:--:-- --:--:-- 28.0M
Picked up JAVA_TOOL_OPTIONS: -Dmaven.ext.class.path="/home/jenkins/jenkins-slave/workspace/maven-box_maven_MNG-5937/test@tmp/withMavend026cbcd/pipeline-maven-spy.jar" -Dorg.jenkinsci.plugins.pipeline.maven.reportsFolder="/home/jenkins/jenkins-slave/workspace/maven-box_maven_MNG-5937/test@tmp/withMavend026cbcd" 
Error: Could not find or load main class  
Caused by: java.lang.ClassNotFoundException:  

	at org.apache.maven.it.MavenITmng5937MavenWrapper.testitMNG5937Script(MavenITmng5937MavenWrapper.java:116)


FAILED:  org.apache.maven.it.MavenITmng5937MavenWrapper.linux-jdk14 / Run ITs Linux Java 14 / testitMNG5937Source

Error Message:
Exit code was non-zero: 1; command line and log = 
/home/jenkins/jenkins-slave/workspace/maven-box_maven_MNG-5937/test/core-it-suite/target/apache-maven/bin/mvn --global-settings /home/jenkins/jenkins-slave/workspace/maven-box_maven_MNG-5937/test/core-it-suite/target/test-classes/settings.xml -e --batch-mode -Dmaven.repo.local=/home/jenkins/jenkins-slave/workspace/maven-box_maven_MNG-5937/test/it-local-repo validate
 - Compiling MavenWrapperDownloader.java ...
Picked up JAVA_TOOL_OPTIONS: -Dmaven.ext.class.path="/home/jenkins/jenkins-slave/workspace/maven-box_maven_MNG-5937/test@tmp/withMavend026cbcd/pipeline-maven-spy.jar" -Dorg.jenkinsci.plugins.pipeline.maven.reportsFolder="/home/jenkins/jenkins-slave/workspace/maven-box_maven_MNG-5937/test@tmp/withMavend026cbcd" 
 - Running MavenWrapperDownloader.java ...
Picked up JAVA_TOOL_OPTIONS: -Dmaven.ext.class.path="/home/jenkins/jenkins-slave/workspace/maven-box_maven_MNG-5937/test@tmp/withMavend026cbcd/pipeline-maven-spy.jar" -Dorg.jenkinsci.plugins.pipeline.maven.reportsFolder="/home/jenkins/jenkins-slave/workspace/maven-box_maven_MNG-5937/test@tmp/withMavend026cbcd" 
- Downloader started
- Using base directory: /home/jenkins/jenkins-slave/workspace/maven-box_maven_MNG-5937/test/core-it-suite/target/test-classes/mng-5937-wrapper/source
- Downloading from: file:/home/jenkins/jenkins-slave/workspace/maven-box_maven_MNG-5937/test/it-local-repo//org/apache/maven/maven-wrapper/3.7.0-SNAPSHOT/maven-wrapper-3.7.0-SNAPSHOT.jar
- Downloading to: /home/jenkins/jenkins-slave/workspace/maven-box_maven_MNG-5937/test/core-it-suite/target/test-classes/mng-5937-wrapper/source/.mvn/wrapper/maven-wrapper.jar
Done
Picked up JAVA_TOOL_OPTIONS: -Dmaven.ext.class.path="/home/jenkins/jenkins-slave/workspace/maven-box_maven_MNG-5937/test@tmp/withMavend026cbcd/pipeline-maven-spy.jar" -Dorg.jenkinsci.plugins.pipeline.maven.reportsFolder="/home/jenkins/jenkins-slave/workspace/maven-box_maven_MNG-5937/test@tmp/withMavend026cbcd" 
Error: Could not find or load main class  
Caused by: java.lang.ClassNotFoundException:  


Stack Trace:
org.apache.maven.it.VerificationException: 
Exit code was non-zero: 1; command line and log = 
/home/jenkins/jenkins-slave/workspace/maven-box_maven_MNG-5937/test/core-it-suite/target/apache-maven/bin/mvn --global-settings /home/jenkins/jenkins-slave/workspace/maven-box_maven_MNG-5937/test/core-it-suite/target/test-classes/settings.xml -e --batch-mode -Dmaven.repo.local=/home/jenkins/jenkins-slave/workspace/maven-box_maven_MNG-5937/test/it-local-repo validate
 - Compiling MavenWrapperDownloader.java ...
Picked up JAVA_TOOL_OPTIONS: -Dmaven.ext.class.path="/home/jenkins/jenkins-slave/workspace/maven-box_maven_MNG-5937/test@tmp/withMavend026cbcd/pipeline-maven-spy.jar" -Dorg.jenkinsci.plugins.pipeline.maven.reportsFolder="/home/jenkins/jenkins-slave/workspace/maven-box_maven_MNG-5937/test@tmp/withMavend026cbcd" 
 - Running MavenWrapperDownloader.java ...
Picked up JAVA_TOOL_OPTIONS: -Dmaven.ext.class.path="/home/jenkins/jenkins-slave/workspace/maven-box_maven_MNG-5937/test@tmp/withMavend026cbcd/pipeline-maven-spy.jar" -Dorg.jenkinsci.plugins.pipeline.maven.reportsFolder="/home/jenkins/jenkins-slave/workspace/maven-box_maven_MNG-5937/test@tmp/withMavend026cbcd" 
- Downloader started
- Using base directory: /home/jenkins/jenkins-slave/workspace/maven-box_maven_MNG-5937/test/core-it-suite/target/test-classes/mng-5937-wrapper/source
- Downloading from: file:/home/jenkins/jenkins-slave/workspace/maven-box_maven_MNG-5937/test/it-local-repo//org/apache/maven/maven-wrapper/3.7.0-SNAPSHOT/maven-wrapper-3.7.0-SNAPSHOT.jar
- Downloading to: /home/jenkins/jenkins-slave/workspace/maven-box_maven_MNG-5937/test/core-it-suite/target/test-classes/mng-5937-wrapper/source/.mvn/wrapper/maven-wrapper.jar
Done
Picked up JAVA_TOOL_OPTIONS: -Dmaven.ext.class.path="/home/jenkins/jenkins-slave/workspace/maven-box_maven_MNG-5937/test@tmp/withMavend026cbcd/pipeline-maven-spy.jar" -Dorg.jenkinsci.plugins.pipeline.maven.reportsFolder="/home/jenkins/jenkins-slave/workspace/maven-box_maven_MNG-5937/test@tmp/withMavend026cbcd" 
Error: Could not find or load main class  
Caused by: java.lang.ClassNotFoundException:  

	at org.apache.maven.it.MavenITmng5937MavenWrapper.testitMNG5937Source(MavenITmng5937MavenWrapper.java:133)


FAILED:  org.apache.maven.it.MavenITmng5937MavenWrapper.linux-jdk8 / Run ITs Linux Java 8 / testitMNG5937Bin

Error Message:
Exit code was non-zero: 1; command line and log = 
/home/jenkins/jenkins-slave/workspace/maven-box_maven_MNG-5937/test/core-it-suite/target/apache-maven/bin/mvn --global-settings /home/jenkins/jenkins-slave/workspace/maven-box_maven_MNG-5937/test/core-it-suite/target/test-classes/settings.xml -e --batch-mode -Dmaven.repo.local=/home/jenkins/jenkins-slave/workspace/maven-box_maven_MNG-5937/test/it-local-repo validate
Picked up JAVA_TOOL_OPTIONS: -Dmaven.ext.class.path="/home/jenkins/jenkins-slave/workspace/maven-box_maven_MNG-5937/test@tmp/withMaven7d32029b/pipeline-maven-spy.jar" -Dorg.jenkinsci.plugins.pipeline.maven.reportsFolder="/home/jenkins/jenkins-slave/workspace/maven-box_maven_MNG-5937/test@tmp/withMaven7d32029b" 
Error: Could not find or load main class  


Stack Trace:
org.apache.maven.it.VerificationException: 
Exit code was non-zero: 1; command line and log = 
/home/jenkins/jenkins-slave/workspace/maven-box_maven_MNG-5937/test/core-it-suite/target/apache-maven/bin/mvn --global-settings /home/jenkins/jenkins-slave/workspace/maven-box_maven_MNG-5937/test/core-it-suite/target/test-classes/settings.xml -e --batch-mode -Dmaven.repo.local=/home/jenkins/jenkins-slave/workspace/maven-box_maven_MNG-5937/test/it-local-repo validate
Picked up JAVA_TOOL_OPTIONS: -Dmaven.ext.class.path="/home/jenkins/jenkins-slave/workspace/maven-box_maven_MNG-5937/test@tmp/withMaven7d32029b/pipeline-maven-spy.jar" -Dorg.jenkinsci.plugins.pipeline.maven.reportsFolder="/home/jenkins/jenkins-slave/workspace/maven-box_maven_MNG-5937/test@tmp/withMaven7d32029b" 
Error: Could not find or load main class  

	at org.apache.maven.it.MavenITmng5937MavenWrapper.testitMNG5937Bin(MavenITmng5937MavenWrapper.java:99)


FAILED:  org.apache.maven.it.MavenITmng5937MavenWrapper.linux-jdk8 / Run ITs Linux Java 8 / testitMNG5937Script

Error Message:
Exit code was non-zero: 1; command line and log = 
/home/jenkins/jenkins-slave/workspace/maven-box_maven_MNG-5937/test/core-it-suite/target/apache-maven/bin/mvn --global-settings /home/jenkins/jenkins-slave/workspace/maven-box_maven_MNG-5937/test/core-it-suite/target/test-classes/settings.xml -e --batch-mode -Dmaven.repo.local=/home/jenkins/jenkins-slave/workspace/maven-box_maven_MNG-5937/test/it-local-repo validate
Couldn't find .mvn/wrapper/maven-wrapper.jar, downloading it ...
Downloading from: file:/home/jenkins/jenkins-slave/workspace/maven-box_maven_MNG-5937/test/it-local-repo//org/apache/maven/maven-wrapper/3.7.0-SNAPSHOT/maven-wrapper-3.7.0-SNAPSHOT.jar
Found curl ... using curl
  % Total    % Received % Xferd  Average Speed   Time    Time     Time  Current
                                 Dload  Upload   Total   Spent    Left  Speed

  0     0    0     0    0     0      0      0 --:--:-- --:--:-- --:--:--     0
100 29428  100 29428    0     0  28.0M      0 --:--:-- --:--:-- --:--:-- 28.0M
Picked up JAVA_TOOL_OPTIONS: -Dmaven.ext.class.path="/home/jenkins/jenkins-slave/workspace/maven-box_maven_MNG-5937/test@tmp/withMaven7d32029b/pipeline-maven-spy.jar" -Dorg.jenkinsci.plugins.pipeline.maven.reportsFolder="/home/jenkins/jenkins-slave/workspace/maven-box_maven_MNG-5937/test@tmp/withMaven7d32029b" 
Error: Could not find or load main class  


Stack Trace:
org.apache.maven.it.VerificationException: 
Exit code was non-zero: 1; command line and log = 
/home/jenkins/jenkins-slave/workspace/maven-box_maven_MNG-5937/test/core-it-suite/target/apache-maven/bin/mvn --global-settings /home/jenkins/jenkins-slave/workspace/maven-box_maven_MNG-5937/test/core-it-suite/target/test-classes/settings.xml -e --batch-mode -Dmaven.repo.local=/home/jenkins/jenkins-slave/workspace/maven-box_maven_MNG-5937/test/it-local-repo validate
Couldn't find .mvn/wrapper/maven-wrapper.jar, downloading it ...
Downloading from: file:/home/jenkins/jenkins-slave/workspace/maven-box_maven_MNG-5937/test/it-local-repo//org/apache/maven/maven-wrapper/3.7.0-SNAPSHOT/maven-wrapper-3.7.0-SNAPSHOT.jar
Found curl ... using curl
  % Total    % Received % Xferd  Average Speed   Time    Time     Time  Current
                                 Dload  Upload   Total   Spent    Left  Speed

  0     0    0     0    0     0      0      0 --:--:-- --:--:-- --:--:--     0
100 29428  100 29428    0     0  28.0M      0 --:--:-- --:--:-- --:--:-- 28.0M
Picked up JAVA_TOOL_OPTIONS: -Dmaven.ext.class.path="/home/jenkins/jenkins-slave/workspace/maven-box_maven_MNG-5937/test@tmp/withMaven7d32029b/pipeline-maven-spy.jar" -Dorg.jenkinsci.plugins.pipeline.maven.reportsFolder="/home/jenkins/jenkins-slave/workspace/maven-box_maven_MNG-5937/test@tmp/withMaven7d32029b" 
Error: Could not find or load main class  

	at org.apache.maven.it.MavenITmng5937MavenWrapper.testitMNG5937Script(MavenITmng5937MavenWrapper.java:116)


FAILED:  org.apache.maven.it.MavenITmng5937MavenWrapper.linux-jdk8 / Run ITs Linux Java 8 / testitMNG5937Source

Error Message:
Exit code was non-zero: 1; command line and log = 
/home/jenkins/jenkins-slave/workspace/maven-box_maven_MNG-5937/test/core-it-suite/target/apache-maven/bin/mvn --global-settings /home/jenkins/jenkins-slave/workspace/maven-box_maven_MNG-5937/test/core-it-suite/target/test-classes/settings.xml -e --batch-mode -Dmaven.repo.local=/home/jenkins/jenkins-slave/workspace/maven-box_maven_MNG-5937/test/it-local-repo validate
 - Compiling MavenWrapperDownloader.java ...
Picked up JAVA_TOOL_OPTIONS: -Dmaven.ext.class.path="/home/jenkins/jenkins-slave/workspace/maven-box_maven_MNG-5937/test@tmp/withMaven7d32029b/pipeline-maven-spy.jar" -Dorg.jenkinsci.plugins.pipeline.maven.reportsFolder="/home/jenkins/jenkins-slave/workspace/maven-box_maven_MNG-5937/test@tmp/withMaven7d32029b" 
 - Running MavenWrapperDownloader.java ...
Picked up JAVA_TOOL_OPTIONS: -Dmaven.ext.class.path="/home/jenkins/jenkins-slave/workspace/maven-box_maven_MNG-5937/test@tmp/withMaven7d32029b/pipeline-maven-spy.jar" -Dorg.jenkinsci.plugins.pipeline.maven.reportsFolder="/home/jenkins/jenkins-slave/workspace/maven-box_maven_MNG-5937/test@tmp/withMaven7d32029b" 
- Downloader started
- Using base directory: /home/jenkins/jenkins-slave/workspace/maven-box_maven_MNG-5937/test/core-it-suite/target/test-classes/mng-5937-wrapper/source
- Downloading from: file:/home/jenkins/jenkins-slave/workspace/maven-box_maven_MNG-5937/test/it-local-repo//org/apache/maven/maven-wrapper/3.7.0-SNAPSHOT/maven-wrapper-3.7.0-SNAPSHOT.jar
- Downloading to: /home/jenkins/jenkins-slave/workspace/maven-box_maven_MNG-5937/test/core-it-suite/target/test-classes/mng-5937-wrapper/source/.mvn/wrapper/maven-wrapper.jar
Done
Picked up JAVA_TOOL_OPTIONS: -Dmaven.ext.class.path="/home/jenkins/jenkins-slave/workspace/maven-box_maven_MNG-5937/test@tmp/withMaven7d32029b/pipeline-maven-spy.jar" -Dorg.jenkinsci.plugins.pipeline.maven.reportsFolder="/home/jenkins/jenkins-slave/workspace/maven-box_maven_MNG-5937/test@tmp/withMaven7d32029b" 
Error: Could not find or load main class  


Stack Trace:
org.apache.maven.it.VerificationException: 
Exit code was non-zero: 1; command line and log = 
/home/jenkins/jenkins-slave/workspace/maven-box_maven_MNG-5937/test/core-it-suite/target/apache-maven/bin/mvn --global-settings /home/jenkins/jenkins-slave/workspace/maven-box_maven_MNG-5937/test/core-it-suite/target/test-classes/settings.xml -e --batch-mode -Dmaven.repo.local=/home/jenkins/jenkins-slave/workspace/maven-box_maven_MNG-5937/test/it-local-repo validate
 - Compiling MavenWrapperDownloader.java ...
Picked up JAVA_TOOL_OPTIONS: -Dmaven.ext.class.path="/home/jenkins/jenkins-slave/workspace/maven-box_maven_MNG-5937/test@tmp/withMaven7d32029b/pipeline-maven-spy.jar" -Dorg.jenkinsci.plugins.pipeline.maven.reportsFolder="/home/jenkins/jenkins-slave/workspace/maven-box_maven_MNG-5937/test@tmp/withMaven7d32029b" 
 - Running MavenWrapperDownloader.java ...
Picked up JAVA_TOOL_OPTIONS: -Dmaven.ext.class.path="/home/jenkins/jenkins-slave/workspace/maven-box_maven_MNG-5937/test@tmp/withMaven7d32029b/pipeline-maven-spy.jar" -Dorg.jenkinsci.plugins.pipeline.maven.reportsFolder="/home/jenkins/jenkins-slave/workspace/maven-box_maven_MNG-5937/test@tmp/withMaven7d32029b" 
- Downloader started
- Using base directory: /home/jenkins/jenkins-slave/workspace/maven-box_maven_MNG-5937/test/core-it-suite/target/test-classes/mng-5937-wrapper/source
- Downloading from: file:/home/jenkins/jenkins-slave/workspace/maven-box_maven_MNG-5937/test/it-local-repo//org/apache/maven/maven-wrapper/3.7.0-SNAPSHOT/maven-wrapper-3.7.0-SNAPSHOT.jar
- Downloading to: /home/jenkins/jenkins-slave/workspace/maven-box_maven_MNG-5937/test/core-it-suite/target/test-classes/mng-5937-wrapper/source/.mvn/wrapper/maven-wrapper.jar
Done
Picked up JAVA_TOOL_OPTIONS: -Dmaven.ext.class.path="/home/jenkins/jenkins-slave/workspace/maven-box_maven_MNG-5937/test@tmp/withMaven7d32029b/pipeline-maven-spy.jar" -Dorg.jenkinsci.plugins.pipeline.maven.reportsFolder="/home/jenkins/jenkins-slave/workspace/maven-box_maven_MNG-5937/test@tmp/withMaven7d32029b" 
Error: Could not find or load main class  

	at org.apache.maven.it.MavenITmng5937MavenWrapper.testitMNG5937Source(MavenITmng5937MavenWrapper.java:133)


FAILED:  org.apache.maven.it.MavenITmng5937MavenWrapper.linux-jdk11 / Run ITs Linux Java 11 / testitMNG5937Bin

Error Message:
Exit code was non-zero: 1; command line and log = 
/home/jenkins/jenkins-slave/workspace/maven-box_maven_MNG-5937@2/test/core-it-suite/target/apache-maven/bin/mvn --global-settings /home/jenkins/jenkins-slave/workspace/maven-box_maven_MNG-5937@2/test/core-it-suite/target/test-classes/settings.xml -e --batch-mode -Dmaven.repo.local=/home/jenkins/jenkins-slave/workspace/maven-box_maven_MNG-5937@2/test/it-local-repo validate
Picked up JAVA_TOOL_OPTIONS: -Dmaven.ext.class.path="/home/jenkins/jenkins-slave/workspace/maven-box_maven_MNG-5937@2/test@tmp/withMavena88a1a54/pipeline-maven-spy.jar" -Dorg.jenkinsci.plugins.pipeline.maven.reportsFolder="/home/jenkins/jenkins-slave/workspace/maven-box_maven_MNG-5937@2/test@tmp/withMavena88a1a54" 
Error: Could not find or load main class  
Caused by: java.lang.ClassNotFoundException:  


Stack Trace:
org.apache.maven.it.VerificationException: 
Exit code was non-zero: 1; command line and log = 
/home/jenkins/jenkins-slave/workspace/maven-box_maven_MNG-5937@2/test/core-it-suite/target/apache-maven/bin/mvn --global-settings /home/jenkins/jenkins-slave/workspace/maven-box_maven_MNG-5937@2/test/core-it-suite/target/test-classes/settings.xml -e --batch-mode -Dmaven.repo.local=/home/jenkins/jenkins-slave/workspace/maven-box_maven_MNG-5937@2/test/it-local-repo validate
Picked up JAVA_TOOL_OPTIONS: -Dmaven.ext.class.path="/home/jenkins/jenkins-slave/workspace/maven-box_maven_MNG-5937@2/test@tmp/withMavena88a1a54/pipeline-maven-spy.jar" -Dorg.jenkinsci.plugins.pipeline.maven.reportsFolder="/home/jenkins/jenkins-slave/workspace/maven-box_maven_MNG-5937@2/test@tmp/withMavena88a1a54" 
Error: Could not find or load main class  
Caused by: java.lang.ClassNotFoundException:  

	at org.apache.maven.it.MavenITmng5937MavenWrapper.testitMNG5937Bin(MavenITmng5937MavenWrapper.java:99)


FAILED:  org.apache.maven.it.MavenITmng5937MavenWrapper.linux-jdk11 / Run ITs Linux Java 11 / testitMNG5937Script

Error Message:
Exit code was non-zero: 1; command line and log = 
/home/jenkins/jenkins-slave/workspace/maven-box_maven_MNG-5937@2/test/core-it-suite/target/apache-maven/bin/mvn --global-settings /home/jenkins/jenkins-slave/workspace/maven-box_maven_MNG-5937@2/test/core-it-suite/target/test-classes/settings.xml -e --batch-mode -Dmaven.repo.local=/home/jenkins/jenkins-slave/workspace/maven-box_maven_MNG-5937@2/test/it-local-repo validate
Couldn't find .mvn/wrapper/maven-wrapper.jar, downloading it ...
Downloading from: file:/home/jenkins/jenkins-slave/workspace/maven-box_maven_MNG-5937@2/test/it-local-repo//org/apache/maven/maven-wrapper/3.7.0-SNAPSHOT/maven-wrapper-3.7.0-SNAPSHOT.jar
Found curl ... using curl
  % Total    % Received % Xferd  Average Speed   Time    Time     Time  Current
                                 Dload  Upload   Total   Spent    Left  Speed

  0     0    0     0    0     0      0      0 --:--:-- --:--:-- --:--:--     0
100 29428  100 29428    0     0  28.0M      0 --:--:-- --:--:-- --:--:-- 28.0M
Picked up JAVA_TOOL_OPTIONS: -Dmaven.ext.class.path="/home/jenkins/jenkins-slave/workspace/maven-box_maven_MNG-5937@2/test@tmp/withMavena88a1a54/pipeline-maven-spy.jar" -Dorg.jenkinsci.plugins.pipeline.maven.reportsFolder="/home/jenkins/jenkins-slave/workspace/maven-box_maven_MNG-5937@2/test@tmp/withMavena88a1a54" 
Error: Could not find or load main class  
Caused by: java.lang.ClassNotFoundException:  


Stack Trace:
org.apache.maven.it.VerificationException: 
Exit code was non-zero: 1; command line and log = 
/home/jenkins/jenkins-slave/workspace/maven-box_maven_MNG-5937@2/test/core-it-suite/target/apache-maven/bin/mvn --global-settings /home/jenkins/jenkins-slave/workspace/maven-box_maven_MNG-5937@2/test/core-it-suite/target/test-classes/settings.xml -e --batch-mode -Dmaven.repo.local=/home/jenkins/jenkins-slave/workspace/maven-box_maven_MNG-5937@2/test/it-local-repo validate
Couldn't find .mvn/wrapper/maven-wrapper.jar, downloading it ...
Downloading from: file:/home/jenkins/jenkins-slave/workspace/maven-box_maven_MNG-5937@2/test/it-local-repo//org/apache/maven/maven-wrapper/3.7.0-SNAPSHOT/maven-wrapper-3.7.0-SNAPSHOT.jar
Found curl ... using curl
  % Total    % Received % Xferd  Average Speed   Time    Time     Time  Current
                                 Dload  Upload   Total   Spent    Left  Speed

  0     0    0     0    0     0      0      0 --:--:-- --:--:-- --:--:--     0
100 29428  100 29428    0     0  28.0M      0 --:--:-- --:--:-- --:--:-- 28.0M
Picked up JAVA_TOOL_OPTIONS: -Dmaven.ext.class.path="/home/jenkins/jenkins-slave/workspace/maven-box_maven_MNG-5937@2/test@tmp/withMavena88a1a54/pipeline-maven-spy.jar" -Dorg.jenkinsci.plugins.pipeline.maven.reportsFolder="/home/jenkins/jenkins-slave/workspace/maven-box_maven_MNG-5937@2/test@tmp/withMavena88a1a54" 
Error: Could not find or load main class  
Caused by: java.lang.ClassNotFoundException:  

	at org.apache.maven.it.MavenITmng5937MavenWrapper.testitMNG5937Script(MavenITmng5937MavenWrapper.java:116)


FAILED:  org.apache.maven.it.MavenITmng5937MavenWrapper.linux-jdk11 / Run ITs Linux Java 11 / testitMNG5937Source

Error Message:
Exit code was non-zero: 1; command line and log = 
/home/jenkins/jenkins-slave/workspace/maven-box_maven_MNG-5937@2/test/core-it-suite/target/apache-maven/bin/mvn --global-settings /home/jenkins/jenkins-slave/workspace/maven-box_maven_MNG-5937@2/test/core-it-suite/target/test-classes/settings.xml -e --batch-mode -Dmaven.repo.local=/home/jenkins/jenkins-slave/workspace/maven-box_maven_MNG-5937@2/test/it-local-repo validate
 - Compiling MavenWrapperDownloader.java ...
Picked up JAVA_TOOL_OPTIONS: -Dmaven.ext.class.path="/home/jenkins/jenkins-slave/workspace/maven-box_maven_MNG-5937@2/test@tmp/withMavena88a1a54/pipeline-maven-spy.jar" -Dorg.jenkinsci.plugins.pipeline.maven.reportsFolder="/home/jenkins/jenkins-slave/workspace/maven-box_maven_MNG-5937@2/test@tmp/withMavena88a1a54" 
 - Running MavenWrapperDownloader.java ...
Picked up JAVA_TOOL_OPTIONS: -Dmaven.ext.class.path="/home/jenkins/jenkins-slave/workspace/maven-box_maven_MNG-5937@2/test@tmp/withMavena88a1a54/pipeline-maven-spy.jar" -Dorg.jenkinsci.plugins.pipeline.maven.reportsFolder="/home/jenkins/jenkins-slave/workspace/maven-box_maven_MNG-5937@2/test@tmp/withMavena88a1a54" 
- Downloader started
- Using base directory: /home/jenkins/jenkins-slave/workspace/maven-box_maven_MNG-5937@2/test/core-it-suite/target/test-classes/mng-5937-wrapper/source
- Downloading from: file:/home/jenkins/jenkins-slave/workspace/maven-box_maven_MNG-5937@2/test/it-local-repo//org/apache/maven/maven-wrapper/3.7.0-SNAPSHOT/maven-wrapper-3.7.0-SNAPSHOT.jar
- Downloading to: /home/jenkins/jenkins-slave/workspace/maven-box_maven_MNG-5937@2/test/core-it-suite/target/test-classes/mng-5937-wrapper/source/.mvn/wrapper/maven-wrapper.jar
Done
Picked up JAVA_TOOL_OPTIONS: -Dmaven.ext.class.path="/home/jenkins/jenkins-slave/workspace/maven-box_maven_MNG-5937@2/test@tmp/withMavena88a1a54/pipeline-maven-spy.jar" -Dorg.jenkinsci.plugins.pipeline.maven.reportsFolder="/home/jenkins/jenkins-slave/workspace/maven-box_maven_MNG-5937@2/test@tmp/withMavena88a1a54" 
Error: Could not find or load main class  
Caused by: java.lang.ClassNotFoundException:  


Stack Trace:
org.apache.maven.it.VerificationException: 
Exit code was non-zero: 1; command line and log = 
/home/jenkins/jenkins-slave/workspace/maven-box_maven_MNG-5937@2/test/core-it-suite/target/apache-maven/bin/mvn --global-settings /home/jenkins/jenkins-slave/workspace/maven-box_maven_MNG-5937@2/test/core-it-suite/target/test-classes/settings.xml -e --batch-mode -Dmaven.repo.local=/home/jenkins/jenkins-slave/workspace/maven-box_maven_MNG-5937@2/test/it-local-repo validate
 - Compiling MavenWrapperDownloader.java ...
Picked up JAVA_TOOL_OPTIONS: -Dmaven.ext.class.path="/home/jenkins/jenkins-slave/workspace/maven-box_maven_MNG-5937@2/test@tmp/withMavena88a1a54/pipeline-maven-spy.jar" -Dorg.jenkinsci.plugins.pipeline.maven.reportsFolder="/home/jenkins/jenkins-slave/workspace/maven-box_maven_MNG-5937@2/test@tmp/withMavena88a1a54" 
 - Running MavenWrapperDownloader.java ...
Picked up JAVA_TOOL_OPTIONS: -Dmaven.ext.class.path="/home/jenkins/jenkins-slave/workspace/maven-box_maven_MNG-5937@2/test@tmp/withMavena88a1a54/pipeline-maven-spy.jar" -Dorg.jenkinsci.plugins.pipeline.maven.reportsFolder="/home/jenkins/jenkins-slave/workspace/maven-box_maven_MNG-5937@2/test@tmp/withMavena88a1a54" 
- Downloader started
- Using base directory: /home/jenkins/jenkins-slave/workspace/maven-box_maven_MNG-5937@2/test/core-it-suite/target/test-classes/mng-5937-wrapper/source
- Downloading from: file:/home/jenkins/jenkins-slave/workspace/maven-box_maven_MNG-5937@2/test/it-local-repo//org/apache/maven/maven-wrapper/3.7.0-SNAPSHOT/maven-wrapper-3.7.0-SNAPSHOT.jar
- Downloading to: /home/jenkins/jenkins-slave/workspace/maven-box_maven_MNG-5937@2/test/core-it-suite/target/test-classes/mng-5937-wrapper/source/.mvn/wrapper/maven-wrapper.jar
Done
Picked up JAVA_TOOL_OPTIONS: -Dmaven.ext.class.path="/home/jenkins/jenkins-slave/workspace/maven-box_maven_MNG-5937@2/test@tmp/withMavena88a1a54/pipeline-maven-spy.jar" -Dorg.jenkinsci.plugins.pipeline.maven.reportsFolder="/home/jenkins/jenkins-slave/workspace/maven-box_maven_MNG-5937@2/test@tmp/withMavena88a1a54" 
Error: Could not find or load main class  
Caused by: java.lang.ClassNotFoundException:  

	at org.apache.maven.it.MavenITmng5937MavenWrapper.testitMNG5937Source(MavenITmng5937MavenWrapper.java:133)




Build log:
[...truncated 80183 lines...]
[withMaven] junitPublisher - Archive test results for Maven artifact org.apache.maven.its:core-it-wagon:jar:2.1-SNAPSHOT generated by maven-surefire-plugin:test (default-test): core-it-support/core-it-wagon/target/surefire-reports/*.xml
[withMaven] junitPublisher - Archive test results for Maven artifact org.apache.maven.its:core-it-extension:jar:2.1-SNAPSHOT generated by maven-surefire-plugin:test (default-test): core-it-support/core-it-extension/target/surefire-reports/*.xml
[withMaven] junitPublisher - Archive test results for Maven artifact mng-coreit:javaagent:jar:1.0-SNAPSHOT generated by maven-surefire-plugin:test (default-test): core-it-support/core-it-javaagent/target/surefire-reports/*.xml
[withMaven] junitPublisher - Archive test results for Maven artifact org.apache.maven.its:core-it-suite:jar:2.1-SNAPSHOT generated by maven-surefire-plugin:test (default-test): core-it-suite/target/surefire-reports/*.xml
Recording test results
[withMaven] openTasksPublisher - Scan Tasks for Maven artifact org.apache.maven.its.plugins:maven-it-plugin-active-collection:maven-plugin:2.1-SNAPSHOT in source directory core-it-support\core-it-plugins\maven-it-plugin-active-collection\src\main\java
[withMaven] openTasksPublisher - Scan Tasks for Maven artifact org.apache.maven.its.plugins:maven-it-plugin-artifact:maven-plugin:2.1-SNAPSHOT in source directory core-it-support\core-it-plugins\maven-it-plugin-artifact\src\main\java
[withMaven] openTasksPublisher - Scan Tasks for Maven artifact org.apache.maven.its.plugins.class-loader:dep-a:jar:2.1-SNAPSHOT in source directory core-it-support\core-it-plugins\maven-it-plugin-class-loader\dep-a\src\main\java
[withMaven] openTasksPublisher - Scan Tasks for Maven artifact org.apache.maven.its.plugins.class-loader:dep-b:jar:2.1-SNAPSHOT in source directory core-it-support\core-it-plugins\maven-it-plugin-class-loader\dep-b\src\main\java
[withMaven] openTasksPublisher - Scan Tasks for Maven artifact org.apache.maven.its.plugins:maven-it-plugin-class-loader:maven-plugin:2.1-SNAPSHOT in source directory core-it-support\core-it-plugins\maven-it-plugin-class-loader\maven-it-plugin-class-loader\src\main\java
[withMaven] openTasksPublisher - Scan Tasks for Maven artifact org.apache.maven.its.plugins:maven-it-plugin-configuration:maven-plugin:2.1-SNAPSHOT in source directory core-it-support\core-it-plugins\maven-it-plugin-configuration\src\main\java
[withMaven] openTasksPublisher - Scan Tasks for Maven artifact org.apache.maven.its.plugins:maven-it-plugin-context-passing:maven-plugin:2.1-SNAPSHOT in source directory core-it-support\core-it-plugins\maven-it-plugin-context-passing\src\main\java
[withMaven] openTasksPublisher - Scan Tasks for Maven artifact org.apache.maven.plugins:maven-clean-plugin:maven-plugin:0.1-stub-SNAPSHOT in source directory core-it-support\core-it-plugins\maven-it-plugin-core-stubs\maven-clean-plugin\src\main\java
[withMaven] openTasksPublisher - Scan Tasks for Maven artifact org.apache.maven.plugins:maven-compiler-plugin:maven-plugin:0.1-stub-SNAPSHOT in source directory core-it-support\core-it-plugins\maven-it-plugin-core-stubs\maven-compiler-plugin\src\main\java
[withMaven] openTasksPublisher - Scan Tasks for Maven artifact org.apache.maven.plugins:maven-deploy-plugin:maven-plugin:0.1-stub-SNAPSHOT in source directory core-it-support\core-it-plugins\maven-it-plugin-core-stubs\maven-deploy-plugin\src\main\java
[withMaven] openTasksPublisher - Scan Tasks for Maven artifact org.apache.maven.plugins:maven-ear-plugin:maven-plugin:0.1-stub-SNAPSHOT in source directory core-it-support\core-it-plugins\maven-it-plugin-core-stubs\maven-ear-plugin\src\main\java
[withMaven] openTasksPublisher - Scan Tasks for Maven artifact org.apache.maven.plugins:maven-ejb-plugin:maven-plugin:0.1-stub-SNAPSHOT in source directory core-it-support\core-it-plugins\maven-it-plugin-core-stubs\maven-ejb-plugin\src\main\java
[withMaven] openTasksPublisher - Scan Tasks for Maven artifact org.apache.maven.plugins:maven-install-plugin:maven-plugin:0.1-stub-SNAPSHOT in source directory core-it-support\core-it-plugins\maven-it-plugin-core-stubs\maven-install-plugin\src\main\java
[withMaven] openTasksPublisher - Scan Tasks for Maven artifact org.apache.maven.plugins:maven-jar-plugin:maven-plugin:0.1-stub-SNAPSHOT in source directory core-it-support\core-it-plugins\maven-it-plugin-core-stubs\maven-jar-plugin\src\main\java
[withMaven] openTasksPublisher - Scan Tasks for Maven artifact org.apache.maven.plugins:maven-javadoc-plugin:maven-plugin:0.1-stub-SNAPSHOT in source directory core-it-support\core-it-plugins\maven-it-plugin-core-stubs\maven-javadoc-plugin\src\main\java
[withMaven] openTasksPublisher - Scan Tasks for Maven artifact org.apache.maven.plugins:maven-plugin-plugin:maven-plugin:0.1-stub-SNAPSHOT in source directory core-it-support\core-it-plugins\maven-it-plugin-core-stubs\maven-plugin-plugin\src\main\java
[withMaven] openTasksPublisher - Scan Tasks for Maven artifact org.apache.maven.plugins:maven-rar-plugin:maven-plugin:0.1-stub-SNAPSHOT in source directory core-it-support\core-it-plugins\maven-it-plugin-core-stubs\maven-rar-plugin\src\main\java
[withMaven] openTasksPublisher - Scan Tasks for Maven artifact org.apache.maven.plugins:maven-resources-plugin:maven-plugin:0.1-stub-SNAPSHOT in source directory core-it-support\core-it-plugins\maven-it-plugin-core-stubs\maven-resources-plugin\src\main\java
[withMaven] openTasksPublisher - Scan Tasks for Maven artifact org.apache.maven.plugins:maven-site-plugin:maven-plugin:0.1-stub-SNAPSHOT in source directory core-it-support\core-it-plugins\maven-it-plugin-core-stubs\maven-site-plugin\src\main\java
[withMaven] openTasksPublisher - Scan Tasks for Maven artifact org.apache.maven.plugins:maven-source-plugin:maven-plugin:0.1-stub-SNAPSHOT in source directory core-it-support\core-it-plugins\maven-it-plugin-core-stubs\maven-source-plugin\src\main\java
[withMaven] openTasksPublisher - Scan Tasks for Maven artifact org.apache.maven.plugins:maven-surefire-plugin:maven-plugin:0.1-stub-SNAPSHOT in source directory core-it-support\core-it-plugins\maven-it-plugin-core-stubs\maven-surefire-plugin\src\main\java
[withMaven] openTasksPublisher - Scan Tasks for Maven artifact org.apache.maven.plugins:maven-war-plugin:maven-plugin:0.1-stub-SNAPSHOT in source directory core-it-support\core-it-plugins\maven-it-plugin-core-stubs\maven-war-plugin\src\main\java
[withMaven] openTasksPublisher - Scan Tasks for Maven artifact org.apache.maven.its.plugins:maven-it-plugin-dependency-collection:maven-plugin:2.1-SNAPSHOT in source directory core-it-support\core-it-plugins\maven-it-plugin-dependency-collection\src\main\java
[withMaven] openTasksPublisher - Scan Tasks for Maven artifact org.apache.maven.its.plugins:maven-it-plugin-dependency-resolution:maven-plugin:2.1-SNAPSHOT in source directory core-it-support\core-it-plugins\maven-it-plugin-dependency-resolution\src\main\java
[withMaven] openTasksPublisher - Scan Tasks for Maven artifact org.apache.maven.its.plugins:maven-it-plugin-expression:maven-plugin:2.1-SNAPSHOT in source directory core-it-support\core-it-plugins\maven-it-plugin-expression\src\main\java
[withMaven] openTasksPublisher - Scan Tasks for Maven artifact org.apache.maven.its.plugins:maven-it-plugin-error:maven-plugin:2.1-SNAPSHOT in source directory core-it-support\core-it-plugins\maven-it-plugin-error\src\main\java
[withMaven] openTasksPublisher - Scan Tasks for Maven artifact org.apache.maven.its:core-it-component:jar:2.1-SNAPSHOT in source directory core-it-support\core-it-component\src\main\java
[withMaven] openTasksPublisher - Scan Tasks for Maven artifact org.apache.maven.its.plugins:maven-it-plugin-extension-consumer:maven-plugin:2.1-SNAPSHOT in source directory core-it-support\core-it-plugins\maven-it-plugin-extension-consumer\src\main\java
[withMaven] openTasksPublisher - Scan Tasks for Maven artifact org.apache.maven.its.plugins:maven-it-plugin-extension-provider:maven-plugin:2.1-SNAPSHOT in source directory core-it-support\core-it-plugins\maven-it-plugin-extension-provider\src\main\java
[withMaven] openTasksPublisher - Scan Tasks for Maven artifact org.apache.maven.its.plugins:maven-it-plugin-fork:maven-plugin:2.1-SNAPSHOT in source directory core-it-support\core-it-plugins\maven-it-plugin-fork\src\main\java
[withMaven] openTasksPublisher - Scan Tasks for Maven artifact org.apache.maven.its.plugins:maven-it-plugin-invalid-descriptor:maven-plugin:2.1-SNAPSHOT in source directory core-it-support\core-it-plugins\maven-it-plugin-invalid-descriptor\src\main\java
[withMaven] openTasksPublisher - Scan Tasks for Maven artifact org.apache.maven.its.plugins:maven-it-plugin-log-file:maven-plugin:2.1-SNAPSHOT in source directory core-it-support\core-it-plugins\maven-it-plugin-log-file\src\main\java
[withMaven] openTasksPublisher - Scan Tasks for Maven artifact org.apache.maven.its:maven-it-helper:jar:2.1-SNAPSHOT in source directory core-it-support\maven-it-helper\src\main\java
[withMaven] openTasksPublisher - Scan Tasks for Maven artifact org.apache.maven.its.plugins:maven-it-plugin-model-interpolation:maven-plugin:2.1-SNAPSHOT in source directory core-it-support\core-it-plugins\maven-it-plugin-model-interpolation\src\main\java
[withMaven] openTasksPublisher - Scan Tasks for Maven artifact org.apache.maven.its.plugins:maven-it-plugin-no-default-comp:maven-plugin:2.1-SNAPSHOT in source directory core-it-support\core-it-plugins\maven-it-plugin-no-default-comp\src\main\java
[withMaven] openTasksPublisher - Scan Tasks for Maven artifact org.apache.maven.its.plugins:maven-it-plugin-no-project:maven-plugin:2.1-SNAPSHOT in source directory core-it-support\core-it-plugins\maven-it-plugin-no-project\src\main\java
[withMaven] openTasksPublisher - Scan Tasks for Maven artifact org.apache.maven.its.plugins:maven-it-plugin-online:maven-plugin:2.1-SNAPSHOT in source directory core-it-support\core-it-plugins\maven-it-plugin-online\src\main\java
[withMaven] openTasksPublisher - Scan Tasks for Maven artifact org.apache.maven.its.plugins:maven-it-plugin-optional-mojos:maven-plugin:2.1-SNAPSHOT in source directory core-it-support\core-it-plugins\maven-it-plugin-optional-mojos\src\main\java
[withMaven] openTasksPublisher - Scan Tasks for Maven artifact org.apache.maven.its.plugins:maven-it-plugin-packaging:maven-plugin:2.1-SNAPSHOT in source directory core-it-support\core-it-plugins\maven-it-plugin-packaging\src\main\java
[withMaven] openTasksPublisher - Scan Tasks for Maven artifact org.apache.maven.its.plugins:maven-it-plugin-parameter-implementation:maven-plugin:2.1-SNAPSHOT in source directory core-it-support\core-it-plugins\maven-it-plugin-parameter-implementation\src\main\java
[withMaven] openTasksPublisher - Scan Tasks for Maven artifact org.apache.maven.its.plugins:maven-it-plugin-plugin-dependency:maven-plugin:2.1-SNAPSHOT in source directory core-it-support\core-it-plugins\maven-it-plugin-plugin-dependency\src\main\java
[withMaven] openTasksPublisher - Scan Tasks for Maven artifact org.apache.maven.its.plugins:maven-it-plugin-project:maven-plugin:2.1-SNAPSHOT in source directory core-it-support\core-it-plugins\maven-it-plugin-project\src\main\java
[withMaven] openTasksPublisher - Scan Tasks for Maven artifact org.apache.maven.its.plugins:maven-it-plugin-project-interpolation:maven-plugin:2.1-SNAPSHOT in source directory core-it-support\core-it-plugins\maven-it-plugin-project-interpolation\src\main\java
[withMaven] openTasksPublisher - Scan Tasks for Maven artifact org.apache.maven.its.plugins:maven-it-plugin-setter:maven-plugin:2.1-SNAPSHOT in source directory core-it-support\core-it-plugins\maven-it-plugin-setter\src\main\java
[withMaven] openTasksPublisher - Scan Tasks for Maven artifact org.apache.maven.its.plugins:maven-it-plugin-singleton-component:maven-plugin:2.1-SNAPSHOT in source directory core-it-support\core-it-plugins\maven-it-plugin-singleton-component\src\main\java
[withMaven] openTasksPublisher - Scan Tasks for Maven artifact org.apache.maven.its.plugins:maven-it-plugin-site:maven-plugin:2.1-SNAPSHOT in source directory core-it-support\core-it-plugins\maven-it-plugin-site\src\main\java
[withMaven] openTasksPublisher - Scan Tasks for Maven artifact org.apache.maven.its.plugins:maven-it-plugin-toolchain:maven-plugin:2.1-SNAPSHOT in source directory core-it-support\core-it-plugins\maven-it-plugin-toolchain\src\main\java
[withMaven] openTasksPublisher - Scan Tasks for Maven artifact org.apache.maven.its.plugins:maven-it-plugin-touch:maven-plugin:2.1-SNAPSHOT in source directory core-it-support\core-it-plugins\maven-it-plugin-touch\src\main\java
[withMaven] openTasksPublisher - Scan Tasks for Maven artifact org.apache.maven.its.plugins:maven-it-plugin-uses-properties:maven-plugin:2.1-SNAPSHOT in source directory core-it-support\core-it-plugins\maven-it-plugin-uses-properties\src\main\java
[withMaven] openTasksPublisher - Scan Tasks for Maven artifact org.apache.maven.its.plugins:maven-it-plugin-uses-wagon:maven-plugin:2.1-SNAPSHOT in source directory core-it-support\core-it-plugins\maven-it-plugin-uses-wagon\src\main\java
[withMaven] openTasksPublisher - Scan Tasks for Maven artifact org.apache.maven.its.plugins:maven-it-plugin-all:maven-plugin:2.1-SNAPSHOT in source directory core-it-support\core-it-plugins\maven-it-plugin-all\src\main\java
[withMaven] openTasksPublisher - Scan Tasks for Maven artifact org.apache.maven.its.plugins:maven-it-plugin-plexus-utils-11:maven-plugin:2.1-SNAPSHOT in source directory core-it-support\core-it-plugins\maven-it-plugin-plexus-utils-11\src\main\java
[withMaven] openTasksPublisher - Scan Tasks for Maven artifact org.apache.maven.its.plugins:maven-it-plugin-plexus-utils-new:maven-plugin:2.1-SNAPSHOT in source directory core-it-support\core-it-plugins\maven-it-plugin-plexus-utils-new\src\main\java
[withMaven] openTasksPublisher - Scan Tasks for Maven artifact org.apache.maven.its.plugins:maven-it-plugin-plexus-component-api:maven-plugin:2.1-SNAPSHOT in source directory core-it-support\core-it-plugins\maven-it-plugin-plexus-component-api\src\main\java
[withMaven] openTasksPublisher - Scan Tasks for Maven artifact org.apache.maven.its.plugins:maven-it-plugin-log4j:maven-plugin:2.1-SNAPSHOT in source directory core-it-support\core-it-plugins\maven-it-plugin-log4j\src\main\java
[withMaven] openTasksPublisher - Scan Tasks for Maven artifact org.apache.maven.its.plugins:maven-it-plugin-extension1:maven-plugin:2.1-SNAPSHOT in source directory core-it-support\core-it-plugins\maven-it-plugin-extension1\src\main\java
[withMaven] openTasksPublisher - Scan Tasks for Maven artifact org.apache.maven.its.plugins:maven-it-plugin-extension2:maven-plugin:2.1-SNAPSHOT in source directory core-it-support\core-it-plugins\maven-it-plugin-extension2\src\main\java
[withMaven] openTasksPublisher - Scan Tasks for Maven artifact org.apache.maven.its.plugins:maven-it-plugin-plexus-lifecycle:maven-plugin:2.1-SNAPSHOT in source directory core-it-support\core-it-plugins\maven-it-plugin-plexus-lifecycle\src\main\java
[withMaven] openTasksPublisher - Scan Tasks for Maven artifact org.apache.maven.its.plugins:maven-it-plugin-settings:maven-plugin:2.1-SNAPSHOT in source directory core-it-support\core-it-plugins\maven-it-plugin-settings\src\main\java
[withMaven] openTasksPublisher - Scan Tasks for Maven artifact org.apache.maven.its.plugins:mng-5805-pkg-type-mojo-configuration-plugin:maven-plugin:2.1-SNAPSHOT in source directory core-it-support\core-it-plugins\mng5805-plugin\src\main\java
[withMaven] openTasksPublisher - Scan Tasks for Maven artifact org.apache.maven.its.plugins:mng-5805-pkg-type-mojo-configuration-plugin-dep:jar:2.1-SNAPSHOT in source directory core-it-support\core-it-plugins\mng5805-plugin-dep\src\main\java
[withMaven] openTasksPublisher - Scan Tasks for Maven artifact org.apache.maven.its.plugins:mng-5958-pkg-type-extension:jar:2.1-SNAPSHOT in source directory core-it-support\core-it-plugins\mng5958-extension\src\main\java
[withMaven] openTasksPublisher - Scan Tasks for Maven artifact org.apache.maven.its.plugins:mng-6759-resolves-project-dependencies-plugin:maven-plugin:2.1-SNAPSHOT in source directory core-it-support\core-it-plugins\mng6759-plugin-resolves-project-dependencies\src\main\java
[withMaven] openTasksPublisher - Scan Tasks for Maven artifact org.apache.maven.its:core-it-toolchain:jar:2.1-SNAPSHOT in source directory core-it-support\core-it-toolchain\src\main\java
[withMaven] openTasksPublisher - Scan Tasks for Maven artifact org.apache.maven.its:core-it-wagon:jar:2.1-SNAPSHOT in source directory core-it-support\core-it-wagon\src\main\java
[withMaven] openTasksPublisher - Scan Tasks for Maven artifact mng-coreit:javaagent:jar:1.0-SNAPSHOT in source directory core-it-support\core-it-javaagent\src\main\java
[TASKS] Scanning folder 'c:\mvn-it-0.tmp' for files matching the pattern 'core-it-support\core-it-plugins\maven-it-plugin-active-collection\src\main\java\**\*,core-it-support\core-it-plugins\maven-it-plugin-artifact\src\main\java\**\*,core-it-support\core-it-plugins\maven-it-plugin-class-loader\dep-a\src\main\java\**\*,core-it-support\core-it-plugins\maven-it-plugin-class-loader\dep-b\src\main\java\**\*,core-it-support\core-it-plugins\maven-it-plugin-class-loader\maven-it-plugin-class-loader\src\main\java\**\*,core-it-support\core-it-plugins\maven-it-plugin-configuration\src\main\java\**\*,core-it-support\core-it-plugins\maven-it-plugin-context-passing\src\main\java\**\*,core-it-support\core-it-plugins\maven-it-plugin-core-stubs\maven-clean-plugin\src\main\java\**\*,core-it-support\core-it-plugins\maven-it-plugin-core-stubs\maven-compiler-plugin\src\main\java\**\*,core-it-support\core-it-plugins\maven-it-plugin-core-stubs\maven-deploy-plugin\src\main\java\**\*,core-it-support\core-it-plugins\maven-it-plugin-core-stubs\maven-ear-plugin\src\main\java\**\*,core-it-support\core-it-plugins\maven-it-plugin-core-stubs\maven-ejb-plugin\src\main\java\**\*,core-it-support\core-it-plugins\maven-it-plugin-core-stubs\maven-install-plugin\src\main\java\**\*,core-it-support\core-it-plugins\maven-it-plugin-core-stubs\maven-jar-plugin\src\main\java\**\*,core-it-support\core-it-plugins\maven-it-plugin-core-stubs\maven-javadoc-plugin\src\main\java\**\*,core-it-support\core-it-plugins\maven-it-plugin-core-stubs\maven-plugin-plugin\src\main\java\**\*,core-it-support\core-it-plugins\maven-it-plugin-core-stubs\maven-rar-plugin\src\main\java\**\*,core-it-support\core-it-plugins\maven-it-plugin-core-stubs\maven-resources-plugin\src\main\java\**\*,core-it-support\core-it-plugins\maven-it-plugin-core-stubs\maven-site-plugin\src\main\java\**\*,core-it-support\core-it-plugins\maven-it-plugin-core-stubs\maven-source-plugin\src\main\java\**\*,core-it-support\core-it-plugins\maven-it-plugin-core-stubs\maven-surefire-plugin\src\main\java\**\*,core-it-support\core-it-plugins\maven-it-plugin-core-stubs\maven-war-plugin\src\main\java\**\*,core-it-support\core-it-plugins\maven-it-plugin-dependency-collection\src\main\java\**\*,core-it-support\core-it-plugins\maven-it-plugin-dependency-resolution\src\main\java\**\*,core-it-support\core-it-plugins\maven-it-plugin-expression\src\main\java\**\*,core-it-support\core-it-plugins\maven-it-plugin-error\src\main\java\**\*,core-it-support\core-it-component\src\main\java\**\*,core-it-support\core-it-plugins\maven-it-plugin-extension-consumer\src\main\java\**\*,core-it-support\core-it-plugins\maven-it-plugin-extension-provider\src\main\java\**\*,core-it-support\core-it-plugins\maven-it-plugin-fork\src\main\java\**\*,core-it-support\core-it-plugins\maven-it-plugin-invalid-descriptor\src\main\java\**\*,core-it-support\core-it-plugins\maven-it-plugin-log-file\src\main\java\**\*,core-it-support\maven-it-helper\src\main\java\**\*,core-it-support\core-it-plugins\maven-it-plugin-model-interpolation\src\main\java\**\*,core-it-support\core-it-plugins\maven-it-plugin-no-default-comp\src\main\java\**\*,core-it-support\core-it-plugins\maven-it-plugin-no-project\src\main\java\**\*,core-it-support\core-it-plugins\maven-it-plugin-online\src\main\java\**\*,core-it-support\core-it-plugins\maven-it-plugin-optional-mojos\src\main\java\**\*,core-it-support\core-it-plugins\maven-it-plugin-packaging\src\main\java\**\*,core-it-support\core-it-plugins\maven-it-plugin-parameter-implementation\src\main\java\**\*,core-it-support\core-it-plugins\maven-it-plugin-plugin-dependency\src\main\java\**\*,core-it-support\core-it-plugins\maven-it-plugin-project\src\main\java\**\*,core-it-support\core-it-plugins\maven-it-plugin-project-interpolation\src\main\java\**\*,core-it-support\core-it-plugins\maven-it-plugin-setter\src\main\java\**\*,core-it-support\core-it-plugins\maven-it-plugin-singleton-component\src\main\java\**\*,core-it-support\core-it-plugins\maven-it-plugin-site\src\main\java\**\*,core-it-support\core-it-plugins\maven-it-plugin-toolchain\src\main\java\**\*,core-it-support\core-it-plugins\maven-it-plugin-touch\src\main\java\**\*,core-it-support\core-it-plugins\maven-it-plugin-uses-properties\src\main\java\**\*,core-it-support\core-it-plugins\maven-it-plugin-uses-wagon\src\main\java\**\*,core-it-support\core-it-plugins\maven-it-plugin-all\src\main\java\**\*,core-it-support\core-it-plugins\maven-it-plugin-plexus-utils-11\src\main\java\**\*,core-it-support\core-it-plugins\maven-it-plugin-plexus-utils-new\src\main\java\**\*,core-it-support\core-it-plugins\maven-it-plugin-plexus-component-api\src\main\java\**\*,core-it-support\core-it-plugins\maven-it-plugin-log4j\src\main\java\**\*,core-it-support\core-it-plugins\maven-it-plugin-extension1\src\main\java\**\*,core-it-support\core-it-plugins\maven-it-plugin-extension2\src\main\java\**\*,core-it-support\core-it-plugins\maven-it-plugin-plexus-lifecycle\src\main\java\**\*,core-it-support\core-it-plugins\maven-it-plugin-settings\src\main\java\**\*,core-it-support\core-it-plugins\mng5805-plugin\src\main\java\**\*,core-it-support\core-it-plugins\mng5805-plugin-dep\src\main\java\**\*,core-it-support\core-it-plugins\mng5958-extension\src\main\java\**\*,core-it-support\core-it-plugins\mng6759-plugin-resolves-project-dependencies\src\main\java\**\*,core-it-support\core-it-toolchain\src\main\java\**\*,core-it-support\core-it-wagon\src\main\java\**\*,core-it-support\core-it-javaagent\src\main\java\**\*' - excludes: null
[TASKS] Found 166 files to scan for tasks
[TASKS] Found 0 open tasks.
Skipping warnings blame since pipelines do not have an SCM link.%n
[TASKS] Computing warning deltas based on reference build #31
[withMaven] Publishers: Pipeline Graph Publisher: 63 ms, Generated Artifacts Publisher: 6711 ms, Invoker Publisher: 6 ms, Junit Publisher: 49474 ms, Concordion Publisher: 5 ms, Dependencies Fingerprint Publisher: 438 ms, Findbugs Publisher: 3 ms, JGiven Publisher: 2 ms, Jacoco Publisher: 2 ms, SpotBugs Publisher: 2 ms, Open Task Scanner Publisher: 701 ms
[Pipeline] // withMaven
[Pipeline] // withMaven
[Pipeline] // withMaven
[Pipeline] fileExists
[Pipeline] fileExists
[Pipeline] fileExists
[Pipeline] fileExists
[Pipeline] fileExists
[Pipeline] fileExists
[Pipeline] zip
Writing zip file of c:\mvn-it-0.tmp\core-it-suite\target\test-classes to c:\mvn-it-0.tmp\core-it-suite-logs-windows-jdk8.zip
[Pipeline] zip
[Pipeline] zip
[Pipeline] zip
Writing zip file of c:\mvn-it-1.tmp\core-it-suite\target\test-classes to c:\mvn-it-1.tmp\core-it-suite-logs-windows-jdk11.zip
Writing zip file of c:\mvn-it-0.tmp\core-it-suite\target\test-classes to c:\mvn-it-0.tmp\core-it-suite-logs-windows-jdk15.zip
Writing zip file of c:\mvn-it-1.tmp\core-it-suite\target\test-classes to c:\mvn-it-1.tmp\core-it-suite-logs-windows-jdk14.zip
[Pipeline] zip
[Pipeline] zip
Writing zip file of /home/jenkins/jenkins-slave/workspace/maven-box_maven_MNG-5937/test/core-it-suite/target/surefire-reports to /home/jenkins/jenkins-slave/workspace/maven-box_maven_MNG-5937/test/core-it-suite-reports-linux-jdk8.zip
Writing zip file of /home/jenkins/jenkins-slave/workspace/maven-box_maven_MNG-5937/test/core-it-suite/target/surefire-reports to /home/jenkins/jenkins-slave/workspace/maven-box_maven_MNG-5937/test/core-it-suite-reports-linux-jdk15.zip
Zipped 4 entries.
Archiving /home/jenkins/jenkins-slave/workspace/maven-box_maven_MNG-5937/test/core-it-suite-reports-linux-jdk8.zip
Zipped 4 entries.
Archiving /home/jenkins/jenkins-slave/workspace/maven-box_maven_MNG-5937/test/core-it-suite-reports-linux-jdk15.zip
[Pipeline] deleteDir
[Pipeline] deleteDir
Zipped 6621 entries.
Archiving c:\mvn-it-0.tmp\core-it-suite-logs-windows-jdk8.zip
Zipped 6621 entries.
Archiving c:\mvn-it-1.tmp\core-it-suite-logs-windows-jdk11.zip
Zipped 6621 entries.
Archiving c:\mvn-it-0.tmp\core-it-suite-logs-windows-jdk15.zip
Zipped 6621 entries.
Archiving c:\mvn-it-1.tmp\core-it-suite-logs-windows-jdk14.zip
ERROR: [withMaven] WARNING Exception processing the logs generated by the Jenkins Maven Event Spy /home/jenkins/jenkins-slave/workspace/maven-box_maven_MNG-5937@2/test@tmp/withMavena88a1a54/maven-spy-20200521-094659-18811599325025605311357.log, ignore file.  Please report a bug associated for the component 'pipeline-maven-plugin' at https://issues.jenkins-ci.org 
hudson.remoting.RequestAbortedException: java.io.IOException: Unexpected termination of the channel
	at hudson.remoting.Request.abort(Request.java:340)
	at hudson.remoting.Channel.terminate(Channel.java:1040)
	at hudson.remoting.SynchronousCommandTransport$ReaderThread.run(SynchronousCommandTransport.java:94)
	Suppressed: hudson.remoting.Channel$CallSiteStackTrace: Remote call to H31
		at hudson.remoting.Channel.attachCallSiteStackTrace(Channel.java:1743)
		at hudson.remoting.Request.call(Request.java:202)
		at hudson.remoting.Channel.call(Channel.java:956)
		at hudson.FilePath.act(FilePath.java:1072)
		at hudson.FilePath.act(FilePath.java:1061)
		at hudson.FilePath.exists(FilePath.java:1558)
		at org.jenkinsci.plugins.pipeline.maven.MavenSpyLogProcessor.processMavenSpyLogs(MavenSpyLogProcessor.java:144)
		at org.jenkinsci.plugins.pipeline.maven.WithMavenStepExecution2$WithMavenStepExecutionCallBack.finished(WithMavenStepExecution2.java:1108)
		at org.jenkinsci.plugins.pipeline.maven.fix.jenkins49337.GeneralNonBlockingStepExecution$TailCall.lambda$onSuccess$0(GeneralNonBlockingStepExecution.java:142)
		at org.jenkinsci.plugins.pipeline.maven.fix.jenkins49337.GeneralNonBlockingStepExecution.lambda$run$0(GeneralNonBlockingStepExecution.java:85)
		at java.util.concurrent.Executors$RunnableAdapter.call(Executors.java:511)
		at java.util.concurrent.FutureTask.run(FutureTask.java:266)
		at java.util.concurrent.ThreadPoolExecutor.runWorker(ThreadPoolExecutor.java:1149)
		at java.util.concurrent.ThreadPoolExecutor$Worker.run(ThreadPoolExecutor.java:624)
		at java.lang.Thread.run(Thread.java:748)
Caused by: java.io.IOException: Unexpected termination of the channel
	at hudson.remoting.SynchronousCommandTransport$ReaderThread.run(SynchronousCommandTransport.java:77)
Caused by: java.io.EOFException
	at java.io.ObjectInputStream$PeekInputStream.readFully(ObjectInputStream.java:2681)
	at java.io.ObjectInputStream$BlockDataInputStream.readShort(ObjectInputStream.java:3156)
	at java.io.ObjectInputStream.readStreamHeader(ObjectInputStream.java:862)
	at java.io.ObjectInputStream.<init>(ObjectInputStream.java:358)
	at hudson.remoting.ObjectInputStreamEx.<init>(ObjectInputStreamEx.java:49)
	at hudson.remoting.Command.readFrom(Command.java:140)
	at hudson.remoting.Command.readFrom(Command.java:126)
	at hudson.remoting.AbstractSynchronousByteArrayCommandTransport.read(AbstractSynchronousByteArrayCommandTransport.java:36)
	at hudson.remoting.SynchronousCommandTransport$ReaderThread.run(SynchronousCommandTransport.java:63)
[withMaven] Publishers: Pipeline Graph Publisher: 29 ms, Generated Artifacts Publisher: 633609 ms, Invoker Publisher: 10 ms, Junit Publisher: 289096 ms, Concordion Publisher: 18 ms, Dependencies Fingerprint Publisher: 2962 ms
[Pipeline] // withMaven
[Pipeline] }
[Pipeline] // dir
[Pipeline] }
[Pipeline] fileExists
H31 was marked offline: Connection was broken: java.io.EOFException
	at java.io.ObjectInputStream$PeekInputStream.readFully(ObjectInputStream.java:2681)
	at java.io.ObjectInputStream$BlockDataInputStream.readShort(ObjectInputStream.java:3156)
	at java.io.ObjectInputStream.readStreamHeader(ObjectInputStream.java:862)
	at java.io.ObjectInputStream.<init>(ObjectInputStream.java:358)
	at hudson.remoting.ObjectInputStreamEx.<init>(ObjectInputStreamEx.java:49)
	at hudson.remoting.Command.readFrom(Command.java:140)
	at hudson.remoting.Command.readFrom(Command.java:126)
	at hudson.remoting.AbstractSynchronousByteArrayCommandTransport.read(AbstractSynchronousByteArrayCommandTransport.java:36)
	at hudson.remoting.SynchronousCommandTransport$ReaderThread.run(SynchronousCommandTransport.java:63)
Caused: java.io.IOException: Unexpected termination of the channel
	at hudson.remoting.SynchronousCommandTransport$ReaderThread.run(SynchronousCommandTransport.java:77)

[Pipeline] }
[Pipeline] // stage
[Pipeline] // dir
[Pipeline] }
[Pipeline] }
[Pipeline] // node
[Pipeline] // stage
[Pipeline] }
Failed in branch linux-jdk8
[Pipeline] }
[Pipeline] // node
[Pipeline] }
Failed in branch linux-jdk11
[Pipeline] }
[Pipeline] // dir
[Pipeline] }
[Pipeline] // stage
[Pipeline] }
[Pipeline] // node
[Pipeline] }
[Pipeline] fileExists
[Pipeline] zip
[Pipeline] fileExists
Writing zip file of c:\mvn-it-1.tmp\core-it-suite\target\surefire-reports to c:\mvn-it-1.tmp\core-it-suite-reports-windows-jdk14.zip
[Pipeline] fileExists
[Pipeline] fileExists
Zipped 4 entries.
Archiving c:\mvn-it-1.tmp\core-it-suite-reports-windows-jdk14.zip
[Pipeline] zip
[Pipeline] zip
Writing zip file of c:\mvn-it-0.tmp\core-it-suite\target\surefire-reports to c:\mvn-it-0.tmp\core-it-suite-reports-windows-jdk15.zip
[Pipeline] zip
Zipped 4 entries.
Archiving c:\mvn-it-0.tmp\core-it-suite-reports-windows-jdk15.zip
Writing zip file of c:\mvn-it-0.tmp\core-it-suite\target\surefire-reports to c:\mvn-it-0.tmp\core-it-suite-reports-windows-jdk8.zip
Writing zip file of c:\mvn-it-1.tmp\core-it-suite\target\surefire-reports to c:\mvn-it-1.tmp\core-it-suite-reports-windows-jdk11.zip
Zipped 4 entries.
Archiving c:\mvn-it-0.tmp\core-it-suite-reports-windows-jdk8.zip
Zipped 4 entries.
Archiving c:\mvn-it-1.tmp\core-it-suite-reports-windows-jdk11.zip
[Pipeline] deleteDir
[Pipeline] deleteDir
[Pipeline] deleteDir
[Pipeline] deleteDir
[Pipeline] }
[Pipeline] // dir
[Pipeline] }
[Pipeline] // stage
[Pipeline] }
[Pipeline] }
[Pipeline] // node
[Pipeline] // dir
[Pipeline] }
[Pipeline] }
[Pipeline] // stage
[Pipeline] }
[Pipeline] // node
[Pipeline] }
[Pipeline] }
[Pipeline] // dir
[Pipeline] }
[Pipeline] // stage
[Pipeline] }
[Pipeline] // node
[Pipeline] }
[Pipeline] }
[Pipeline] // dir
[Pipeline] }
[Pipeline] // stage
[Pipeline] }
[Pipeline] // node
[Pipeline] }
[Pipeline] // parallel
[Pipeline] echo
[FAILURE-001] java.io.IOException: Unable to create live FilePath for H43
[Pipeline] stage
[Pipeline] { (Notifications)
[Pipeline] echo
Build result: FAILURE
[Pipeline] jiraIssueSelector
[Pipeline] echo
The authors of changes [rfscholte].
[Pipeline] echo
Sending email ...
[Pipeline] emailext
Mime
  • Unnamed multipart/mixed (inline, None, 0 bytes)
View raw message