maven-notifications mailing list archives

Site index · List index
Message view « Date » · « Thread »
Top « Date » · « Thread »
From Apache Jenkins Server <jenk...@builds.apache.org>
Subject Build failed in Jenkins: Maven TLP » maven-studies » maven-metrics #17
Date Sun, 10 May 2020 14:44:15 GMT
See https://builds.apache.org/job/maven-box/job/maven-studies/job/maven-metrics/17/

Changes:

* use abstract classes

All tests passed

Build log:
[...truncated 3333 lines...]
[INFO] Downloaded from central: https://repo.maven.apache.org/maven2/org/slf4j/slf4j-simple/1.7.29/slf4j-simple-1.7.29-sources.jar
(15 kB at 1.1 MB/s)
[INFO] Unpacking /home/jenkins/jenkins-slave/workspace/_box_maven-studies_maven-metrics/build/.repository/org/slf4j/slf4j-simple/1.7.29/slf4j-simple-1.7.29-sources.jar
to /home/jenkins/jenkins-slave/workspace/_box_maven-studies_maven-metrics/build/maven-slf4j-provider/target/generated-sources/slf4j-simple
with includes "org/slf4j/impl/*.java" and excludes "org/slf4j/impl/StaticLoggerBinder*"
[INFO] 
[INFO] --- maven-remote-resources-plugin:1.7.0:process (process-resource-bundles) @ maven-slf4j-provider
---
[INFO] Preparing remote bundle org.apache:apache-jar-resource-bundle:1.4
[INFO] Copying 3 resources from 1 bundle.
[INFO] 
[INFO] --- maven-resources-plugin:3.1.0:resources (default-resources) @ maven-slf4j-provider
---
[INFO] Using 'UTF-8' encoding to copy filtered resources.
[INFO] skip non existing resourceDirectory /home/jenkins/jenkins-slave/workspace/_box_maven-studies_maven-metrics/build/maven-slf4j-provider/src/main/resources
[INFO] Copying 3 resources
[INFO] 
[INFO] --- maven-compiler-plugin:3.8.1:compile (default-compile) @ maven-slf4j-provider ---
[INFO] Changes detected - recompiling the module!
[INFO] Compiling 10 source files to /home/jenkins/jenkins-slave/workspace/_box_maven-studies_maven-metrics/build/maven-slf4j-provider/target/classes
[INFO] 
[INFO] --- animal-sniffer-maven-plugin:1.18:check (check-java-compat) @ maven-slf4j-provider
---
[INFO] Checking unresolved references to org.codehaus.mojo.signature:java18:1.0
[INFO] 
[INFO] --- maven-resources-plugin:3.1.0:testResources (default-testResources) @ maven-slf4j-provider
---
[INFO] Using 'UTF-8' encoding to copy filtered resources.
[INFO] skip non existing resourceDirectory /home/jenkins/jenkins-slave/workspace/_box_maven-studies_maven-metrics/build/maven-slf4j-provider/src/test/resources
[INFO] Copying 3 resources
[INFO] 
[INFO] --- maven-compiler-plugin:3.8.1:testCompile (default-testCompile) @ maven-slf4j-provider
---
[INFO] Changes detected - recompiling the module!
[INFO] Compiling 1 source file to /home/jenkins/jenkins-slave/workspace/_box_maven-studies_maven-metrics/build/maven-slf4j-provider/target/test-classes
[INFO] /home/jenkins/jenkins-slave/workspace/_box_maven-studies_maven-metrics/build/maven-slf4j-provider/src/test/java/org/slf4j/impl/MavenLoggerFactoryTest.java:
/home/jenkins/jenkins-slave/workspace/_box_maven-studies_maven-metrics/build/maven-slf4j-provider/src/test/java/org/slf4j/impl/MavenLoggerFactoryTest.java
uses or overrides a deprecated API.
[INFO] /home/jenkins/jenkins-slave/workspace/_box_maven-studies_maven-metrics/build/maven-slf4j-provider/src/test/java/org/slf4j/impl/MavenLoggerFactoryTest.java:
Recompile with -Xlint:deprecation for details.
[INFO] 
[INFO] --- maven-surefire-plugin:2.22.0:test (default-test) @ maven-slf4j-provider ---
[INFO] Surefire report directory: /home/jenkins/jenkins-slave/workspace/_box_maven-studies_maven-metrics/build/maven-slf4j-provider/target/surefire-reports
[INFO] 
[INFO] -------------------------------------------------------
[INFO]  T E S T S
[INFO] -------------------------------------------------------
[INFO] Running org.slf4j.impl.MavenLoggerFactoryTest
[INFO] Tests run: 4, Failures: 0, Errors: 0, Skipped: 0, Time elapsed: 0.128 s - in org.slf4j.impl.MavenLoggerFactoryTest
[INFO] 
[INFO] Results:
[INFO] 
[INFO] Tests run: 4, Failures: 0, Errors: 0, Skipped: 0
[INFO] 
[INFO] 
[INFO] --- maven-jar-plugin:3.2.0:jar (default-jar) @ maven-slf4j-provider ---
[INFO] Building jar: /home/jenkins/jenkins-slave/workspace/_box_maven-studies_maven-metrics/build/maven-slf4j-provider/target/maven-slf4j-provider-3.7.0-SNAPSHOT.jar
[INFO] 
[INFO] --- maven-site-plugin:3.7.1:attach-descriptor (attach-descriptor) @ maven-slf4j-provider
---
[INFO] Skipping because packaging 'jar' is not pom.
[INFO] 
[INFO] --- maven-checkstyle-plugin:3.0.0:check (checkstyle-check) @ maven-slf4j-provider ---
[INFO] 
[INFO] ------------------------------------------------------------------------
[INFO] Skipping Maven Embedder
[INFO] This project has been banned from the build due to previous failures.
[INFO] ------------------------------------------------------------------------
[INFO] 
[INFO] ------------------------------------------------------------------------
[INFO] Skipping Maven Compat
[INFO] This project has been banned from the build due to previous failures.
[INFO] ------------------------------------------------------------------------
[INFO] 
[INFO] ------------------------------------------------------------------------
[INFO] Skipping Apache Maven Distribution
[INFO] This project has been banned from the build due to previous failures.
[INFO] ------------------------------------------------------------------------
[INFO] ------------------------------------------------------------------------
[INFO] Reactor Summary for Apache Maven 3.7.0-SNAPSHOT:
[INFO] 
[INFO] Apache Maven ....................................... SUCCESS [ 17.786 s]
[INFO] Maven Model ........................................ SUCCESS [ 12.052 s]
[INFO] Maven Artifact ..................................... SUCCESS [  5.570 s]
[INFO] Maven Plugin API ................................... SUCCESS [  4.791 s]
[INFO] Maven Builder Support .............................. SUCCESS [  2.822 s]
[INFO] Maven Model Builder ................................ SUCCESS [ 10.228 s]
[INFO] Maven Settings ..................................... SUCCESS [  2.254 s]
[INFO] Maven Settings Builder ............................. SUCCESS [  3.448 s]
[INFO] Maven Repository Metadata Model .................... SUCCESS [  2.010 s]
[INFO] Maven Artifact Resolver Provider ................... SUCCESS [  8.986 s]
[INFO] Maven Core ......................................... FAILURE [  6.340 s]
[INFO] Maven SLF4J Wrapper ................................ SUCCESS [  2.805 s]
[INFO] Maven SLF4J Simple Provider ........................ SUCCESS [  4.354 s]
[INFO] Maven Embedder ..................................... SKIPPED
[INFO] Maven Compat ....................................... SKIPPED
[INFO] Apache Maven Distribution .......................... SKIPPED
[INFO] ------------------------------------------------------------------------
[INFO] BUILD FAILURE
[INFO] ------------------------------------------------------------------------
[INFO] Total time:  01:25 min
[INFO] Finished at: 2020-05-10T14:43:04Z
[INFO] ------------------------------------------------------------------------
[INFO] [jenkins-event-spy] Generated /home/jenkins/jenkins-slave/workspace/_box_maven-studies_maven-metrics/build@tmp/withMavend2bd7848/maven-spy-20200510-144139-208988125243682701913.log
[ERROR] Failed to execute goal org.apache.maven.plugins:maven-compiler-plugin:3.8.1:compile
(default-compile) on project maven-core: Compilation failure: Compilation failure: 
[ERROR] /home/jenkins/jenkins-slave/workspace/_box_maven-studies_maven-metrics/build/maven-core/src/main/java/org/apache/maven/metrics/internal/DefaultMetricsSystem.java:[36,43]
no interface expected here
[ERROR] /home/jenkins/jenkins-slave/workspace/_box_maven-studies_maven-metrics/build/maven-core/src/main/java/org/apache/maven/lifecycle/internal/MojoExecutor.java:[43,37]
package org.apache.maven.metrics.util does not exist
[ERROR] /home/jenkins/jenkins-slave/workspace/_box_maven-studies_maven-metrics/build/maven-core/src/main/java/org/apache/maven/project/DefaultProjectBuilder.java:[48,37]
package org.apache.maven.metrics.util does not exist
[ERROR] /home/jenkins/jenkins-slave/workspace/_box_maven-studies_maven-metrics/build/maven-core/src/main/java/org/apache/maven/plugin/internal/DefaultPluginDependenciesResolver.java:[34,37]
package org.apache.maven.metrics.util does not exist
[ERROR] /home/jenkins/jenkins-slave/workspace/_box_maven-studies_maven-metrics/build/maven-core/src/main/java/org/apache/maven/metrics/internal/DefaultMetricsSystem.java:[39,5]
method does not override or implement a method from a supertype
[ERROR] /home/jenkins/jenkins-slave/workspace/_box_maven-studies_maven-metrics/build/maven-core/src/main/java/org/apache/maven/metrics/internal/DefaultMetricsSystem.java:[45,5]
method does not override or implement a method from a supertype
[ERROR] /home/jenkins/jenkins-slave/workspace/_box_maven-studies_maven-metrics/build/maven-core/src/main/java/org/apache/maven/lifecycle/internal/MojoExecutor.java:[172,29]
cannot find symbol
[ERROR]   symbol:   variable MetricsUtils
[ERROR]   location: class org.apache.maven.lifecycle.internal.MojoExecutor
[ERROR] /home/jenkins/jenkins-slave/workspace/_box_maven-studies_maven-metrics/build/maven-core/src/main/java/org/apache/maven/lifecycle/internal/MojoExecutor.java:[223,29]
cannot find symbol
[ERROR]   symbol:   variable MetricsUtils
[ERROR]   location: class org.apache.maven.lifecycle.internal.MojoExecutor
[ERROR] /home/jenkins/jenkins-slave/workspace/_box_maven-studies_maven-metrics/build/maven-core/src/main/java/org/apache/maven/project/DefaultProjectBuilder.java:[327,36]
cannot find symbol
[ERROR]   symbol:   variable MetricsUtils
[ERROR]   location: class org.apache.maven.project.DefaultProjectBuilder
[ERROR] /home/jenkins/jenkins-slave/workspace/_box_maven-studies_maven-metrics/build/maven-core/src/main/java/org/apache/maven/project/DefaultProjectBuilder.java:[333,23]
cannot find symbol
[ERROR]   symbol:   variable MetricsUtils
[ERROR]   location: class org.apache.maven.project.DefaultProjectBuilder
[ERROR] /home/jenkins/jenkins-slave/workspace/_box_maven-studies_maven-metrics/build/maven-core/src/main/java/org/apache/maven/plugin/internal/DefaultPluginDependenciesResolver.java:[103,29]
cannot find symbol
[ERROR]   symbol:   variable MetricsUtils
[ERROR]   location: class org.apache.maven.plugin.internal.DefaultPluginDependenciesResolver
[ERROR] /home/jenkins/jenkins-slave/workspace/_box_maven-studies_maven-metrics/build/maven-core/src/main/java/org/apache/maven/plugin/internal/DefaultPluginDependenciesResolver.java:[146,23]
cannot find symbol
[ERROR]   symbol:   variable MetricsUtils
[ERROR]   location: class org.apache.maven.plugin.internal.DefaultPluginDependenciesResolver
[ERROR] -> [Help 1]
org.apache.maven.lifecycle.LifecycleExecutionException: Failed to execute goal org.apache.maven.plugins:maven-compiler-plugin:3.8.1:compile
(default-compile) on project maven-core: Compilation failure
    at org.apache.maven.lifecycle.internal.MojoExecutor.execute (MojoExecutor.java:215)
    at org.apache.maven.lifecycle.internal.MojoExecutor.execute (MojoExecutor.java:156)
    at org.apache.maven.lifecycle.internal.MojoExecutor.execute (MojoExecutor.java:148)
    at org.apache.maven.lifecycle.internal.LifecycleModuleBuilder.buildProject (LifecycleModuleBuilder.java:117)
    at org.apache.maven.lifecycle.internal.LifecycleModuleBuilder.buildProject (LifecycleModuleBuilder.java:81)
    at org.apache.maven.lifecycle.internal.builder.singlethreaded.SingleThreadedBuilder.build
(SingleThreadedBuilder.java:56)
    at org.apache.maven.lifecycle.internal.LifecycleStarter.execute (LifecycleStarter.java:128)
    at org.apache.maven.DefaultMaven.doExecute (DefaultMaven.java:305)
    at org.apache.maven.DefaultMaven.doExecute (DefaultMaven.java:192)
    at org.apache.maven.DefaultMaven.execute (DefaultMaven.java:105)
    at org.apache.maven.cli.MavenCli.execute (MavenCli.java:957)
    at org.apache.maven.cli.MavenCli.doMain (MavenCli.java:289)
    at org.apache.maven.cli.MavenCli.main (MavenCli.java:193)
    at sun.reflect.NativeMethodAccessorImpl.invoke0 (Native Method)
    at sun.reflect.NativeMethodAccessorImpl.invoke (NativeMethodAccessorImpl.java:62)
    at sun.reflect.DelegatingMethodAccessorImpl.invoke (DelegatingMethodAccessorImpl.java:43)
    at java.lang.reflect.Method.invoke (Method.java:498)
    at org.codehaus.plexus.classworlds.launcher.Launcher.launchEnhanced (Launcher.java:282)
    at org.codehaus.plexus.classworlds.launcher.Launcher.launch (Launcher.java:225)
    at org.codehaus.plexus.classworlds.launcher.Launcher.mainWithExitCode (Launcher.java:406)
    at org.codehaus.plexus.classworlds.launcher.Launcher.main (Launcher.java:347)
Caused by: org.apache.maven.plugin.compiler.CompilationFailureException: Compilation failure
    at org.apache.maven.plugin.compiler.AbstractCompilerMojo.execute (AbstractCompilerMojo.java:1220)
    at org.apache.maven.plugin.compiler.CompilerMojo.execute (CompilerMojo.java:187)
    at org.apache.maven.plugin.DefaultBuildPluginManager.executeMojo (DefaultBuildPluginManager.java:137)
    at org.apache.maven.lifecycle.internal.MojoExecutor.execute (MojoExecutor.java:210)
    at org.apache.maven.lifecycle.internal.MojoExecutor.execute (MojoExecutor.java:156)
    at org.apache.maven.lifecycle.internal.MojoExecutor.execute (MojoExecutor.java:148)
    at org.apache.maven.lifecycle.internal.LifecycleModuleBuilder.buildProject (LifecycleModuleBuilder.java:117)
    at org.apache.maven.lifecycle.internal.LifecycleModuleBuilder.buildProject (LifecycleModuleBuilder.java:81)
    at org.apache.maven.lifecycle.internal.builder.singlethreaded.SingleThreadedBuilder.build
(SingleThreadedBuilder.java:56)
    at org.apache.maven.lifecycle.internal.LifecycleStarter.execute (LifecycleStarter.java:128)
    at org.apache.maven.DefaultMaven.doExecute (DefaultMaven.java:305)
    at org.apache.maven.DefaultMaven.doExecute (DefaultMaven.java:192)
    at org.apache.maven.DefaultMaven.execute (DefaultMaven.java:105)
    at org.apache.maven.cli.MavenCli.execute (MavenCli.java:957)
    at org.apache.maven.cli.MavenCli.doMain (MavenCli.java:289)
    at org.apache.maven.cli.MavenCli.main (MavenCli.java:193)
    at sun.reflect.NativeMethodAccessorImpl.invoke0 (Native Method)
    at sun.reflect.NativeMethodAccessorImpl.invoke (NativeMethodAccessorImpl.java:62)
    at sun.reflect.DelegatingMethodAccessorImpl.invoke (DelegatingMethodAccessorImpl.java:43)
    at java.lang.reflect.Method.invoke (Method.java:498)
    at org.codehaus.plexus.classworlds.launcher.Launcher.launchEnhanced (Launcher.java:282)
    at org.codehaus.plexus.classworlds.launcher.Launcher.launch (Launcher.java:225)
    at org.codehaus.plexus.classworlds.launcher.Launcher.mainWithExitCode (Launcher.java:406)
    at org.codehaus.plexus.classworlds.launcher.Launcher.main (Launcher.java:347)
[ERROR] 
[ERROR] Re-run Maven using the -X switch to enable full debug logging.
[ERROR] 
[ERROR] For more information about the errors and possible solutions, please read the following
articles:
[ERROR] [Help 1] http://cwiki.apache.org/confluence/display/MAVEN/MojoFailureException
[ERROR] 
[ERROR] After correcting the problems, you can resume the build with the command
[ERROR]   mvn <args> -rf :maven-core
[Pipeline] }
[withMaven] artifactsPublisher - Archive artifact pom.xml under org/apache/maven/maven/3.7.0-SNAPSHOT/maven-3.7.0-SNAPSHOT.pom
[withMaven] artifactsPublisher - Archive artifact target/maven-3.7.0-SNAPSHOT-site.xml under
org/apache/maven/maven/3.7.0-SNAPSHOT/maven-3.7.0-SNAPSHOT-site.xml
[withMaven] artifactsPublisher - Archive artifact maven-model/pom.xml under org/apache/maven/maven-model/3.7.0-SNAPSHOT/maven-model-3.7.0-SNAPSHOT.pom
[withMaven] artifactsPublisher - Archive artifact maven-model/target/maven-model-3.7.0-SNAPSHOT.jar
under org/apache/maven/maven-model/3.7.0-SNAPSHOT/maven-model-3.7.0-SNAPSHOT.jar
[withMaven] artifactsPublisher - Archive artifact maven-artifact/pom.xml under org/apache/maven/maven-artifact/3.7.0-SNAPSHOT/maven-artifact-3.7.0-SNAPSHOT.pom
[withMaven] artifactsPublisher - Archive artifact maven-artifact/target/maven-artifact-3.7.0-SNAPSHOT.jar
under org/apache/maven/maven-artifact/3.7.0-SNAPSHOT/maven-artifact-3.7.0-SNAPSHOT.jar
[withMaven] artifactsPublisher - Archive artifact maven-plugin-api/pom.xml under org/apache/maven/maven-plugin-api/3.7.0-SNAPSHOT/maven-plugin-api-3.7.0-SNAPSHOT.pom
[withMaven] artifactsPublisher - Archive artifact maven-plugin-api/target/maven-plugin-api-3.7.0-SNAPSHOT.jar
under org/apache/maven/maven-plugin-api/3.7.0-SNAPSHOT/maven-plugin-api-3.7.0-SNAPSHOT.jar
[withMaven] artifactsPublisher - Archive artifact maven-builder-support/pom.xml under org/apache/maven/maven-builder-support/3.7.0-SNAPSHOT/maven-builder-support-3.7.0-SNAPSHOT.pom
[withMaven] artifactsPublisher - Archive artifact maven-builder-support/target/maven-builder-support-3.7.0-SNAPSHOT.jar
under org/apache/maven/maven-builder-support/3.7.0-SNAPSHOT/maven-builder-support-3.7.0-SNAPSHOT.jar
[withMaven] artifactsPublisher - Archive artifact maven-model-builder/pom.xml under org/apache/maven/maven-model-builder/3.7.0-SNAPSHOT/maven-model-builder-3.7.0-SNAPSHOT.pom
[withMaven] artifactsPublisher - Archive artifact maven-model-builder/target/maven-model-builder-3.7.0-SNAPSHOT.jar
under org/apache/maven/maven-model-builder/3.7.0-SNAPSHOT/maven-model-builder-3.7.0-SNAPSHOT.jar
[withMaven] artifactsPublisher - Archive artifact maven-settings/pom.xml under org/apache/maven/maven-settings/3.7.0-SNAPSHOT/maven-settings-3.7.0-SNAPSHOT.pom
[withMaven] artifactsPublisher - Archive artifact maven-settings/target/maven-settings-3.7.0-SNAPSHOT.jar
under org/apache/maven/maven-settings/3.7.0-SNAPSHOT/maven-settings-3.7.0-SNAPSHOT.jar
[withMaven] artifactsPublisher - Archive artifact maven-settings-builder/pom.xml under org/apache/maven/maven-settings-builder/3.7.0-SNAPSHOT/maven-settings-builder-3.7.0-SNAPSHOT.pom
[withMaven] artifactsPublisher - Archive artifact maven-settings-builder/target/maven-settings-builder-3.7.0-SNAPSHOT.jar
under org/apache/maven/maven-settings-builder/3.7.0-SNAPSHOT/maven-settings-builder-3.7.0-SNAPSHOT.jar
[withMaven] artifactsPublisher - Archive artifact maven-repository-metadata/pom.xml under
org/apache/maven/maven-repository-metadata/3.7.0-SNAPSHOT/maven-repository-metadata-3.7.0-SNAPSHOT.pom
[withMaven] artifactsPublisher - Archive artifact maven-repository-metadata/target/maven-repository-metadata-3.7.0-SNAPSHOT.jar
under org/apache/maven/maven-repository-metadata/3.7.0-SNAPSHOT/maven-repository-metadata-3.7.0-SNAPSHOT.jar
[withMaven] artifactsPublisher - Archive artifact maven-resolver-provider/pom.xml under org/apache/maven/maven-resolver-provider/3.7.0-SNAPSHOT/maven-resolver-provider-3.7.0-SNAPSHOT.pom
[withMaven] artifactsPublisher - Archive artifact maven-resolver-provider/target/maven-resolver-provider-3.7.0-SNAPSHOT.jar
under org/apache/maven/maven-resolver-provider/3.7.0-SNAPSHOT/maven-resolver-provider-3.7.0-SNAPSHOT.jar
[withMaven] artifactsPublisher - Archive artifact maven-slf4j-wrapper/pom.xml under org/apache/maven/maven-slf4j-wrapper/3.7.0-SNAPSHOT/maven-slf4j-wrapper-3.7.0-SNAPSHOT.pom
[withMaven] artifactsPublisher - Archive artifact maven-slf4j-wrapper/target/maven-slf4j-wrapper-3.7.0-SNAPSHOT.jar
under org/apache/maven/maven-slf4j-wrapper/3.7.0-SNAPSHOT/maven-slf4j-wrapper-3.7.0-SNAPSHOT.jar
[withMaven] artifactsPublisher - Archive artifact maven-slf4j-provider/pom.xml under org/apache/maven/maven-slf4j-provider/3.7.0-SNAPSHOT/maven-slf4j-provider-3.7.0-SNAPSHOT.pom
[withMaven] artifactsPublisher - Archive artifact maven-slf4j-provider/target/maven-slf4j-provider-3.7.0-SNAPSHOT.jar
under org/apache/maven/maven-slf4j-provider/3.7.0-SNAPSHOT/maven-slf4j-provider-3.7.0-SNAPSHOT.jar
[Fast Archiver] Compressed 770.02 KB of artifacts by 66.5% relative to #12
[withMaven] junitPublisher - Archive test results for Maven artifact org.apache.maven:maven-model:jar:3.7.0-SNAPSHOT
generated by maven-surefire-plugin:test (default-test): maven-model/target/surefire-reports/*.xml
[withMaven] junitPublisher - Archive test results for Maven artifact org.apache.maven:maven-artifact:jar:3.7.0-SNAPSHOT
generated by maven-surefire-plugin:test (default-test): maven-artifact/target/surefire-reports/*.xml
[withMaven] junitPublisher - Archive test results for Maven artifact org.apache.maven:maven-plugin-api:jar:3.7.0-SNAPSHOT
generated by maven-surefire-plugin:test (default-test): maven-plugin-api/target/surefire-reports/*.xml
[withMaven] junitPublisher - Archive test results for Maven artifact org.apache.maven:maven-builder-support:jar:3.7.0-SNAPSHOT
generated by maven-surefire-plugin:test (default-test): maven-builder-support/target/surefire-reports/*.xml
[withMaven] junitPublisher - Archive test results for Maven artifact org.apache.maven:maven-model-builder:jar:3.7.0-SNAPSHOT
generated by maven-surefire-plugin:test (default-test): maven-model-builder/target/surefire-reports/*.xml
[withMaven] junitPublisher - Archive test results for Maven artifact org.apache.maven:maven-settings:jar:3.7.0-SNAPSHOT
generated by maven-surefire-plugin:test (default-test): maven-settings/target/surefire-reports/*.xml
[withMaven] junitPublisher - Archive test results for Maven artifact org.apache.maven:maven-settings-builder:jar:3.7.0-SNAPSHOT
generated by maven-surefire-plugin:test (default-test): maven-settings-builder/target/surefire-reports/*.xml
[withMaven] junitPublisher - Archive test results for Maven artifact org.apache.maven:maven-repository-metadata:jar:3.7.0-SNAPSHOT
generated by maven-surefire-plugin:test (default-test): maven-repository-metadata/target/surefire-reports/*.xml
[withMaven] junitPublisher - Archive test results for Maven artifact org.apache.maven:maven-resolver-provider:jar:3.7.0-SNAPSHOT
generated by maven-surefire-plugin:test (default-test): maven-resolver-provider/target/surefire-reports/*.xml
[withMaven] junitPublisher - Archive test results for Maven artifact org.apache.maven:maven-slf4j-wrapper:jar:3.7.0-SNAPSHOT
generated by maven-surefire-plugin:test (default-test): maven-slf4j-wrapper/target/surefire-reports/*.xml
[withMaven] junitPublisher - Archive test results for Maven artifact org.apache.maven:maven-slf4j-provider:jar:3.7.0-SNAPSHOT
generated by maven-surefire-plugin:test (default-test): maven-slf4j-provider/target/surefire-reports/*.xml
Recording test results
[withMaven] junitPublisher - Archive test results for Maven artifact org.apache.maven:maven-artifact:jar:3.7.0-SNAPSHOT
generated by maven-failsafe-plugin:integration-test (default): maven-artifact/target/failsafe-reports/*.xml
Recording test results
[withMaven] openTasksPublisher - Scan Tasks for Maven artifact org.apache.maven:maven-model:jar:3.7.0-SNAPSHOT
in source directory maven-model/src/main/java
[withMaven] openTasksPublisher - Scan Tasks for Maven artifact org.apache.maven:maven-artifact:jar:3.7.0-SNAPSHOT
in source directory maven-artifact/src/main/java
[withMaven] openTasksPublisher - Scan Tasks for Maven artifact org.apache.maven:maven-plugin-api:jar:3.7.0-SNAPSHOT
in source directory maven-plugin-api/src/main/java
[withMaven] openTasksPublisher - Scan Tasks for Maven artifact org.apache.maven:maven-builder-support:jar:3.7.0-SNAPSHOT
in source directory maven-builder-support/src/main/java
[withMaven] openTasksPublisher - Scan Tasks for Maven artifact org.apache.maven:maven-model-builder:jar:3.7.0-SNAPSHOT
in source directory maven-model-builder/src/main/java
[withMaven] openTasksPublisher - Scan Tasks for Maven artifact org.apache.maven:maven-settings:jar:3.7.0-SNAPSHOT
in source directory maven-settings/src/main/java
[withMaven] openTasksPublisher - Scan Tasks for Maven artifact org.apache.maven:maven-settings-builder:jar:3.7.0-SNAPSHOT
in source directory maven-settings-builder/src/main/java
[withMaven] openTasksPublisher - Scan Tasks for Maven artifact org.apache.maven:maven-resolver-provider:jar:3.7.0-SNAPSHOT
in source directory maven-resolver-provider/src/main/java
[withMaven] openTasksPublisher - Scan Tasks for Maven artifact org.apache.maven:maven-core:jar:3.7.0-SNAPSHOT
in source directory maven-core/src/main/java
[withMaven] openTasksPublisher - Scan Tasks for Maven artifact org.apache.maven:maven-slf4j-wrapper:jar:3.7.0-SNAPSHOT
in source directory maven-slf4j-wrapper/src/main/java
[withMaven] openTasksPublisher - Scan Tasks for Maven artifact org.apache.maven:maven-slf4j-provider:jar:3.7.0-SNAPSHOT
in source directory maven-slf4j-provider/src/main/java
[TASKS] Scanning folder '/home/jenkins/jenkins-slave/workspace/_box_maven-studies_maven-metrics/build'
for files matching the pattern 'maven-model/src/main/java/**/*,maven-artifact/src/main/java/**/*,maven-plugin-api/src/main/java/**/*,maven-builder-support/src/main/java/**/*,maven-model-builder/src/main/java/**/*,maven-settings/src/main/java/**/*,maven-settings-builder/src/main/java/**/*,maven-resolver-provider/src/main/java/**/*,maven-core/src/main/java/**/*,maven-slf4j-wrapper/src/main/java/**/*,maven-slf4j-provider/src/main/java/**/*'
- excludes: null
[TASKS] Found 551 files to scan for tasks
[TASKS] Found 103 open tasks.
Skipping warnings blame since pipelines do not have an SCM link.%n
[TASKS] Computing warning deltas based on reference build #12
[withMaven] Publishers: Pipeline Graph Publisher: 38 ms, Generated Artifacts Publisher: 10520
ms, Invoker Publisher: 1 ms, Junit Publisher: 35118 ms, Concordion Publisher: 1 ms, Dependencies
Fingerprint Publisher: 7200 ms, Open Task Scanner Publisher: 12047 ms
[Pipeline] // withMaven
[Pipeline] }
[Pipeline] // stage
[Pipeline] }
[Pipeline] // dir
[Pipeline] }
[Pipeline] // node
[Pipeline] echo
[FAILURE-003] AbortException hudson.AbortException: script returned exit code 1
[Pipeline] stage
[Pipeline] { (Notifications)
[Pipeline] echo
Build result: FAILURE
[Pipeline] jiraIssueSelector
[Pipeline] echo
The authors of changes [eolivelli].
[Pipeline] echo
Sending email ...
[Pipeline] emailext
Mime
  • Unnamed multipart/mixed (inline, None, 0 bytes)
View raw message