maven-notifications mailing list archives

Site index · List index
Message view « Date » · « Thread »
Top « Date » · « Thread »
From Apache Jenkins Server <jenk...@builds.apache.org>
Subject Build failed in Jenkins: Maven TLP » maven-surefire » SUREFIRE-1787 #5
Date Sat, 09 May 2020 10:35:38 GMT
See https://builds.apache.org/job/maven-box/job/maven-surefire/job/SUREFIRE-1787/5/

Changes:

* unit tests

All tests passed

Build log:
[...truncated 29697 lines...]
[2020-05-09T10:34:55.839Z] [INFO] Maven Surefire Plugin .............................. SUCCESS
[ 11.276 s]
[2020-05-09T10:34:55.839Z] [INFO] Maven Failsafe Plugin .............................. SUCCESS
[01:20 min]
[2020-05-09T10:34:55.839Z] [INFO] Maven Surefire Report Plugin ....................... SUCCESS
[ 18.249 s]
[2020-05-09T10:34:55.839Z] [INFO] Maven Surefire Integration Tests ................... SUCCESS
[  01:37 h]
[2020-05-09T10:34:55.839Z] [INFO] Surefire Shared Utils .............................. FAILURE
[  2.952 s]
[2020-05-09T10:34:55.839Z] [INFO] ------------------------------------------------------------------------
[2020-05-09T10:34:55.839Z] [INFO] BUILD FAILURE
[2020-05-09T10:34:55.839Z] [INFO] ------------------------------------------------------------------------
[2020-05-09T10:34:55.839Z] [INFO] Total time:  01:45 h
[2020-05-09T10:34:55.839Z] [INFO] Finished at: 2020-05-09T10:34:55Z
[2020-05-09T10:34:55.839Z] [INFO] ------------------------------------------------------------------------
[2020-05-09T10:34:55.839Z] [ERROR] Failed to execute goal org.apache.maven.plugins:maven-deploy-plugin:2.8.2:deploy
(default-deploy) on project surefire-shared-utils: Failed to retrieve remote metadata org.apache.maven.surefire:surefire:3.0.0-SNAPSHOT/maven-metadata.xml:
Could not transfer metadata org.apache.maven.surefire:surefire:3.0.0-SNAPSHOT/maven-metadata.xml
from/to apache.snapshots.https (https://repository.apache.org/content/repositories/snapshots):
Transfer failed for https://repository.apache.org/content/repositories/snapshots/org/apache/maven/surefire/surefire/3.0.0-SNAPSHOT/maven-metadata.xml
500 Server Error -> [Help 1]
[2020-05-09T10:34:55.839Z] org.apache.maven.lifecycle.LifecycleExecutionException: Failed
to execute goal org.apache.maven.plugins:maven-deploy-plugin:2.8.2:deploy (default-deploy)
on project surefire-shared-utils: Failed to retrieve remote metadata org.apache.maven.surefire:surefire:3.0.0-SNAPSHOT/maven-metadata.xml:
Could not transfer metadata org.apache.maven.surefire:surefire:3.0.0-SNAPSHOT/maven-metadata.xml
from/to apache.snapshots.https (https://repository.apache.org/content/repositories/snapshots):
Transfer failed for https://repository.apache.org/content/repositories/snapshots/org/apache/maven/surefire/surefire/3.0.0-SNAPSHOT/maven-metadata.xml
500 Server Error
[2020-05-09T10:34:55.839Z]     at org.apache.maven.lifecycle.internal.MojoExecutor.execute
(MojoExecutor.java:215)
[2020-05-09T10:34:55.839Z]     at org.apache.maven.lifecycle.internal.MojoExecutor.execute
(MojoExecutor.java:156)
[2020-05-09T10:34:55.839Z]     at org.apache.maven.lifecycle.internal.MojoExecutor.execute
(MojoExecutor.java:148)
[2020-05-09T10:34:55.839Z]     at org.apache.maven.lifecycle.internal.LifecycleModuleBuilder.buildProject
(LifecycleModuleBuilder.java:117)
[2020-05-09T10:34:55.839Z]     at org.apache.maven.lifecycle.internal.LifecycleModuleBuilder.buildProject
(LifecycleModuleBuilder.java:81)
[2020-05-09T10:34:55.840Z]     at org.apache.maven.lifecycle.internal.builder.singlethreaded.SingleThreadedBuilder.build
(SingleThreadedBuilder.java:56)
[2020-05-09T10:34:55.840Z]     at org.apache.maven.lifecycle.internal.LifecycleStarter.execute
(LifecycleStarter.java:128)
[2020-05-09T10:34:55.840Z]     at org.apache.maven.DefaultMaven.doExecute (DefaultMaven.java:305)
[2020-05-09T10:34:55.840Z]     at org.apache.maven.DefaultMaven.doExecute (DefaultMaven.java:192)
[2020-05-09T10:34:55.840Z]     at org.apache.maven.DefaultMaven.execute (DefaultMaven.java:105)
[2020-05-09T10:34:55.840Z]     at org.apache.maven.cli.MavenCli.execute (MavenCli.java:957)
[2020-05-09T10:34:55.840Z]     at org.apache.maven.cli.MavenCli.doMain (MavenCli.java:289)
[2020-05-09T10:34:55.840Z]     at org.apache.maven.cli.MavenCli.main (MavenCli.java:193)
[2020-05-09T10:34:55.840Z]     at sun.reflect.NativeMethodAccessorImpl.invoke0 (Native Method)
[2020-05-09T10:34:55.840Z]     at sun.reflect.NativeMethodAccessorImpl.invoke (NativeMethodAccessorImpl.java:62)
[2020-05-09T10:34:55.840Z]     at sun.reflect.DelegatingMethodAccessorImpl.invoke (DelegatingMethodAccessorImpl.java:43)
[2020-05-09T10:34:55.840Z]     at java.lang.reflect.Method.invoke (Method.java:498)
[2020-05-09T10:34:55.840Z]     at org.codehaus.plexus.classworlds.launcher.Launcher.launchEnhanced
(Launcher.java:282)
[2020-05-09T10:34:55.840Z]     at org.codehaus.plexus.classworlds.launcher.Launcher.launch
(Launcher.java:225)
[2020-05-09T10:34:55.840Z]     at org.codehaus.plexus.classworlds.launcher.Launcher.mainWithExitCode
(Launcher.java:406)
[2020-05-09T10:34:55.840Z]     at org.codehaus.plexus.classworlds.launcher.Launcher.main (Launcher.java:347)
[2020-05-09T10:34:55.840Z] Caused by: org.apache.maven.plugin.MojoExecutionException: Failed
to retrieve remote metadata org.apache.maven.surefire:surefire:3.0.0-SNAPSHOT/maven-metadata.xml:
Could not transfer metadata org.apache.maven.surefire:surefire:3.0.0-SNAPSHOT/maven-metadata.xml
from/to apache.snapshots.https (https://repository.apache.org/content/repositories/snapshots):
Transfer failed for https://repository.apache.org/content/repositories/snapshots/org/apache/maven/surefire/surefire/3.0.0-SNAPSHOT/maven-metadata.xml
500 Server Error
[2020-05-09T10:34:55.840Z]     at org.apache.maven.plugin.deploy.DeployMojo.deployProject
(DeployMojo.java:284)
[2020-05-09T10:34:55.840Z]     at org.apache.maven.plugin.deploy.DeployMojo.execute (DeployMojo.java:185)
[2020-05-09T10:34:55.840Z]     at org.apache.maven.plugin.DefaultBuildPluginManager.executeMojo
(DefaultBuildPluginManager.java:137)
[2020-05-09T10:34:55.840Z]     at org.apache.maven.lifecycle.internal.MojoExecutor.execute
(MojoExecutor.java:210)
[2020-05-09T10:34:55.840Z]     at org.apache.maven.lifecycle.internal.MojoExecutor.execute
(MojoExecutor.java:156)
[2020-05-09T10:34:55.840Z]     at org.apache.maven.lifecycle.internal.MojoExecutor.execute
(MojoExecutor.java:148)
[2020-05-09T10:34:55.840Z]     at org.apache.maven.lifecycle.internal.LifecycleModuleBuilder.buildProject
(LifecycleModuleBuilder.java:117)
[2020-05-09T10:34:55.840Z]     at org.apache.maven.lifecycle.internal.LifecycleModuleBuilder.buildProject
(LifecycleModuleBuilder.java:81)
[2020-05-09T10:34:55.840Z]     at org.apache.maven.lifecycle.internal.builder.singlethreaded.SingleThreadedBuilder.build
(SingleThreadedBuilder.java:56)
[2020-05-09T10:34:55.840Z]     at org.apache.maven.lifecycle.internal.LifecycleStarter.execute
(LifecycleStarter.java:128)
[2020-05-09T10:34:55.840Z]     at org.apache.maven.DefaultMaven.doExecute (DefaultMaven.java:305)
[2020-05-09T10:34:55.840Z]     at org.apache.maven.DefaultMaven.doExecute (DefaultMaven.java:192)
[2020-05-09T10:34:55.840Z]     at org.apache.maven.DefaultMaven.execute (DefaultMaven.java:105)
[2020-05-09T10:34:55.840Z]     at org.apache.maven.cli.MavenCli.execute (MavenCli.java:957)
[2020-05-09T10:34:55.840Z]     at org.apache.maven.cli.MavenCli.doMain (MavenCli.java:289)
[2020-05-09T10:34:55.840Z]     at org.apache.maven.cli.MavenCli.main (MavenCli.java:193)
[2020-05-09T10:34:55.840Z]     at sun.reflect.NativeMethodAccessorImpl.invoke0 (Native Method)
[2020-05-09T10:34:55.840Z]     at sun.reflect.NativeMethodAccessorImpl.invoke (NativeMethodAccessorImpl.java:62)
[2020-05-09T10:34:55.840Z]     at sun.reflect.DelegatingMethodAccessorImpl.invoke (DelegatingMethodAccessorImpl.java:43)
[2020-05-09T10:34:55.840Z]     at java.lang.reflect.Method.invoke (Method.java:498)
[2020-05-09T10:34:55.840Z]     at org.codehaus.plexus.classworlds.launcher.Launcher.launchEnhanced
(Launcher.java:282)
[2020-05-09T10:34:55.840Z]     at org.codehaus.plexus.classworlds.launcher.Launcher.launch
(Launcher.java:225)
[2020-05-09T10:34:55.840Z]     at org.codehaus.plexus.classworlds.launcher.Launcher.mainWithExitCode
(Launcher.java:406)
[2020-05-09T10:34:55.840Z]     at org.codehaus.plexus.classworlds.launcher.Launcher.main (Launcher.java:347)
[2020-05-09T10:34:55.840Z] Caused by: org.apache.maven.artifact.deployer.ArtifactDeploymentException:
Failed to retrieve remote metadata org.apache.maven.surefire:surefire:3.0.0-SNAPSHOT/maven-metadata.xml:
Could not transfer metadata org.apache.maven.surefire:surefire:3.0.0-SNAPSHOT/maven-metadata.xml
from/to apache.snapshots.https (https://repository.apache.org/content/repositories/snapshots):
Transfer failed for https://repository.apache.org/content/repositories/snapshots/org/apache/maven/surefire/surefire/3.0.0-SNAPSHOT/maven-metadata.xml
500 Server Error
[2020-05-09T10:34:55.840Z]     at org.apache.maven.artifact.deployer.DefaultArtifactDeployer.deploy
(DefaultArtifactDeployer.java:146)
[2020-05-09T10:34:55.840Z]     at org.apache.maven.plugin.deploy.AbstractDeployMojo.deploy
(AbstractDeployMojo.java:171)
[2020-05-09T10:34:55.840Z]     at org.apache.maven.plugin.deploy.DeployMojo.deployProject
(DeployMojo.java:242)
[2020-05-09T10:34:55.840Z]     at org.apache.maven.plugin.deploy.DeployMojo.execute (DeployMojo.java:185)
[2020-05-09T10:34:55.840Z]     at org.apache.maven.plugin.DefaultBuildPluginManager.executeMojo
(DefaultBuildPluginManager.java:137)
[2020-05-09T10:34:55.840Z]     at org.apache.maven.lifecycle.internal.MojoExecutor.execute
(MojoExecutor.java:210)
[2020-05-09T10:34:55.840Z]     at org.apache.maven.lifecycle.internal.MojoExecutor.execute
(MojoExecutor.java:156)
[2020-05-09T10:34:55.840Z]     at org.apache.maven.lifecycle.internal.MojoExecutor.execute
(MojoExecutor.java:148)
[2020-05-09T10:34:55.840Z]     at org.apache.maven.lifecycle.internal.LifecycleModuleBuilder.buildProject
(LifecycleModuleBuilder.java:117)
[2020-05-09T10:34:55.840Z]     at org.apache.maven.lifecycle.internal.LifecycleModuleBuilder.buildProject
(LifecycleModuleBuilder.java:81)
[2020-05-09T10:34:55.840Z]     at org.apache.maven.lifecycle.internal.builder.singlethreaded.SingleThreadedBuilder.build
(SingleThreadedBuilder.java:56)
[2020-05-09T10:34:55.840Z]     at org.apache.maven.lifecycle.internal.LifecycleStarter.execute
(LifecycleStarter.java:128)
[2020-05-09T10:34:55.840Z]     at org.apache.maven.DefaultMaven.doExecute (DefaultMaven.java:305)
[2020-05-09T10:34:55.840Z]     at org.apache.maven.DefaultMaven.doExecute (DefaultMaven.java:192)
[2020-05-09T10:34:55.840Z]     at org.apache.maven.DefaultMaven.execute (DefaultMaven.java:105)
[2020-05-09T10:34:55.840Z]     at org.apache.maven.cli.MavenCli.execute (MavenCli.java:957)
[2020-05-09T10:34:55.840Z]     at org.apache.maven.cli.MavenCli.doMain (MavenCli.java:289)
[2020-05-09T10:34:55.840Z]     at org.apache.maven.cli.MavenCli.main (MavenCli.java:193)
[2020-05-09T10:34:55.840Z]     at sun.reflect.NativeMethodAccessorImpl.invoke0 (Native Method)
[2020-05-09T10:34:55.840Z]     at sun.reflect.NativeMethodAccessorImpl.invoke (NativeMethodAccessorImpl.java:62)
[2020-05-09T10:34:55.841Z]     at sun.reflect.DelegatingMethodAccessorImpl.invoke (DelegatingMethodAccessorImpl.java:43)
[2020-05-09T10:34:55.841Z]     at java.lang.reflect.Method.invoke (Method.java:498)
[2020-05-09T10:34:55.841Z]     at org.codehaus.plexus.classworlds.launcher.Launcher.launchEnhanced
(Launcher.java:282)
[2020-05-09T10:34:55.841Z]     at org.codehaus.plexus.classworlds.launcher.Launcher.launch
(Launcher.java:225)
[2020-05-09T10:34:55.841Z]     at org.codehaus.plexus.classworlds.launcher.Launcher.mainWithExitCode
(Launcher.java:406)
[2020-05-09T10:34:55.841Z]     at org.codehaus.plexus.classworlds.launcher.Launcher.main (Launcher.java:347)
[2020-05-09T10:34:55.841Z] Caused by: org.eclipse.aether.deployment.DeploymentException: Failed
to retrieve remote metadata org.apache.maven.surefire:surefire:3.0.0-SNAPSHOT/maven-metadata.xml:
Could not transfer metadata org.apache.maven.surefire:surefire:3.0.0-SNAPSHOT/maven-metadata.xml
from/to apache.snapshots.https (https://repository.apache.org/content/repositories/snapshots):
Transfer failed for https://repository.apache.org/content/repositories/snapshots/org/apache/maven/surefire/surefire/3.0.0-SNAPSHOT/maven-metadata.xml
500 Server Error
[2020-05-09T10:34:55.841Z]     at org.eclipse.aether.internal.impl.DefaultDeployer.upload
(DefaultDeployer.java:426)
[2020-05-09T10:34:55.841Z]     at org.eclipse.aether.internal.impl.DefaultDeployer.deploy
(DefaultDeployer.java:256)
[2020-05-09T10:34:55.841Z]     at org.eclipse.aether.internal.impl.DefaultDeployer.deploy
(DefaultDeployer.java:213)
[2020-05-09T10:34:55.841Z]     at org.eclipse.aether.internal.impl.DefaultRepositorySystem.deploy
(DefaultRepositorySystem.java:386)
[2020-05-09T10:34:55.841Z]     at org.apache.maven.artifact.deployer.DefaultArtifactDeployer.deploy
(DefaultArtifactDeployer.java:142)
[2020-05-09T10:34:55.841Z]     at org.apache.maven.plugin.deploy.AbstractDeployMojo.deploy
(AbstractDeployMojo.java:171)
[2020-05-09T10:34:55.841Z]     at org.apache.maven.plugin.deploy.DeployMojo.deployProject
(DeployMojo.java:242)
[2020-05-09T10:34:55.841Z]     at org.apache.maven.plugin.deploy.DeployMojo.execute (DeployMojo.java:185)
[2020-05-09T10:34:55.841Z]     at org.apache.maven.plugin.DefaultBuildPluginManager.executeMojo
(DefaultBuildPluginManager.java:137)
[2020-05-09T10:34:55.841Z]     at org.apache.maven.lifecycle.internal.MojoExecutor.execute
(MojoExecutor.java:210)
[2020-05-09T10:34:55.841Z]     at org.apache.maven.lifecycle.internal.MojoExecutor.execute
(MojoExecutor.java:156)
[2020-05-09T10:34:55.841Z]     at org.apache.maven.lifecycle.internal.MojoExecutor.execute
(MojoExecutor.java:148)
[2020-05-09T10:34:55.841Z]     at org.apache.maven.lifecycle.internal.LifecycleModuleBuilder.buildProject
(LifecycleModuleBuilder.java:117)
[2020-05-09T10:34:55.841Z]     at org.apache.maven.lifecycle.internal.LifecycleModuleBuilder.buildProject
(LifecycleModuleBuilder.java:81)
[2020-05-09T10:34:55.841Z]     at org.apache.maven.lifecycle.internal.builder.singlethreaded.SingleThreadedBuilder.build
(SingleThreadedBuilder.java:56)
[2020-05-09T10:34:55.841Z]     at org.apache.maven.lifecycle.internal.LifecycleStarter.execute
(LifecycleStarter.java:128)
[2020-05-09T10:34:55.841Z]     at org.apache.maven.DefaultMaven.doExecute (DefaultMaven.java:305)
[2020-05-09T10:34:55.841Z]     at org.apache.maven.DefaultMaven.doExecute (DefaultMaven.java:192)
[2020-05-09T10:34:55.841Z]     at org.apache.maven.DefaultMaven.execute (DefaultMaven.java:105)
[2020-05-09T10:34:55.841Z]     at org.apache.maven.cli.MavenCli.execute (MavenCli.java:957)
[2020-05-09T10:34:55.841Z]     at org.apache.maven.cli.MavenCli.doMain (MavenCli.java:289)
[2020-05-09T10:34:55.841Z]     at org.apache.maven.cli.MavenCli.main (MavenCli.java:193)
[2020-05-09T10:34:55.841Z]     at sun.reflect.NativeMethodAccessorImpl.invoke0 (Native Method)
[2020-05-09T10:34:55.841Z]     at sun.reflect.NativeMethodAccessorImpl.invoke (NativeMethodAccessorImpl.java:62)
[2020-05-09T10:34:55.841Z]     at sun.reflect.DelegatingMethodAccessorImpl.invoke (DelegatingMethodAccessorImpl.java:43)
[2020-05-09T10:34:55.841Z]     at java.lang.reflect.Method.invoke (Method.java:498)
[2020-05-09T10:34:55.841Z]     at org.codehaus.plexus.classworlds.launcher.Launcher.launchEnhanced
(Launcher.java:282)
[2020-05-09T10:34:55.841Z]     at org.codehaus.plexus.classworlds.launcher.Launcher.launch
(Launcher.java:225)
[2020-05-09T10:34:55.841Z]     at org.codehaus.plexus.classworlds.launcher.Launcher.mainWithExitCode
(Launcher.java:406)
[2020-05-09T10:34:55.841Z]     at org.codehaus.plexus.classworlds.launcher.Launcher.main (Launcher.java:347)
[2020-05-09T10:34:55.841Z] Caused by: org.eclipse.aether.transfer.MetadataTransferException:
Could not transfer metadata org.apache.maven.surefire:surefire:3.0.0-SNAPSHOT/maven-metadata.xml
from/to apache.snapshots.https (https://repository.apache.org/content/repositories/snapshots):
Transfer failed for https://repository.apache.org/content/repositories/snapshots/org/apache/maven/surefire/surefire/3.0.0-SNAPSHOT/maven-metadata.xml
500 Server Error
[2020-05-09T10:34:55.841Z]     at org.eclipse.aether.connector.basic.MetadataTransportListener.transferFailed
(MetadataTransportListener.java:52)
[2020-05-09T10:34:55.841Z]     at org.eclipse.aether.connector.basic.BasicRepositoryConnector$TaskRunner.run
(BasicRepositoryConnector.java:369)
[2020-05-09T10:34:55.841Z]     at org.eclipse.aether.util.concurrency.RunnableErrorForwarder$1.run
(RunnableErrorForwarder.java:75)
[2020-05-09T10:34:55.841Z]     at org.eclipse.aether.connector.basic.BasicRepositoryConnector$DirectExecutor.execute
(BasicRepositoryConnector.java:644)
[2020-05-09T10:34:55.841Z]     at org.eclipse.aether.connector.basic.BasicRepositoryConnector.get
(BasicRepositoryConnector.java:235)
[2020-05-09T10:34:55.841Z]     at org.eclipse.aether.internal.impl.DefaultDeployer.upload
(DefaultDeployer.java:399)
[2020-05-09T10:34:55.841Z]     at org.eclipse.aether.internal.impl.DefaultDeployer.deploy
(DefaultDeployer.java:256)
[2020-05-09T10:34:55.841Z]     at org.eclipse.aether.internal.impl.DefaultDeployer.deploy
(DefaultDeployer.java:213)
[2020-05-09T10:34:55.841Z]     at org.eclipse.aether.internal.impl.DefaultRepositorySystem.deploy
(DefaultRepositorySystem.java:386)
[2020-05-09T10:34:55.842Z]     at org.apache.maven.artifact.deployer.DefaultArtifactDeployer.deploy
(DefaultArtifactDeployer.java:142)
[2020-05-09T10:34:55.842Z]     at org.apache.maven.plugin.deploy.AbstractDeployMojo.deploy
(AbstractDeployMojo.java:171)
[2020-05-09T10:34:55.842Z]     at org.apache.maven.plugin.deploy.DeployMojo.deployProject
(DeployMojo.java:242)
[2020-05-09T10:34:55.842Z]     at org.apache.maven.plugin.deploy.DeployMojo.execute (DeployMojo.java:185)
[2020-05-09T10:34:55.842Z]     at org.apache.maven.plugin.DefaultBuildPluginManager.executeMojo
(DefaultBuildPluginManager.java:137)
[2020-05-09T10:34:55.842Z]     at org.apache.maven.lifecycle.internal.MojoExecutor.execute
(MojoExecutor.java:210)
[2020-05-09T10:34:55.842Z]     at org.apache.maven.lifecycle.internal.MojoExecutor.execute
(MojoExecutor.java:156)
[2020-05-09T10:34:55.842Z]     at org.apache.maven.lifecycle.internal.MojoExecutor.execute
(MojoExecutor.java:148)
[2020-05-09T10:34:55.842Z]     at org.apache.maven.lifecycle.internal.LifecycleModuleBuilder.buildProject
(LifecycleModuleBuilder.java:117)
[2020-05-09T10:34:55.842Z]     at org.apache.maven.lifecycle.internal.LifecycleModuleBuilder.buildProject
(LifecycleModuleBuilder.java:81)
[2020-05-09T10:34:55.842Z]     at org.apache.maven.lifecycle.internal.builder.singlethreaded.SingleThreadedBuilder.build
(SingleThreadedBuilder.java:56)
[2020-05-09T10:34:55.842Z]     at org.apache.maven.lifecycle.internal.LifecycleStarter.execute
(LifecycleStarter.java:128)
[2020-05-09T10:34:55.842Z]     at org.apache.maven.DefaultMaven.doExecute (DefaultMaven.java:305)
[2020-05-09T10:34:55.842Z]     at org.apache.maven.DefaultMaven.doExecute (DefaultMaven.java:192)
[2020-05-09T10:34:55.842Z]     at org.apache.maven.DefaultMaven.execute (DefaultMaven.java:105)
[2020-05-09T10:34:55.842Z]     at org.apache.maven.cli.MavenCli.execute (MavenCli.java:957)
[2020-05-09T10:34:55.842Z]     at org.apache.maven.cli.MavenCli.doMain (MavenCli.java:289)
[2020-05-09T10:34:55.842Z]     at org.apache.maven.cli.MavenCli.main (MavenCli.java:193)
[2020-05-09T10:34:55.842Z]     at sun.reflect.NativeMethodAccessorImpl.invoke0 (Native Method)
[2020-05-09T10:34:55.842Z]     at sun.reflect.NativeMethodAccessorImpl.invoke (NativeMethodAccessorImpl.java:62)
[2020-05-09T10:34:55.842Z]     at sun.reflect.DelegatingMethodAccessorImpl.invoke (DelegatingMethodAccessorImpl.java:43)
[2020-05-09T10:34:55.842Z]     at java.lang.reflect.Method.invoke (Method.java:498)
[2020-05-09T10:34:55.842Z]     at org.codehaus.plexus.classworlds.launcher.Launcher.launchEnhanced
(Launcher.java:282)
[2020-05-09T10:34:55.842Z]     at org.codehaus.plexus.classworlds.launcher.Launcher.launch
(Launcher.java:225)
[2020-05-09T10:34:55.842Z]     at org.codehaus.plexus.classworlds.launcher.Launcher.mainWithExitCode
(Launcher.java:406)
[2020-05-09T10:34:55.842Z]     at org.codehaus.plexus.classworlds.launcher.Launcher.main (Launcher.java:347)
[2020-05-09T10:34:55.842Z] Caused by: org.apache.maven.wagon.TransferFailedException: Transfer
failed for https://repository.apache.org/content/repositories/snapshots/org/apache/maven/surefire/surefire/3.0.0-SNAPSHOT/maven-metadata.xml
500 Server Error
[2020-05-09T10:34:55.842Z]     at org.apache.maven.wagon.providers.http.wagon.shared.AbstractHttpClientWagon.fillInputData
(AbstractHttpClientWagon.java:1196)
[2020-05-09T10:34:55.842Z]     at org.apache.maven.wagon.providers.http.wagon.shared.AbstractHttpClientWagon.fillInputData
(AbstractHttpClientWagon.java:1138)
[2020-05-09T10:34:55.842Z]     at org.apache.maven.wagon.StreamWagon.getInputStream (StreamWagon.java:126)
[2020-05-09T10:34:55.842Z]     at org.apache.maven.wagon.StreamWagon.getIfNewer (StreamWagon.java:88)
[2020-05-09T10:34:55.842Z]     at org.apache.maven.wagon.StreamWagon.get (StreamWagon.java:61)
[2020-05-09T10:34:55.842Z]     at org.eclipse.aether.transport.wagon.WagonTransporter$GetTaskRunner.run
(WagonTransporter.java:567)
[2020-05-09T10:34:55.842Z]     at org.eclipse.aether.transport.wagon.WagonTransporter.execute
(WagonTransporter.java:435)
[2020-05-09T10:34:55.842Z]     at org.eclipse.aether.transport.wagon.WagonTransporter.get
(WagonTransporter.java:412)
[2020-05-09T10:34:55.842Z]     at org.eclipse.aether.connector.basic.BasicRepositoryConnector$GetTaskRunner.runTask
(BasicRepositoryConnector.java:457)
[2020-05-09T10:34:55.842Z]     at org.eclipse.aether.connector.basic.BasicRepositoryConnector$TaskRunner.run
(BasicRepositoryConnector.java:364)
[2020-05-09T10:34:55.842Z]     at org.eclipse.aether.util.concurrency.RunnableErrorForwarder$1.run
(RunnableErrorForwarder.java:75)
[2020-05-09T10:34:55.842Z]     at org.eclipse.aether.connector.basic.BasicRepositoryConnector$DirectExecutor.execute
(BasicRepositoryConnector.java:644)
[2020-05-09T10:34:55.842Z]     at org.eclipse.aether.connector.basic.BasicRepositoryConnector.get
(BasicRepositoryConnector.java:235)
[2020-05-09T10:34:55.842Z]     at org.eclipse.aether.internal.impl.DefaultDeployer.upload
(DefaultDeployer.java:399)
[2020-05-09T10:34:55.842Z]     at org.eclipse.aether.internal.impl.DefaultDeployer.deploy
(DefaultDeployer.java:256)
[2020-05-09T10:34:55.842Z]     at org.eclipse.aether.internal.impl.DefaultDeployer.deploy
(DefaultDeployer.java:213)
[2020-05-09T10:34:55.842Z]     at org.eclipse.aether.internal.impl.DefaultRepositorySystem.deploy
(DefaultRepositorySystem.java:386)
[2020-05-09T10:34:55.842Z]     at org.apache.maven.artifact.deployer.DefaultArtifactDeployer.deploy
(DefaultArtifactDeployer.java:142)
[2020-05-09T10:34:55.842Z]     at org.apache.maven.plugin.deploy.AbstractDeployMojo.deploy
(AbstractDeployMojo.java:171)
[2020-05-09T10:34:55.842Z]     at org.apache.maven.plugin.deploy.DeployMojo.deployProject
(DeployMojo.java:242)
[2020-05-09T10:34:55.842Z]     at org.apache.maven.plugin.deploy.DeployMojo.execute (DeployMojo.java:185)
[2020-05-09T10:34:55.842Z]     at org.apache.maven.plugin.DefaultBuildPluginManager.executeMojo
(DefaultBuildPluginManager.java:137)
[2020-05-09T10:34:55.843Z]     at org.apache.maven.lifecycle.internal.MojoExecutor.execute
(MojoExecutor.java:210)
[2020-05-09T10:34:55.843Z]     at org.apache.maven.lifecycle.internal.MojoExecutor.execute
(MojoExecutor.java:156)
[2020-05-09T10:34:55.843Z]     at org.apache.maven.lifecycle.internal.MojoExecutor.execute
(MojoExecutor.java:148)
[2020-05-09T10:34:55.843Z]     at org.apache.maven.lifecycle.internal.LifecycleModuleBuilder.buildProject
(LifecycleModuleBuilder.java:117)
[2020-05-09T10:34:55.843Z]     at org.apache.maven.lifecycle.internal.LifecycleModuleBuilder.buildProject
(LifecycleModuleBuilder.java:81)
[2020-05-09T10:34:55.843Z]     at org.apache.maven.lifecycle.internal.builder.singlethreaded.SingleThreadedBuilder.build
(SingleThreadedBuilder.java:56)
[2020-05-09T10:34:55.843Z]     at org.apache.maven.lifecycle.internal.LifecycleStarter.execute
(LifecycleStarter.java:128)
[2020-05-09T10:34:55.843Z]     at org.apache.maven.DefaultMaven.doExecute (DefaultMaven.java:305)
[2020-05-09T10:34:55.843Z]     at org.apache.maven.DefaultMaven.doExecute (DefaultMaven.java:192)
[2020-05-09T10:34:55.843Z]     at org.apache.maven.DefaultMaven.execute (DefaultMaven.java:105)
[2020-05-09T10:34:55.843Z]     at org.apache.maven.cli.MavenCli.execute (MavenCli.java:957)
[2020-05-09T10:34:55.843Z]     at org.apache.maven.cli.MavenCli.doMain (MavenCli.java:289)
[2020-05-09T10:34:55.843Z]     at org.apache.maven.cli.MavenCli.main (MavenCli.java:193)
[2020-05-09T10:34:55.843Z]     at sun.reflect.NativeMethodAccessorImpl.invoke0 (Native Method)
[2020-05-09T10:34:55.843Z]     at sun.reflect.NativeMethodAccessorImpl.invoke (NativeMethodAccessorImpl.java:62)
[2020-05-09T10:34:55.843Z]     at sun.reflect.DelegatingMethodAccessorImpl.invoke (DelegatingMethodAccessorImpl.java:43)
[2020-05-09T10:34:55.843Z]     at java.lang.reflect.Method.invoke (Method.java:498)
[2020-05-09T10:34:55.843Z]     at org.codehaus.plexus.classworlds.launcher.Launcher.launchEnhanced
(Launcher.java:282)
[2020-05-09T10:34:55.843Z]     at org.codehaus.plexus.classworlds.launcher.Launcher.launch
(Launcher.java:225)
[2020-05-09T10:34:55.843Z]     at org.codehaus.plexus.classworlds.launcher.Launcher.mainWithExitCode
(Launcher.java:406)
[2020-05-09T10:34:55.843Z]     at org.codehaus.plexus.classworlds.launcher.Launcher.main (Launcher.java:347)
[2020-05-09T10:34:55.843Z] [ERROR] 
[2020-05-09T10:34:55.843Z] [ERROR] Re-run Maven using the -X switch to enable full debug logging.
[2020-05-09T10:34:55.843Z] [ERROR] 
[2020-05-09T10:34:55.843Z] [ERROR] For more information about the errors and possible solutions,
please read the following articles:
[2020-05-09T10:34:55.843Z] [ERROR] [Help 1] http://cwiki.apache.org/confluence/display/MAVEN/MojoExecutionException
[2020-05-09T10:34:55.843Z] [ERROR] 
[2020-05-09T10:34:55.843Z] [ERROR] After correcting the problems, you can resume the build
with the command
[2020-05-09T10:34:55.843Z] [ERROR]   mvn <args> -rf :surefire-shared-utils
[Pipeline] }
[Pipeline] // withEnv
[Pipeline] }
[Pipeline] // stage
[Pipeline] openTasks
[2020-05-09T10:34:56.448Z] [TASKS] Skipping publisher since build result is FAILURE
[Pipeline] jacoco
[Pipeline] junit
[2020-05-09T10:34:56.823Z] Recording test results
[Pipeline] fileExists
[Pipeline] zip
[2020-05-09T10:35:00.479Z] Writing zip file of /home/jenkins/jenkins-slave/workspace/box_maven-surefire_SUREFIRE-1787@2/maven-failsafe-plugin/target/it
to /home/jenkins/jenkins-slave/workspace/box_maven-surefire_SUREFIRE-1787@2/maven-failsafe-plugin--linux-jdk15-maven3.6.x.zip
[2020-05-09T10:35:00.663Z] Zipped 78 entries.
[2020-05-09T10:35:00.663Z] Archiving /home/jenkins/jenkins-slave/workspace/box_maven-surefire_SUREFIRE-1787@2/maven-failsafe-plugin--linux-jdk15-maven3.6.x.zip
[2020-05-09T10:35:00.674Z] [Fast Archiver] No prior successful build to compare, so performing
full copy of artifacts
[Pipeline] fileExists
[Pipeline] zip
[2020-05-09T10:35:01.618Z] Writing zip file of /home/jenkins/jenkins-slave/workspace/box_maven-surefire_SUREFIRE-1787@2/surefire-its/target
to /home/jenkins/jenkins-slave/workspace/box_maven-surefire_SUREFIRE-1787@2/surefire-its--linux-jdk15-maven3.6.x.zip
[2020-05-09T10:35:25.347Z] Zipped 20029 entries.
[2020-05-09T10:35:25.348Z] Archiving /home/jenkins/jenkins-slave/workspace/box_maven-surefire_SUREFIRE-1787@2/surefire-its--linux-jdk15-maven3.6.x.zip
[2020-05-09T10:35:25.348Z] [Fast Archiver] No prior successful build to compare, so performing
full copy of artifacts
[Pipeline] archiveArtifacts
[2020-05-09T10:35:31.630Z] Archiving artifacts
[2020-05-09T10:35:31.798Z] [Fast Archiver] No prior successful build to compare, so performing
full copy of artifacts
[Pipeline] cleanWs
[2020-05-09T10:35:37.637Z] [WS-CLEANUP] Deleting project workspace...
[2020-05-09T10:35:37.637Z] [WS-CLEANUP] Deferred wipeout is used...
[2020-05-09T10:35:38.116Z] [WS-CLEANUP] done
[Pipeline] }
[Pipeline] // ws
[Pipeline] }
[Pipeline] // timestamps
[Pipeline] }
[Pipeline] // node
[Pipeline] }
[Pipeline] // parallel
[Pipeline] echo
Build result: FAILURE
[Pipeline] jiraIssueSelector
[Pipeline] echo
The authors of changes [tibordigana].
[Pipeline] echo
Sending email ...
[Pipeline] emailext
Mime
  • Unnamed multipart/mixed (inline, None, 0 bytes)
View raw message