maven-notifications mailing list archives

Site index · List index
Message view « Date » · « Thread »
Top « Date » · « Thread »
From Apache Jenkins Server <jenk...@builds.apache.org>
Subject Build failed in Jenkins: Maven TLP » maven-surefire » SUREFIRE-1570 #8
Date Sat, 16 May 2020 04:34:32 GMT
See https://builds.apache.org/job/maven-box/job/maven-surefire/job/SUREFIRE-1570/8/

Changes:

* improved coverage in getEffectiveJvm()

No tests ran.

Build log:
[...truncated 15068 lines...]
[2020-05-16T04:32:59.348Z] [WARNING]   - META-INF/LICENSE.txt
[2020-05-16T04:32:59.348Z] [WARNING]   - META-INF/NOTICE.txt
[2020-05-16T04:32:59.348Z] [WARNING] maven-shared-utils-3.1.0.jar, surefire-shared-utils-3.0.0-SNAPSHOT.jar
define 3 overlapping resources: 
[2020-05-16T04:32:59.348Z] [WARNING]   - META-INF/DEPENDENCIES
[2020-05-16T04:32:59.348Z] [WARNING]   - META-INF/LICENSE
[2020-05-16T04:32:59.348Z] [WARNING]   - META-INF/NOTICE
[2020-05-16T04:32:59.348Z] [WARNING] commons-codec-1.11.jar, commons-compress-1.20.jar, commons-io-2.6.jar,
commons-lang3-3.8.1.jar, maven-shared-utils-3.1.0.jar, surefire-shared-utils-3.0.0-SNAPSHOT.jar
define 1 overlapping resources: 
[2020-05-16T04:32:59.348Z] [WARNING]   - META-INF/MANIFEST.MF
[2020-05-16T04:32:59.348Z] [WARNING] maven-shade-plugin has detected that some class files
are
[2020-05-16T04:32:59.348Z] [WARNING] present in two or more JARs. When this happens, only
one
[2020-05-16T04:32:59.349Z] [WARNING] single version of the class is copied to the uber jar.
[2020-05-16T04:32:59.349Z] [WARNING] Usually this is not harmful and you can skip these warnings,
[2020-05-16T04:32:59.349Z] [WARNING] otherwise try to manually exclude artifacts based on
[2020-05-16T04:32:59.349Z] [WARNING] mvn dependency:tree -Ddetail=true and the above output.
[2020-05-16T04:32:59.349Z] [WARNING] See http://maven.apache.org/plugins/maven-shade-plugin/
[2020-05-16T04:32:59.349Z] [INFO] Replacing original artifact with shaded artifact.
[2020-05-16T04:32:59.349Z] [INFO] Replacing C:\Users\jenkins\AppData\Local\Temp\2\jenkins-maven-box-maven-surefire-SUREFIRE-1570-8\surefire-shared-utils\target\surefire-shared-utils-3.0.0-SNAPSHOT.jar
with C:\Users\jenkins\AppData\Local\Temp\2\jenkins-maven-box-maven-surefire-SUREFIRE-1570-8\surefire-shared-utils\target\surefire-shared-utils-3.0.0-SNAPSHOT-shaded.jar
[2020-05-16T04:32:59.349Z] [INFO] Dependency-reduced POM written at: C:\Users\jenkins\AppData\Local\Temp\2\jenkins-maven-box-maven-surefire-SUREFIRE-1570-8\surefire-shared-utils\dependency-reduced-pom.xml
[2020-05-16T04:32:59.647Z] [INFO] 
[2020-05-16T04:32:59.647Z] [INFO] --- maven-checkstyle-plugin:3.0.0:check (checkstyle-check)
@ surefire-shared-utils ---
[2020-05-16T04:32:59.647Z] [INFO] 
[2020-05-16T04:32:59.647Z] [INFO] --- maven-install-plugin:2.5.2:install (default-install)
@ surefire-shared-utils ---
[2020-05-16T04:32:59.647Z] [INFO] Installing C:\Users\jenkins\AppData\Local\Temp\2\jenkins-maven-box-maven-surefire-SUREFIRE-1570-8\surefire-shared-utils\target\surefire-shared-utils-3.0.0-SNAPSHOT.jar
to C:\Users\jenkins\AppData\Local\Temp\2\jenkins-maven-box-maven-surefire-SUREFIRE-1570-8\.m2\org\apache\maven\surefire\surefire-shared-utils\3.0.0-SNAPSHOT\surefire-shared-utils-3.0.0-SNAPSHOT.jar
[2020-05-16T04:32:59.917Z] [INFO] Installing C:\Users\jenkins\AppData\Local\Temp\2\jenkins-maven-box-maven-surefire-SUREFIRE-1570-8\surefire-shared-utils\dependency-reduced-pom.xml
to C:\Users\jenkins\AppData\Local\Temp\2\jenkins-maven-box-maven-surefire-SUREFIRE-1570-8\.m2\org\apache\maven\surefire\surefire-shared-utils\3.0.0-SNAPSHOT\surefire-shared-utils-3.0.0-SNAPSHOT.pom
[2020-05-16T04:32:59.917Z] [INFO] ------------------------------------------------------------------------
[2020-05-16T04:32:59.917Z] [INFO] Reactor Summary for Apache Maven Surefire 3.0.0-SNAPSHOT:
[2020-05-16T04:32:59.917Z] [INFO] 
[2020-05-16T04:32:59.917Z] [INFO] Apache Maven Surefire .............................. SUCCESS
[ 47.926 s]
[2020-05-16T04:32:59.917Z] [INFO] SureFire Logger API ................................ SUCCESS
[ 18.939 s]
[2020-05-16T04:32:59.917Z] [INFO] SureFire API ....................................... SUCCESS
[ 21.222 s]
[2020-05-16T04:32:59.917Z] [INFO] Surefire Extensions API ............................ SUCCESS
[  5.694 s]
[2020-05-16T04:32:59.917Z] [INFO] Surefire Extensions SPI ............................ SUCCESS
[  2.052 s]
[2020-05-16T04:32:59.917Z] [INFO] SureFire Booter .................................... SUCCESS
[ 20.636 s]
[2020-05-16T04:32:59.917Z] [INFO] Maven Surefire Test-Grouping Support ............... SUCCESS
[  8.497 s]
[2020-05-16T04:32:59.917Z] [INFO] SureFire Providers ................................. SUCCESS
[  0.876 s]
[2020-05-16T04:32:59.917Z] [INFO] Shared JUnit3 Provider Code ........................ SUCCESS
[  4.276 s]
[2020-05-16T04:32:59.917Z] [INFO] Shared Java 5 Provider Base ........................ SUCCESS
[  4.864 s]
[2020-05-16T04:32:59.917Z] [INFO] Shared JUnit4 Provider Code ........................ SUCCESS
[  5.793 s]
[2020-05-16T04:32:59.917Z] [INFO] Shared JUnit48 Provider Code ....................... SUCCESS
[  8.043 s]
[2020-05-16T04:32:59.917Z] [INFO] SureFire JUnit Runner .............................. SUCCESS
[  4.239 s]
[2020-05-16T04:32:59.917Z] [INFO] SureFire JUnit4 Runner ............................. SUCCESS
[  4.783 s]
[2020-05-16T04:32:59.917Z] [INFO] Maven Surefire Common .............................. SUCCESS
[ 54.872 s]
[2020-05-16T04:32:59.917Z] [INFO] SureFire JUnitCore Runner .......................... SUCCESS
[02:14 min]
[2020-05-16T04:32:59.917Z] [INFO] SureFire JUnit Platform Runner ..................... SUCCESS
[ 11.595 s]
[2020-05-16T04:32:59.917Z] [INFO] SureFire TestNG Utils .............................. SUCCESS
[  4.626 s]
[2020-05-16T04:32:59.917Z] [INFO] SureFire TestNG Runner ............................. SUCCESS
[  7.238 s]
[2020-05-16T04:32:59.917Z] [INFO] ShadeFire JUnit3 Provider .......................... SUCCESS
[  1.988 s]
[2020-05-16T04:32:59.917Z] [INFO] Surefire Report Parser ............................. SUCCESS
[  6.957 s]
[2020-05-16T04:32:59.917Z] [INFO] Maven Surefire Plugin .............................. SUCCESS
[ 11.609 s]
[2020-05-16T04:32:59.917Z] [INFO] Maven Failsafe Plugin .............................. SUCCESS
[01:36 min]
[2020-05-16T04:32:59.917Z] [INFO] Maven Surefire Report Plugin ....................... SUCCESS
[ 18.062 s]
[2020-05-16T04:32:59.917Z] [INFO] Maven Surefire Integration Tests ................... SUCCESS
[  01:35 h]
[2020-05-16T04:32:59.917Z] [INFO] Surefire Shared Utils .............................. SUCCESS
[  2.155 s]
[2020-05-16T04:32:59.917Z] [INFO] ------------------------------------------------------------------------
[2020-05-16T04:32:59.917Z] [INFO] BUILD SUCCESS
[2020-05-16T04:32:59.917Z] [INFO] ------------------------------------------------------------------------
[2020-05-16T04:32:59.917Z] [INFO] Total time:  01:43 h
[2020-05-16T04:32:59.917Z] [INFO] Finished at: 2020-05-15T21:32:59-07:00
[2020-05-16T04:32:59.918Z] [INFO] ------------------------------------------------------------------------
[Pipeline] }
[Pipeline] // withEnv
[Pipeline] }
[Pipeline] // stage
[Pipeline] cleanWs
[2020-05-16T04:33:00.019Z] [WS-CLEANUP] Deleting project workspace...
[2020-05-16T04:33:00.020Z] [WS-CLEANUP] Deferred wipeout is used...
[2020-05-16T04:33:00.143Z] [WS-CLEANUP] done
[Pipeline] }
[Pipeline] // ws
[Pipeline] }
[Pipeline] // timestamps
[Pipeline] }
[Pipeline] // node
[Pipeline] }
[2020-05-16T04:33:28.011Z] [INFO] Tests run: 6, Failures: 0, Errors: 0, Skipped: 0, Time elapsed:
116.348 s - in org.apache.maven.surefire.its.jiras.Surefire946KillMainProcessInReusableForkIT
[2020-05-16T04:33:28.011Z] [INFO] Running org.apache.maven.surefire.its.jiras.Surefire972BizarreNoClassDefIT
[2020-05-16T04:33:28.011Z] [INFO] Tests run: 1, Failures: 0, Errors: 0, Skipped: 0, Time elapsed:
9.751 s - in org.apache.maven.surefire.its.jiras.Surefire972BizarreNoClassDefIT
[2020-05-16T04:33:28.011Z] [INFO] Running org.apache.maven.surefire.its.jiras.Surefire975DefaultVMEncodingIT
[2020-05-16T04:33:32.303Z] [INFO] Tests run: 1, Failures: 0, Errors: 0, Skipped: 0, Time elapsed:
5.946 s - in org.apache.maven.surefire.its.jiras.Surefire975DefaultVMEncodingIT
[2020-05-16T04:33:32.303Z] [INFO] Running org.apache.maven.surefire.its.jiras.Surefire979WrongClassLoaderIT
[2020-05-16T04:33:38.987Z] [INFO] Tests run: 1, Failures: 0, Errors: 0, Skipped: 0, Time elapsed:
6.466 s - in org.apache.maven.surefire.its.jiras.Surefire979WrongClassLoaderIT
[2020-05-16T04:33:38.987Z] [INFO] Running org.apache.maven.surefire.its.jiras.Surefire985ParameterizedRunnerAndCategoriesIT
[2020-05-16T04:33:44.378Z] [INFO] Tests run: 1, Failures: 0, Errors: 0, Skipped: 0, Time elapsed:
5.949 s - in org.apache.maven.surefire.its.jiras.Surefire985ParameterizedRunnerAndCategoriesIT
[2020-05-16T04:33:44.378Z] [INFO] Running org.apache.maven.surefire.its.jiras.Surefire995CategoryInheritanceIT
[2020-05-16T04:34:31.264Z] [INFO] Tests run: 7, Failures: 0, Errors: 0, Skipped: 0, Time elapsed:
40.845 s - in org.apache.maven.surefire.its.jiras.Surefire995CategoryInheritanceIT
[2020-05-16T04:34:31.264Z] [INFO] 
[2020-05-16T04:34:31.265Z] [INFO] Results:
[2020-05-16T04:34:31.265Z] [INFO] 
[2020-05-16T04:34:31.265Z] [WARNING] Tests run: 955, Failures: 0, Errors: 0, Skipped: 146
[2020-05-16T04:34:31.265Z] [INFO] 
[2020-05-16T04:34:31.265Z] [INFO] 
[2020-05-16T04:34:31.265Z] [INFO] --- maven-checkstyle-plugin:3.0.0:check (checkstyle-check)
@ surefire-its ---
[2020-05-16T04:34:31.265Z] [INFO] 
[2020-05-16T04:34:31.265Z] [INFO] --- maven-failsafe-plugin:3.0.0-M4:verify (default) @ surefire-its
---
[2020-05-16T04:34:31.265Z] [INFO] Failsafe report directory: C:\Windows\System32\config\systemprofile\AppData\Local\Temp\jenkins-maven-box-maven-surefire-SUREFIRE-1570-8\surefire-its\target\failsafe-reports
[2020-05-16T04:34:31.265Z] [INFO] 
[2020-05-16T04:34:31.265Z] [INFO] --- maven-install-plugin:2.5.2:install (default-install)
@ surefire-its ---
[2020-05-16T04:34:31.265Z] [INFO] Skipping artifact installation
[2020-05-16T04:34:31.265Z] [INFO] 
[2020-05-16T04:34:31.265Z] [INFO] ----------< org.apache.maven.surefire:surefire-shared-utils
>-----------
[2020-05-16T04:34:31.265Z] [INFO] Building Surefire Shared Utils 3.0.0-SNAPSHOT          
         [26/26]
[2020-05-16T04:34:31.265Z] [INFO] --------------------------------[ jar ]---------------------------------
[2020-05-16T04:34:31.265Z] [INFO] 
[2020-05-16T04:34:31.265Z] [INFO] --- maven-clean-plugin:3.1.0:clean (default-clean) @ surefire-shared-utils
---
[2020-05-16T04:34:31.265Z] [INFO] 
[2020-05-16T04:34:31.265Z] [INFO] --- maven-enforcer-plugin:3.0.0-M3:enforce (enforce-maven-version)
@ surefire-shared-utils ---
[2020-05-16T04:34:31.265Z] [INFO] 
[2020-05-16T04:34:31.265Z] [INFO] --- maven-enforcer-plugin:3.0.0-M3:enforce (enforce-bytecode-version)
@ surefire-shared-utils ---
[2020-05-16T04:34:31.265Z] [INFO] Adding ignore: module-info
[2020-05-16T04:34:31.265Z] [INFO] 
[2020-05-16T04:34:31.265Z] [INFO] --- maven-enforcer-plugin:3.0.0-M3:enforce (enforce-java)
@ surefire-shared-utils ---
[2020-05-16T04:34:31.265Z] [INFO] 
[2020-05-16T04:34:31.265Z] [INFO] --- maven-enforcer-plugin:3.0.0-M3:enforce (enforce-maven)
@ surefire-shared-utils ---
[2020-05-16T04:34:31.265Z] [INFO] 
[2020-05-16T04:34:31.265Z] [INFO] --- apache-rat-plugin:0.13:check (rat-check) @ surefire-shared-utils
---
[2020-05-16T04:34:31.265Z] [INFO] Enabled default license matchers.
[2020-05-16T04:34:31.265Z] [INFO] Will parse SCM ignores for exclusions...
[2020-05-16T04:34:31.265Z] [INFO] Finished adding exclusions from SCM ignore files.
[2020-05-16T04:34:31.265Z] [INFO] 62 implicit excludes (use -debug for more details).
[2020-05-16T04:34:31.265Z] [INFO] 27 explicit excludes (use -debug for more details).
[2020-05-16T04:34:31.265Z] [INFO] 1 resources included (use -debug for more details)
[2020-05-16T04:34:31.265Z] [INFO] Rat check: Summary over all files. Unapproved: 0, unknown:
0, generated: 0, approved: 1 licenses.
[2020-05-16T04:34:31.265Z] [INFO] 
[2020-05-16T04:34:31.265Z] [INFO] --- maven-compiler-plugin:3.8.1:compile (compile-generated)
@ surefire-shared-utils ---
[2020-05-16T04:34:31.265Z] [INFO] No sources to compile
[2020-05-16T04:34:31.265Z] [INFO] 
[2020-05-16T04:34:31.265Z] [INFO] --- maven-remote-resources-plugin:1.7.0:process (process-resource-bundles)
@ surefire-shared-utils ---
[2020-05-16T04:34:31.265Z] [INFO] Preparing remote bundle org.apache:apache-jar-resource-bundle:1.4
[2020-05-16T04:34:31.265Z] [INFO] Copying 3 resources from 1 bundle.
[2020-05-16T04:34:31.265Z] [INFO] 
[2020-05-16T04:34:31.265Z] [INFO] --- maven-resources-plugin:3.1.0:resources (default-resources)
@ surefire-shared-utils ---
[2020-05-16T04:34:31.265Z] [INFO] Using 'UTF-8' encoding to copy filtered resources.
[2020-05-16T04:34:31.265Z] [INFO] skip non existing resourceDirectory C:\Windows\System32\config\systemprofile\AppData\Local\Temp\jenkins-maven-box-maven-surefire-SUREFIRE-1570-8\surefire-shared-utils\src\main\resources
[2020-05-16T04:34:31.265Z] [INFO] Copying 3 resources
[2020-05-16T04:34:31.265Z] [INFO] 
[2020-05-16T04:34:31.265Z] [INFO] --- maven-compiler-plugin:3.8.1:compile (default-compile)
@ surefire-shared-utils ---
[2020-05-16T04:34:31.265Z] [INFO] No sources to compile
[2020-05-16T04:34:31.265Z] [INFO] 
[2020-05-16T04:34:31.265Z] [INFO] --- animal-sniffer-maven-plugin:1.17:check (signature-check)
@ surefire-shared-utils ---
[2020-05-16T04:34:31.265Z] [INFO] Checking unresolved references to org.codehaus.mojo.signature:java17:1.0
[2020-05-16T04:34:31.265Z] [INFO] 
[2020-05-16T04:34:31.265Z] [INFO] --- maven-resources-plugin:3.1.0:testResources (default-testResources)
@ surefire-shared-utils ---
[2020-05-16T04:34:31.265Z] [INFO] Using 'UTF-8' encoding to copy filtered resources.
[2020-05-16T04:34:31.265Z] [INFO] skip non existing resourceDirectory C:\Windows\System32\config\systemprofile\AppData\Local\Temp\jenkins-maven-box-maven-surefire-SUREFIRE-1570-8\surefire-shared-utils\src\test\resources
[2020-05-16T04:34:31.265Z] [INFO] Copying 3 resources
[2020-05-16T04:34:31.265Z] [INFO] 
[2020-05-16T04:34:31.265Z] [INFO] --- maven-compiler-plugin:3.8.1:testCompile (default-testCompile)
@ surefire-shared-utils ---
[2020-05-16T04:34:31.265Z] [INFO] No sources to compile
[2020-05-16T04:34:31.265Z] [INFO] 
[2020-05-16T04:34:31.265Z] [INFO] --- maven-surefire-plugin:3.0.0-M4:test (default-test) @
surefire-shared-utils ---
[2020-05-16T04:34:31.265Z] [INFO] 
[2020-05-16T04:34:31.265Z] [INFO] --- maven-jar-plugin:3.2.0:jar (default-jar) @ surefire-shared-utils
---
[2020-05-16T04:34:31.266Z] [INFO] Building jar: C:\Windows\System32\config\systemprofile\AppData\Local\Temp\jenkins-maven-box-maven-surefire-SUREFIRE-1570-8\surefire-shared-utils\target\surefire-shared-utils-3.0.0-SNAPSHOT.jar
[2020-05-16T04:34:31.266Z] [INFO] 
[2020-05-16T04:34:31.266Z] [INFO] --- maven-site-plugin:3.8.2:attach-descriptor (attach-descriptor)
@ surefire-shared-utils ---
[2020-05-16T04:34:31.266Z] [INFO] Skipping because packaging 'jar' is not pom.
[2020-05-16T04:34:31.266Z] [INFO] 
[2020-05-16T04:34:31.266Z] [INFO] --- maven-shade-plugin:3.2.3:shade (default) @ surefire-shared-utils
---
[2020-05-16T04:34:31.266Z] [INFO] Including org.apache.maven.shared:maven-shared-utils:jar:3.1.0
in the shaded jar.
[2020-05-16T04:34:31.266Z] [INFO] Including commons-io:commons-io:jar:2.6 in the shaded jar.
[2020-05-16T04:34:31.266Z] [INFO] Including org.apache.commons:commons-lang3:jar:3.8.1 in
the shaded jar.
[2020-05-16T04:34:31.266Z] [INFO] Including org.apache.commons:commons-compress:jar:1.20 in
the shaded jar.
[2020-05-16T04:34:31.266Z] [INFO] Including commons-codec:commons-codec:jar:1.11 in the shaded
jar.
[2020-05-16T04:34:31.266Z] [WARNING] commons-codec-1.11.jar, commons-compress-1.20.jar, commons-io-2.6.jar,
commons-lang3-3.8.1.jar, maven-shared-utils-3.1.0.jar, surefire-shared-utils-3.0.0-SNAPSHOT.jar
define 1 overlapping resources: 
[2020-05-16T04:34:31.266Z] [WARNING]   - META-INF/MANIFEST.MF
[2020-05-16T04:34:31.266Z] [WARNING] maven-shared-utils-3.1.0.jar, surefire-shared-utils-3.0.0-SNAPSHOT.jar
define 3 overlapping resources: 
[2020-05-16T04:34:31.266Z] [WARNING]   - META-INF/DEPENDENCIES
[2020-05-16T04:34:31.266Z] [WARNING]   - META-INF/LICENSE
[2020-05-16T04:34:31.266Z] [WARNING]   - META-INF/NOTICE
[2020-05-16T04:34:31.266Z] [WARNING] commons-codec-1.11.jar, commons-compress-1.20.jar, commons-io-2.6.jar,
commons-lang3-3.8.1.jar define 2 overlapping resources: 
[2020-05-16T04:34:31.266Z] [WARNING]   - META-INF/LICENSE.txt
[2020-05-16T04:34:31.266Z] [WARNING]   - META-INF/NOTICE.txt
[2020-05-16T04:34:31.266Z] [WARNING] maven-shade-plugin has detected that some class files
are
[2020-05-16T04:34:31.266Z] [WARNING] present in two or more JARs. When this happens, only
one
[2020-05-16T04:34:31.266Z] [WARNING] single version of the class is copied to the uber jar.
[2020-05-16T04:34:31.266Z] [WARNING] Usually this is not harmful and you can skip these warnings,
[2020-05-16T04:34:31.266Z] [WARNING] otherwise try to manually exclude artifacts based on
[2020-05-16T04:34:31.266Z] [WARNING] mvn dependency:tree -Ddetail=true and the above output.
[2020-05-16T04:34:31.266Z] [WARNING] See http://maven.apache.org/plugins/maven-shade-plugin/
[2020-05-16T04:34:31.266Z] [INFO] Replacing original artifact with shaded artifact.
[2020-05-16T04:34:31.266Z] [INFO] Replacing C:\Windows\System32\config\systemprofile\AppData\Local\Temp\jenkins-maven-box-maven-surefire-SUREFIRE-1570-8\surefire-shared-utils\target\surefire-shared-utils-3.0.0-SNAPSHOT.jar
with C:\Windows\System32\config\systemprofile\AppData\Local\Temp\jenkins-maven-box-maven-surefire-SUREFIRE-1570-8\surefire-shared-utils\target\surefire-shared-utils-3.0.0-SNAPSHOT-shaded.jar
[2020-05-16T04:34:31.266Z] [INFO] Dependency-reduced POM written at: C:\Windows\System32\config\systemprofile\AppData\Local\Temp\jenkins-maven-box-maven-surefire-SUREFIRE-1570-8\surefire-shared-utils\dependency-reduced-pom.xml
[2020-05-16T04:34:31.266Z] [INFO] 
[2020-05-16T04:34:31.266Z] [INFO] --- maven-checkstyle-plugin:3.0.0:check (checkstyle-check)
@ surefire-shared-utils ---
[2020-05-16T04:34:31.266Z] [INFO] 
[2020-05-16T04:34:31.266Z] [INFO] --- maven-install-plugin:2.5.2:install (default-install)
@ surefire-shared-utils ---
[2020-05-16T04:34:31.266Z] [INFO] Installing C:\Windows\System32\config\systemprofile\AppData\Local\Temp\jenkins-maven-box-maven-surefire-SUREFIRE-1570-8\surefire-shared-utils\target\surefire-shared-utils-3.0.0-SNAPSHOT.jar
to C:\Windows\system32\config\systemprofile\AppData\Local\Temp\jenkins-maven-box-maven-surefire-SUREFIRE-1570-8\.m2\org\apache\maven\surefire\surefire-shared-utils\3.0.0-SNAPSHOT\surefire-shared-utils-3.0.0-SNAPSHOT.jar
[2020-05-16T04:34:31.266Z] [INFO] Installing C:\Windows\System32\config\systemprofile\AppData\Local\Temp\jenkins-maven-box-maven-surefire-SUREFIRE-1570-8\surefire-shared-utils\dependency-reduced-pom.xml
to C:\Windows\system32\config\systemprofile\AppData\Local\Temp\jenkins-maven-box-maven-surefire-SUREFIRE-1570-8\.m2\org\apache\maven\surefire\surefire-shared-utils\3.0.0-SNAPSHOT\surefire-shared-utils-3.0.0-SNAPSHOT.pom
[2020-05-16T04:34:31.266Z] [INFO] ------------------------------------------------------------------------
[2020-05-16T04:34:31.266Z] [INFO] Reactor Summary for Apache Maven Surefire 3.0.0-SNAPSHOT:
[2020-05-16T04:34:31.266Z] [INFO] 
[2020-05-16T04:34:31.266Z] [INFO] Apache Maven Surefire .............................. SUCCESS
[01:09 min]
[2020-05-16T04:34:31.266Z] [INFO] SureFire Logger API ................................ SUCCESS
[ 20.229 s]
[2020-05-16T04:34:31.266Z] [INFO] SureFire API ....................................... SUCCESS
[ 23.924 s]
[2020-05-16T04:34:31.266Z] [INFO] Surefire Extensions API ............................ SUCCESS
[  7.252 s]
[2020-05-16T04:34:31.266Z] [INFO] Surefire Extensions SPI ............................ SUCCESS
[  2.275 s]
[2020-05-16T04:34:31.267Z] [INFO] SureFire Booter .................................... SUCCESS
[ 21.224 s]
[2020-05-16T04:34:31.267Z] [INFO] Maven Surefire Test-Grouping Support ............... SUCCESS
[ 10.001 s]
[2020-05-16T04:34:31.267Z] [INFO] SureFire Providers ................................. SUCCESS
[  0.746 s]
[2020-05-16T04:34:31.267Z] [INFO] Shared JUnit3 Provider Code ........................ SUCCESS
[  4.951 s]
[2020-05-16T04:34:31.267Z] [INFO] Shared Java 5 Provider Base ........................ SUCCESS
[  5.435 s]
[2020-05-16T04:34:31.267Z] [INFO] Shared JUnit4 Provider Code ........................ SUCCESS
[  6.091 s]
[2020-05-16T04:34:31.267Z] [INFO] Shared JUnit48 Provider Code ....................... SUCCESS
[ 12.946 s]
[2020-05-16T04:34:31.267Z] [INFO] SureFire JUnit Runner .............................. SUCCESS
[  4.938 s]
[2020-05-16T04:34:31.267Z] [INFO] SureFire JUnit4 Runner ............................. SUCCESS
[  5.056 s]
[2020-05-16T04:34:31.267Z] [INFO] Maven Surefire Common .............................. SUCCESS
[ 58.789 s]
[2020-05-16T04:34:31.267Z] [INFO] SureFire JUnitCore Runner .......................... SUCCESS
[02:23 min]
[2020-05-16T04:34:31.267Z] [INFO] SureFire JUnit Platform Runner ..................... SUCCESS
[ 11.659 s]
[2020-05-16T04:34:31.267Z] [INFO] SureFire TestNG Utils .............................. SUCCESS
[  5.308 s]
[2020-05-16T04:34:31.267Z] [INFO] SureFire TestNG Runner ............................. SUCCESS
[  6.905 s]
[2020-05-16T04:34:31.267Z] [INFO] ShadeFire JUnit3 Provider .......................... SUCCESS
[  2.312 s]
[2020-05-16T04:34:31.267Z] [INFO] Surefire Report Parser ............................. SUCCESS
[  7.612 s]
[2020-05-16T04:34:31.267Z] [INFO] Maven Surefire Plugin .............................. SUCCESS
[ 12.095 s]
[2020-05-16T04:34:31.267Z] [INFO] Maven Failsafe Plugin .............................. SUCCESS
[01:42 min]
[2020-05-16T04:34:31.267Z] [INFO] Maven Surefire Report Plugin ....................... SUCCESS
[ 19.616 s]
[2020-05-16T04:34:31.267Z] [INFO] Maven Surefire Integration Tests ................... SUCCESS
[  01:35 h]
[2020-05-16T04:34:31.267Z] [INFO] Surefire Shared Utils .............................. SUCCESS
[  2.306 s]
[2020-05-16T04:34:31.267Z] [INFO] ------------------------------------------------------------------------
[2020-05-16T04:34:31.267Z] [INFO] BUILD SUCCESS
[2020-05-16T04:34:31.267Z] [INFO] ------------------------------------------------------------------------
[2020-05-16T04:34:31.267Z] [INFO] Total time:  01:44 h
[2020-05-16T04:34:31.267Z] [INFO] Finished at: 2020-05-15T21:34:29-07:00
[2020-05-16T04:34:31.267Z] [INFO] ------------------------------------------------------------------------
[Pipeline] }
[Pipeline] // withEnv
[Pipeline] }
[Pipeline] // stage
[Pipeline] cleanWs
[2020-05-16T04:34:31.396Z] [WS-CLEANUP] Deleting project workspace...
[2020-05-16T04:34:31.396Z] [WS-CLEANUP] Deferred wipeout is used...
[2020-05-16T04:34:31.551Z] [WS-CLEANUP] done
[Pipeline] }
[Pipeline] // ws
[Pipeline] }
[Pipeline] // timestamps
[Pipeline] }
[Pipeline] // node
[Pipeline] }
[Pipeline] // parallel
[Pipeline] echo
hudson.AbortException: hudson.AbortException: Error cloning remote repo 'origin'
[Pipeline] echo
Build result: FAILURE
[Pipeline] jiraIssueSelector
[Pipeline] echo
The authors of changes [tibordigana].
[Pipeline] echo
Sending email ...
[Pipeline] emailext
Mime
  • Unnamed multipart/mixed (inline, None, 0 bytes)
View raw message