maven-notifications mailing list archives

Site index · List index
Message view « Date » · « Thread »
Top « Date » · « Thread »
From Apache Jenkins Server <jenk...@builds.apache.org>
Subject Build failed in Jenkins: Maven TLP » maven-surefire » SUREFIRE-1788 #3
Date Tue, 05 May 2020 19:48:56 GMT
See https://builds.apache.org/job/maven-box/job/maven-surefire/job/SUREFIRE-1788/3/

Changes:

* [SUREFIRE-1788] Unhandled native logs in SurefireForkChannel

All tests passed

Build log:
[...truncated 36003 lines...]
[2020-05-05T19:13:30.695Z] [INFO] Shared Java 5 Provider Base ........................ SUCCESS
[  5.760 s]
[2020-05-05T19:13:30.695Z] [INFO] Shared JUnit4 Provider Code ........................ SUCCESS
[  6.072 s]
[2020-05-05T19:13:30.695Z] [INFO] Shared JUnit48 Provider Code ....................... SUCCESS
[  9.299 s]
[2020-05-05T19:13:30.695Z] [INFO] SureFire JUnit Runner .............................. SUCCESS
[  4.765 s]
[2020-05-05T19:13:30.695Z] [INFO] SureFire JUnit4 Runner ............................. SUCCESS
[  4.994 s]
[2020-05-05T19:13:30.695Z] [INFO] Maven Surefire Common .............................. SUCCESS
[ 57.967 s]
[2020-05-05T19:13:30.695Z] [INFO] SureFire JUnitCore Runner .......................... SUCCESS
[02:15 min]
[2020-05-05T19:13:30.695Z] [INFO] SureFire JUnit Platform Runner ..................... SUCCESS
[ 12.584 s]
[2020-05-05T19:13:30.695Z] [INFO] SureFire TestNG Utils .............................. SUCCESS
[  5.278 s]
[2020-05-05T19:13:30.695Z] [INFO] SureFire TestNG Runner ............................. SUCCESS
[  7.935 s]
[2020-05-05T19:13:30.695Z] [INFO] ShadeFire JUnit3 Provider .......................... SUCCESS
[  2.283 s]
[2020-05-05T19:13:30.695Z] [INFO] Surefire Report Parser ............................. SUCCESS
[  7.179 s]
[2020-05-05T19:13:30.695Z] [INFO] Maven Surefire Plugin .............................. SUCCESS
[ 12.803 s]
[2020-05-05T19:13:30.695Z] [INFO] Maven Failsafe Plugin .............................. SUCCESS
[01:37 min]
[2020-05-05T19:13:30.695Z] [INFO] Maven Surefire Report Plugin ....................... SUCCESS
[ 19.616 s]
[2020-05-05T19:13:30.695Z] [INFO] Maven Surefire Integration Tests ................... FAILURE
[  01:29 h]
[2020-05-05T19:13:30.695Z] [INFO] Surefire Shared Utils .............................. SKIPPED
[2020-05-05T19:13:30.695Z] [INFO] ------------------------------------------------------------------------
[2020-05-05T19:13:30.695Z] [INFO] BUILD FAILURE
[2020-05-05T19:13:30.695Z] [INFO] ------------------------------------------------------------------------
[2020-05-05T19:13:30.695Z] [INFO] Total time:  01:38 h
[2020-05-05T19:13:30.695Z] [INFO] Finished at: 2020-05-05T12:13:28-07:00
[2020-05-05T19:13:30.695Z] [INFO] ------------------------------------------------------------------------
[2020-05-05T19:13:30.695Z] [ERROR] Failed to execute goal org.apache.maven.plugins:maven-failsafe-plugin:3.0.0-M4:verify
(default) on project surefire-its: There are test failures.
[2020-05-05T19:13:30.695Z] [ERROR] 
[2020-05-05T19:13:30.695Z] [ERROR] Please refer to C:\Users\jenkins\AppData\Local\Temp\2\jenkins-maven-box-maven-surefire-SUREFIRE-1788-3@2\surefire-its\target\failsafe-reports
for the individual test results.
[2020-05-05T19:13:30.695Z] [ERROR] Please refer to dump files (if any exist) [date].dump,
[date]-jvmRun[N].dump and [date].dumpstream.
[2020-05-05T19:13:30.695Z] [ERROR] -> [Help 1]
[2020-05-05T19:13:30.695Z] org.apache.maven.lifecycle.LifecycleExecutionException: Failed
to execute goal org.apache.maven.plugins:maven-failsafe-plugin:3.0.0-M4:verify (default) on
project surefire-its: There are test failures.
[2020-05-05T19:13:30.695Z] 
[2020-05-05T19:13:30.695Z] Please refer to C:\Users\jenkins\AppData\Local\Temp\2\jenkins-maven-box-maven-surefire-SUREFIRE-1788-3@2\surefire-its\target\failsafe-reports
for the individual test results.
[2020-05-05T19:13:30.696Z] Please refer to dump files (if any exist) [date].dump, [date]-jvmRun[N].dump
and [date].dumpstream.
[2020-05-05T19:13:30.696Z]     at org.apache.maven.lifecycle.internal.MojoExecutor.execute
(MojoExecutor.java:215)
[2020-05-05T19:13:30.696Z]     at org.apache.maven.lifecycle.internal.MojoExecutor.execute
(MojoExecutor.java:156)
[2020-05-05T19:13:30.696Z]     at org.apache.maven.lifecycle.internal.MojoExecutor.execute
(MojoExecutor.java:148)
[2020-05-05T19:13:30.696Z]     at org.apache.maven.lifecycle.internal.LifecycleModuleBuilder.buildProject
(LifecycleModuleBuilder.java:117)
[2020-05-05T19:13:30.696Z]     at org.apache.maven.lifecycle.internal.LifecycleModuleBuilder.buildProject
(LifecycleModuleBuilder.java:81)
[2020-05-05T19:13:30.696Z]     at org.apache.maven.lifecycle.internal.builder.singlethreaded.SingleThreadedBuilder.build
(SingleThreadedBuilder.java:56)
[2020-05-05T19:13:30.696Z]     at org.apache.maven.lifecycle.internal.LifecycleStarter.execute
(LifecycleStarter.java:128)
[2020-05-05T19:13:30.696Z]     at org.apache.maven.DefaultMaven.doExecute (DefaultMaven.java:305)
[2020-05-05T19:13:30.696Z]     at org.apache.maven.DefaultMaven.doExecute (DefaultMaven.java:192)
[2020-05-05T19:13:30.696Z]     at org.apache.maven.DefaultMaven.execute (DefaultMaven.java:105)
[2020-05-05T19:13:30.696Z]     at org.apache.maven.cli.MavenCli.execute (MavenCli.java:956)
[2020-05-05T19:13:30.696Z]     at org.apache.maven.cli.MavenCli.doMain (MavenCli.java:288)
[2020-05-05T19:13:30.696Z]     at org.apache.maven.cli.MavenCli.main (MavenCli.java:192)
[2020-05-05T19:13:30.696Z]     at sun.reflect.NativeMethodAccessorImpl.invoke0 (Native Method)
[2020-05-05T19:13:30.696Z]     at sun.reflect.NativeMethodAccessorImpl.invoke (NativeMethodAccessorImpl.java:62)
[2020-05-05T19:13:30.696Z]     at sun.reflect.DelegatingMethodAccessorImpl.invoke (DelegatingMethodAccessorImpl.java:43)
[2020-05-05T19:13:30.696Z]     at java.lang.reflect.Method.invoke (Method.java:498)
[2020-05-05T19:13:30.696Z]     at org.codehaus.plexus.classworlds.launcher.Launcher.launchEnhanced
(Launcher.java:282)
[2020-05-05T19:13:30.696Z]     at org.codehaus.plexus.classworlds.launcher.Launcher.launch
(Launcher.java:225)
[2020-05-05T19:13:30.696Z]     at org.codehaus.plexus.classworlds.launcher.Launcher.mainWithExitCode
(Launcher.java:406)
[2020-05-05T19:13:30.696Z]     at org.codehaus.plexus.classworlds.launcher.Launcher.main (Launcher.java:347)
[2020-05-05T19:13:30.696Z] Caused by: org.apache.maven.plugin.MojoFailureException: There
are test failures.
[2020-05-05T19:13:30.696Z] 
[2020-05-05T19:13:30.696Z] Please refer to C:\Users\jenkins\AppData\Local\Temp\2\jenkins-maven-box-maven-surefire-SUREFIRE-1788-3@2\surefire-its\target\failsafe-reports
for the individual test results.
[2020-05-05T19:13:30.696Z] Please refer to dump files (if any exist) [date].dump, [date]-jvmRun[N].dump
and [date].dumpstream.
[2020-05-05T19:13:30.696Z]     at org.apache.maven.plugin.surefire.SurefireHelper.throwException
(SurefireHelper.java:271)
[2020-05-05T19:13:30.696Z]     at org.apache.maven.plugin.surefire.SurefireHelper.reportExecution
(SurefireHelper.java:159)
[2020-05-05T19:13:30.696Z]     at org.apache.maven.plugin.failsafe.VerifyMojo.execute (VerifyMojo.java:192)
[2020-05-05T19:13:30.696Z]     at org.apache.maven.plugin.DefaultBuildPluginManager.executeMojo
(DefaultBuildPluginManager.java:137)
[2020-05-05T19:13:30.696Z]     at org.apache.maven.lifecycle.internal.MojoExecutor.execute
(MojoExecutor.java:210)
[2020-05-05T19:13:30.696Z]     at org.apache.maven.lifecycle.internal.MojoExecutor.execute
(MojoExecutor.java:156)
[2020-05-05T19:13:30.696Z]     at org.apache.maven.lifecycle.internal.MojoExecutor.execute
(MojoExecutor.java:148)
[2020-05-05T19:13:30.696Z]     at org.apache.maven.lifecycle.internal.LifecycleModuleBuilder.buildProject
(LifecycleModuleBuilder.java:117)
[2020-05-05T19:13:30.696Z]     at org.apache.maven.lifecycle.internal.LifecycleModuleBuilder.buildProject
(LifecycleModuleBuilder.java:81)
[2020-05-05T19:13:30.696Z]     at org.apache.maven.lifecycle.internal.builder.singlethreaded.SingleThreadedBuilder.build
(SingleThreadedBuilder.java:56)
[2020-05-05T19:13:30.696Z]     at org.apache.maven.lifecycle.internal.LifecycleStarter.execute
(LifecycleStarter.java:128)
[2020-05-05T19:13:30.696Z]     at org.apache.maven.DefaultMaven.doExecute (DefaultMaven.java:305)
[2020-05-05T19:13:30.696Z]     at org.apache.maven.DefaultMaven.doExecute (DefaultMaven.java:192)
[2020-05-05T19:13:30.696Z]     at org.apache.maven.DefaultMaven.execute (DefaultMaven.java:105)
[2020-05-05T19:13:30.696Z]     at org.apache.maven.cli.MavenCli.execute (MavenCli.java:956)
[2020-05-05T19:13:30.696Z]     at org.apache.maven.cli.MavenCli.doMain (MavenCli.java:288)
[2020-05-05T19:13:30.696Z]     at org.apache.maven.cli.MavenCli.main (MavenCli.java:192)
[2020-05-05T19:13:30.696Z]     at sun.reflect.NativeMethodAccessorImpl.invoke0 (Native Method)
[2020-05-05T19:13:30.696Z]     at sun.reflect.NativeMethodAccessorImpl.invoke (NativeMethodAccessorImpl.java:62)
[2020-05-05T19:13:30.696Z]     at sun.reflect.DelegatingMethodAccessorImpl.invoke (DelegatingMethodAccessorImpl.java:43)
[2020-05-05T19:13:30.696Z]     at java.lang.reflect.Method.invoke (Method.java:498)
[2020-05-05T19:13:30.696Z]     at org.codehaus.plexus.classworlds.launcher.Launcher.launchEnhanced
(Launcher.java:282)
[2020-05-05T19:13:30.696Z]     at org.codehaus.plexus.classworlds.launcher.Launcher.launch
(Launcher.java:225)
[2020-05-05T19:13:30.696Z]     at org.codehaus.plexus.classworlds.launcher.Launcher.mainWithExitCode
(Launcher.java:406)
[2020-05-05T19:13:30.696Z]     at org.codehaus.plexus.classworlds.launcher.Launcher.main (Launcher.java:347)
[2020-05-05T19:13:30.696Z] [ERROR] 
[2020-05-05T19:13:30.696Z] [ERROR] Re-run Maven using the -X switch to enable full debug logging.
[2020-05-05T19:13:30.696Z] [ERROR] 
[2020-05-05T19:13:30.696Z] [ERROR] For more information about the errors and possible solutions,
please read the following articles:
[2020-05-05T19:13:30.696Z] [ERROR] [Help 1] http://cwiki.apache.org/confluence/display/MAVEN/MojoFailureException
[2020-05-05T19:13:30.696Z] [ERROR] 
[2020-05-05T19:13:30.696Z] [ERROR] After correcting the problems, you can resume the build
with the command
[2020-05-05T19:13:30.696Z] [ERROR]   mvn <args> -rf :surefire-its
[Pipeline] }
[Pipeline] // withEnv
[Pipeline] }
[Pipeline] // stage
[Pipeline] fileExists
[Pipeline] zip
[2020-05-05T19:13:30.919Z] Writing zip file of C:\Users\jenkins\AppData\Local\Temp\2\jenkins-maven-box-maven-surefire-SUREFIRE-1788-3@2\maven-failsafe-plugin\target\it
to C:\Users\jenkins\AppData\Local\Temp\2\jenkins-maven-box-maven-surefire-SUREFIRE-1788-3@2\maven-failsafe-plugin--windows-jdk14-maven3.6.x.zip
[2020-05-05T19:13:31.178Z] Zipped 78 entries.
[2020-05-05T19:13:31.178Z] Archiving C:\Users\jenkins\AppData\Local\Temp\2\jenkins-maven-box-maven-surefire-SUREFIRE-1788-3@2\maven-failsafe-plugin--windows-jdk14-maven3.6.x.zip
[2020-05-05T19:13:31.179Z] [Fast Archiver] No artifacts from Maven TLP » maven-surefire »
SUREFIRE-1788 #2 to compare, so performing full copy of artifacts
[Pipeline] fileExists
[Pipeline] zip
[2020-05-05T19:13:31.273Z] Writing zip file of C:\Users\jenkins\AppData\Local\Temp\2\jenkins-maven-box-maven-surefire-SUREFIRE-1788-3@2\surefire-its\target
to C:\Users\jenkins\AppData\Local\Temp\2\jenkins-maven-box-maven-surefire-SUREFIRE-1788-3@2\surefire-its--windows-jdk14-maven3.6.x.zip
[Pipeline] archiveArtifacts
[2020-05-05T19:13:31.642Z] Archiving artifacts
[2020-05-05T19:13:31.655Z] [Fast Archiver] No artifacts from Maven TLP » maven-surefire »
SUREFIRE-1788 #2 to compare, so performing full copy of artifacts
[Pipeline] cleanWs
[2020-05-05T19:13:33.251Z] [WS-CLEANUP] Deleting project workspace...
[2020-05-05T19:13:33.251Z] [WS-CLEANUP] Deferred wipeout is used...
[2020-05-05T19:13:33.393Z] [WS-CLEANUP] done
[Pipeline] }
[Pipeline] // ws
[Pipeline] }
[Pipeline] // timestamps
[Pipeline] }
[Pipeline] // node
[Pipeline] }
[2020-05-05T19:14:10.818Z] Zipped 18706 entries.
[2020-05-05T19:14:10.818Z] Archiving C:\Users\jenkins\AppData\Local\Temp\2\jenkins-maven-box-maven-surefire-SUREFIRE-1788-3\surefire-its--windows-jdk11-maven3.6.x.zip
[2020-05-05T19:14:10.819Z] [Fast Archiver] No artifacts from Maven TLP » maven-surefire »
SUREFIRE-1788 #2 to compare, so performing full copy of artifacts
[Pipeline] archiveArtifacts
[2020-05-05T19:14:12.401Z] Archiving artifacts
[2020-05-05T19:14:12.461Z] [Fast Archiver] No artifacts from Maven TLP » maven-surefire »
SUREFIRE-1788 #2 to compare, so performing full copy of artifacts
[Pipeline] cleanWs
[2020-05-05T19:14:14.350Z] [WS-CLEANUP] Deleting project workspace...
[2020-05-05T19:14:14.350Z] [WS-CLEANUP] Deferred wipeout is used...
[2020-05-05T19:14:14.490Z] [WS-CLEANUP] done
[Pipeline] }
[Pipeline] // ws
[Pipeline] }
[Pipeline] // timestamps
[Pipeline] }
[Pipeline] // node
[Pipeline] }
[2020-05-05T19:14:24.061Z] Zipped 18695 entries.
[2020-05-05T19:14:24.061Z] Archiving C:\Users\jenkins\AppData\Local\Temp\2\jenkins-maven-box-maven-surefire-SUREFIRE-1788-3@2\surefire-its--windows-jdk14-maven3.6.x.zip
[2020-05-05T19:14:24.063Z] [Fast Archiver] No artifacts from Maven TLP » maven-surefire »
SUREFIRE-1788 #2 to compare, so performing full copy of artifacts
[Pipeline] archiveArtifacts
[2020-05-05T19:14:25.243Z] Archiving artifacts
[2020-05-05T19:14:25.269Z] [Fast Archiver] No artifacts from Maven TLP » maven-surefire »
SUREFIRE-1788 #2 to compare, so performing full copy of artifacts
[Pipeline] cleanWs
[2020-05-05T19:14:26.672Z] [WS-CLEANUP] Deleting project workspace...
[2020-05-05T19:14:26.672Z] [WS-CLEANUP] Deferred wipeout is used...
[2020-05-05T19:14:26.812Z] [WS-CLEANUP] done
[Pipeline] }
[Pipeline] // ws
[Pipeline] }
[Pipeline] // timestamps
[Pipeline] }
[Pipeline] // node
[Pipeline] }
Aborted by tibordigana
[2020-05-05T19:48:31.979Z] Sending interrupt signal to process
[2020-05-05T19:48:34.061Z] Sending interrupt signal to process
[2020-05-05T19:48:37.572Z] [INFO] 
[2020-05-05T19:48:37.572Z] [INFO] Results:
[2020-05-05T19:48:37.572Z] [INFO] 
[2020-05-05T19:48:37.572Z] [INFO] Tests run: 26, Failures: 0, Errors: 0, Skipped: 0
[2020-05-05T19:48:37.572Z] [INFO] 
[2020-05-05T19:48:37.572Z] [INFO] 
[2020-05-05T19:48:37.572Z] [INFO] --- maven-checkstyle-plugin:3.0.0:check (checkstyle-check)
@ surefire-its ---
[2020-05-05T19:48:37.921Z] script returned exit code 143
[Pipeline] }
[Pipeline] // withEnv
[Pipeline] }
[Pipeline] // stage
[Pipeline] fileExists
[Pipeline] zip
[2020-05-05T19:48:38.699Z] Writing zip file of /home/jenkins/jenkins-slave/workspace/box_maven-surefire_SUREFIRE-1788@2/maven-failsafe-plugin/target/it
to /home/jenkins/jenkins-slave/workspace/box_maven-surefire_SUREFIRE-1788@2/maven-failsafe-plugin--linux-jdk8-maven3.6.x.zip
[2020-05-05T19:48:38.885Z] Zipped 78 entries.
[2020-05-05T19:48:38.885Z] Archiving /home/jenkins/jenkins-slave/workspace/box_maven-surefire_SUREFIRE-1788@2/maven-failsafe-plugin--linux-jdk8-maven3.6.x.zip
[2020-05-05T19:48:38.886Z] [Fast Archiver] No artifacts from Maven TLP » maven-surefire »
SUREFIRE-1788 #2 to compare, so performing full copy of artifacts
[Pipeline] fileExists
[Pipeline] zip
[2020-05-05T19:48:40.042Z] Writing zip file of /home/jenkins/jenkins-slave/workspace/box_maven-surefire_SUREFIRE-1788@2/surefire-its/target
to /home/jenkins/jenkins-slave/workspace/box_maven-surefire_SUREFIRE-1788@2/surefire-its--linux-jdk8-maven3.6.x.zip
[2020-05-05T19:48:41.264Z] Zipped 2417 entries.
[2020-05-05T19:48:41.264Z] Archiving /home/jenkins/jenkins-slave/workspace/box_maven-surefire_SUREFIRE-1788@2/surefire-its--linux-jdk8-maven3.6.x.zip
[2020-05-05T19:48:41.265Z] [Fast Archiver] No artifacts from Maven TLP » maven-surefire »
SUREFIRE-1788 #2 to compare, so performing full copy of artifacts
[Pipeline] archiveArtifacts
[2020-05-05T19:48:42.886Z] Archiving artifacts
[2020-05-05T19:48:43.043Z] [Fast Archiver] No artifacts from Maven TLP » maven-surefire »
SUREFIRE-1788 #2 to compare, so performing full copy of artifacts
[Pipeline] cleanWs
[2020-05-05T19:48:43.942Z] [WS-CLEANUP] Deleting project workspace...
[2020-05-05T19:48:43.942Z] [WS-CLEANUP] Deferred wipeout is used...
[2020-05-05T19:48:44.283Z] [WS-CLEANUP] done
[Pipeline] }
[Pipeline] // ws
[Pipeline] }
[Pipeline] // timestamps
[Pipeline] }
[Pipeline] // node
[Pipeline] }
Failed in branch linux-jdk8-maven3.6.x
Click here to forcibly terminate running steps
[2020-05-05T19:48:48.549Z] [INFO] 
[2020-05-05T19:48:48.549Z] [INFO] Results:
[2020-05-05T19:48:48.549Z] [INFO] 
[2020-05-05T19:48:48.549Z] [INFO] Tests run: 26, Failures: 0, Errors: 0, Skipped: 0
[2020-05-05T19:48:48.549Z] [INFO] 
[2020-05-05T19:48:48.549Z] [INFO] 
[2020-05-05T19:48:48.549Z] [INFO] --- maven-checkstyle-plugin:3.0.0:check (checkstyle-check)
@ surefire-its ---
[2020-05-05T19:48:48.855Z] script returned exit code 143
[Pipeline] }
[Pipeline] // withEnv
[Pipeline] }
[Pipeline] // stage
[Pipeline] openTasks
[2020-05-05T19:48:49.154Z] [TASKS] Skipping publisher since build result is FAILURE
[Pipeline] jacoco
[Pipeline] junit
[2020-05-05T19:48:49.514Z] Recording test results
[Pipeline] fileExists
[Pipeline] zip
[2020-05-05T19:48:51.298Z] Writing zip file of /home/jenkins/jenkins-slave/workspace/box_maven-surefire_SUREFIRE-1788@2/maven-failsafe-plugin/target/it
to /home/jenkins/jenkins-slave/workspace/box_maven-surefire_SUREFIRE-1788@2/maven-failsafe-plugin--linux-jdk15-maven3.6.x.zip
[2020-05-05T19:48:51.470Z] Zipped 78 entries.
[2020-05-05T19:48:51.470Z] Archiving /home/jenkins/jenkins-slave/workspace/box_maven-surefire_SUREFIRE-1788@2/maven-failsafe-plugin--linux-jdk15-maven3.6.x.zip
[2020-05-05T19:48:51.471Z] [Fast Archiver] No artifacts from Maven TLP » maven-surefire »
SUREFIRE-1788 #2 to compare, so performing full copy of artifacts
[Pipeline] fileExists
[Pipeline] zip
[2020-05-05T19:48:52.406Z] Writing zip file of /home/jenkins/jenkins-slave/workspace/box_maven-surefire_SUREFIRE-1788@2/surefire-its/target
to /home/jenkins/jenkins-slave/workspace/box_maven-surefire_SUREFIRE-1788@2/surefire-its--linux-jdk15-maven3.6.x.zip
[2020-05-05T19:48:53.165Z] Zipped 2445 entries.
[2020-05-05T19:48:53.165Z] Archiving /home/jenkins/jenkins-slave/workspace/box_maven-surefire_SUREFIRE-1788@2/surefire-its--linux-jdk15-maven3.6.x.zip
[2020-05-05T19:48:53.166Z] [Fast Archiver] No artifacts from Maven TLP » maven-surefire »
SUREFIRE-1788 #2 to compare, so performing full copy of artifacts
[Pipeline] archiveArtifacts
[2020-05-05T19:48:54.433Z] Archiving artifacts
[2020-05-05T19:48:54.588Z] [Fast Archiver] No artifacts from Maven TLP » maven-surefire »
SUREFIRE-1788 #2 to compare, so performing full copy of artifacts
[Pipeline] cleanWs
[2020-05-05T19:48:55.554Z] [WS-CLEANUP] Deleting project workspace...
[2020-05-05T19:48:55.554Z] [WS-CLEANUP] Deferred wipeout is used...
[2020-05-05T19:48:55.863Z] [WS-CLEANUP] done
[Pipeline] }
[Pipeline] // ws
[Pipeline] }
[Pipeline] // timestamps
[Pipeline] }
[Pipeline] // node
[Pipeline] }
Failed in branch linux-jdk15-maven3.6.x
[Pipeline] // parallel
[Pipeline] echo
org.jenkinsci.plugins.workflow.steps.FlowInterruptedException: org.jenkinsci.plugins.workflow.steps.FlowInterruptedException
[Pipeline] echo
Build result: FAILURE
[Pipeline] jiraIssueSelector
[Pipeline] echo
The authors of changes [tibordigana].
[Pipeline] echo
Sending email ...
[Pipeline] emailext
Mime
  • Unnamed multipart/mixed (inline, None, 0 bytes)
View raw message