maven-notifications mailing list archives

Site index · List index
Message view « Date » · « Thread »
Top « Date » · « Thread »
From Apache Jenkins Server <jenk...@builds.apache.org>
Subject Build failed in Jenkins: Maven TLP » maven » MNG-5937 #2
Date Sat, 02 May 2020 13:47:13 GMT
See https://builds.apache.org/job/maven-box/job/maven/job/MNG-5937/2/

Changes:

* [MNG-5937] Adjust Jenkins file

All tests passed

Build log:
[...truncated 4660 lines...]
[INFO] ---------------< org.apache.maven:apache-maven-wrapper >----------------
[INFO] Building Apache Maven Wrapper Distribution 3.7.0-SNAPSHOT        [18/18]
[INFO] --------------------------------[ pom ]---------------------------------
[WARNING] [jenkins-event-spy] Unexpected Maven project file name 'maven-wrapper.pom', problems
may occur
[WARNING] [jenkins-event-spy] Unexpected Maven project file name 'maven-wrapper.pom', problems
may occur
[INFO] 
[INFO] --- maven-enforcer-plugin:1.4.1:enforce (enforce-maven-version) @ apache-maven-wrapper
---
[WARNING] [jenkins-event-spy] Unexpected Maven project file name 'maven-wrapper.pom', problems
may occur
[WARNING] [jenkins-event-spy] Unexpected Maven project file name 'maven-wrapper.pom', problems
may occur
[INFO] 
[INFO] --- maven-enforcer-plugin:1.4.1:enforce (enforce-bytecode-version) @ apache-maven-wrapper
---
[INFO] Adding ignore: module-info
[WARNING] [jenkins-event-spy] Unexpected Maven project file name 'maven-wrapper.pom', problems
may occur
[WARNING] [jenkins-event-spy] Unexpected Maven project file name 'maven-wrapper.pom', problems
may occur
[INFO] 
[INFO] --- maven-enforcer-plugin:1.4.1:enforce (ensure-no-org.sonatype:plexus-cipher) @ apache-maven-wrapper
---
[WARNING] [jenkins-event-spy] Unexpected Maven project file name 'maven-wrapper.pom', problems
may occur
[WARNING] [jenkins-event-spy] Unexpected Maven project file name 'maven-wrapper.pom', problems
may occur
[INFO] 
[INFO] --- apache-rat-plugin:0.13:check (rat-check) @ apache-maven-wrapper ---
[INFO] Enabled default license matchers.
[INFO] Will parse SCM ignores for exclusions...
[INFO] Finished adding exclusions from SCM ignore files.
[INFO] 62 implicit excludes (use -debug for more details).
[INFO] 15 explicit excludes (use -debug for more details).
[INFO] 25 resources included (use -debug for more details)
[INFO] Rat check: Summary over all files. Unapproved: 0, unknown: 0, generated: 0, approved:
25 licenses.
[WARNING] [jenkins-event-spy] Unexpected Maven project file name 'maven-wrapper.pom', problems
may occur
[WARNING] [jenkins-event-spy] Unexpected Maven project file name 'maven-wrapper.pom', problems
may occur
[INFO] 
[INFO] --- maven-remote-resources-plugin:1.7.0:process (process-resource-bundles) @ apache-maven-wrapper
---
[INFO] Preparing remote bundle org.apache:apache-jar-resource-bundle:1.4
[INFO] Copying 3 resources from 1 bundle.
[WARNING] [jenkins-event-spy] Unexpected Maven project file name 'maven-wrapper.pom', problems
may occur
[WARNING] [jenkins-event-spy] Unexpected Maven project file name 'maven-wrapper.pom', problems
may occur
[INFO] 
[INFO] --- animal-sniffer-maven-plugin:1.18:check (check-java-compat) @ apache-maven-wrapper
---
[INFO] Checking unresolved references to org.codehaus.mojo.signature:java18:1.0
[WARNING] [jenkins-event-spy] Unexpected Maven project file name 'maven-wrapper.pom', problems
may occur
[WARNING] [jenkins-event-spy] Unexpected Maven project file name 'maven-wrapper.pom', problems
may occur
[INFO] 
[INFO] --- maven-site-plugin:3.7.1:attach-descriptor (attach-descriptor) @ apache-maven-wrapper
---
[INFO] No site descriptor found: nothing to attach.
[WARNING] [jenkins-event-spy] Unexpected Maven project file name 'maven-wrapper.pom', problems
may occur
[WARNING] [jenkins-event-spy] Unexpected Maven project file name 'maven-wrapper.pom', problems
may occur
[INFO] 
[INFO] --- maven-assembly-plugin:3.2.0:single (default) @ apache-maven-wrapper ---
[INFO] Reading assembly descriptor: src/assembly/script.xml
[INFO] Reading assembly descriptor: src/assembly/bin.xml
[INFO] Reading assembly descriptor: src/assembly/source.xml
[INFO] Building tar: /home/jenkins/jenkins-slave/workspace/maven-box_maven_MNG-5937/build/maven-wrapper/target/apache-maven-wrapper-3.7.0-SNAPSHOT-script.tar.gz
[INFO] Building zip: /home/jenkins/jenkins-slave/workspace/maven-box_maven_MNG-5937/build/maven-wrapper/target/apache-maven-wrapper-3.7.0-SNAPSHOT-script.zip
[INFO] Building tar: /home/jenkins/jenkins-slave/workspace/maven-box_maven_MNG-5937/build/maven-wrapper/target/apache-maven-wrapper-3.7.0-SNAPSHOT-bin.tar.gz
[INFO] Building zip: /home/jenkins/jenkins-slave/workspace/maven-box_maven_MNG-5937/build/maven-wrapper/target/apache-maven-wrapper-3.7.0-SNAPSHOT-bin.zip
[INFO] Building tar: /home/jenkins/jenkins-slave/workspace/maven-box_maven_MNG-5937/build/maven-wrapper/target/apache-maven-wrapper-3.7.0-SNAPSHOT-source.tar.gz
[INFO] Building zip: /home/jenkins/jenkins-slave/workspace/maven-box_maven_MNG-5937/build/maven-wrapper/target/apache-maven-wrapper-3.7.0-SNAPSHOT-source.zip
[WARNING] [jenkins-event-spy] Unexpected Maven project file name 'maven-wrapper.pom', problems
may occur
[WARNING] [jenkins-event-spy] Unexpected Maven project file name 'maven-wrapper.pom', problems
may occur
[INFO] 
[INFO] --- maven-checkstyle-plugin:3.0.0:check (checkstyle-check) @ apache-maven-wrapper ---
[WARNING] [jenkins-event-spy] Unexpected Maven project file name 'maven-wrapper.pom', problems
may occur
[WARNING] [jenkins-event-spy] Unexpected Maven project file name 'maven-wrapper.pom', problems
may occur
[INFO] ------------------------------------------------------------------------
[INFO] Reactor Summary for Apache Maven 3.7.0-SNAPSHOT:
[INFO] 
[INFO] Apache Maven ....................................... SUCCESS [ 17.455 s]
[INFO] Maven Model ........................................ SUCCESS [ 11.831 s]
[INFO] Maven Artifact ..................................... SUCCESS [  6.079 s]
[INFO] Maven Plugin API ................................... SUCCESS [  4.631 s]
[INFO] Maven Builder Support .............................. SUCCESS [  2.682 s]
[INFO] Maven Model Builder ................................ SUCCESS [  9.780 s]
[INFO] Maven Settings ..................................... SUCCESS [  2.266 s]
[INFO] Maven Settings Builder ............................. SUCCESS [  3.338 s]
[INFO] Maven Repository Metadata Model .................... SUCCESS [  1.826 s]
[INFO] Maven Artifact Resolver Provider ................... SUCCESS [  9.906 s]
[INFO] Maven Core ......................................... SUCCESS [ 38.055 s]
[INFO] Maven SLF4J Wrapper ................................ SUCCESS [  2.575 s]
[INFO] Maven SLF4J Simple Provider ........................ SUCCESS [  3.986 s]
[INFO] Maven Embedder ..................................... SUCCESS [  9.341 s]
[INFO] Maven Compat ....................................... SUCCESS [ 23.688 s]
[INFO] Apache Maven Distribution .......................... SUCCESS [ 12.271 s]
[INFO] Maven Wrapper ...................................... SUCCESS [  4.884 s]
[INFO] Apache Maven Wrapper Distribution .................. SUCCESS [  2.001 s]
[INFO] ------------------------------------------------------------------------
[INFO] BUILD SUCCESS
[INFO] ------------------------------------------------------------------------
[INFO] Total time:  02:47 min
[INFO] Finished at: 2020-05-02T13:43:37Z
[INFO] ------------------------------------------------------------------------
[WARNING] [jenkins-event-spy] Unexpected Maven project file name 'maven-wrapper.pom', problems
may occur
[INFO] [jenkins-event-spy] Generated /home/jenkins/jenkins-slave/workspace/maven-box_maven_MNG-5937/build@tmp/withMaven6af2bdcc/maven-spy-20200502-134050-503588872062845605843.log
[Pipeline] }
[withMaven] artifactsPublisher - Archive artifact pom.xml under org/apache/maven/maven/3.7.0-SNAPSHOT/maven-3.7.0-SNAPSHOT.pom
[withMaven] artifactsPublisher - Archive artifact maven-model/pom.xml under org/apache/maven/maven-model/3.7.0-SNAPSHOT/maven-model-3.7.0-SNAPSHOT.pom
[withMaven] artifactsPublisher - Archive artifact maven-artifact/pom.xml under org/apache/maven/maven-artifact/3.7.0-SNAPSHOT/maven-artifact-3.7.0-SNAPSHOT.pom
[withMaven] artifactsPublisher - Archive artifact maven-plugin-api/pom.xml under org/apache/maven/maven-plugin-api/3.7.0-SNAPSHOT/maven-plugin-api-3.7.0-SNAPSHOT.pom
[withMaven] artifactsPublisher - Archive artifact maven-builder-support/pom.xml under org/apache/maven/maven-builder-support/3.7.0-SNAPSHOT/maven-builder-support-3.7.0-SNAPSHOT.pom
[withMaven] artifactsPublisher - Archive artifact maven-model-builder/pom.xml under org/apache/maven/maven-model-builder/3.7.0-SNAPSHOT/maven-model-builder-3.7.0-SNAPSHOT.pom
[withMaven] artifactsPublisher - Archive artifact maven-settings/pom.xml under org/apache/maven/maven-settings/3.7.0-SNAPSHOT/maven-settings-3.7.0-SNAPSHOT.pom
[withMaven] artifactsPublisher - Archive artifact maven-settings-builder/pom.xml under org/apache/maven/maven-settings-builder/3.7.0-SNAPSHOT/maven-settings-builder-3.7.0-SNAPSHOT.pom
[withMaven] artifactsPublisher - Archive artifact maven-repository-metadata/pom.xml under
org/apache/maven/maven-repository-metadata/3.7.0-SNAPSHOT/maven-repository-metadata-3.7.0-SNAPSHOT.pom
[withMaven] artifactsPublisher - Archive artifact maven-resolver-provider/pom.xml under org/apache/maven/maven-resolver-provider/3.7.0-SNAPSHOT/maven-resolver-provider-3.7.0-SNAPSHOT.pom
[withMaven] artifactsPublisher - Archive artifact maven-core/pom.xml under org/apache/maven/maven-core/3.7.0-SNAPSHOT/maven-core-3.7.0-SNAPSHOT.pom
[withMaven] artifactsPublisher - Archive artifact maven-slf4j-wrapper/pom.xml under org/apache/maven/maven-slf4j-wrapper/3.7.0-SNAPSHOT/maven-slf4j-wrapper-3.7.0-SNAPSHOT.pom
[withMaven] artifactsPublisher - Archive artifact maven-slf4j-provider/pom.xml under org/apache/maven/maven-slf4j-provider/3.7.0-SNAPSHOT/maven-slf4j-provider-3.7.0-SNAPSHOT.pom
[withMaven] artifactsPublisher - Archive artifact maven-embedder/pom.xml under org/apache/maven/maven-embedder/3.7.0-SNAPSHOT/maven-embedder-3.7.0-SNAPSHOT.pom
[withMaven] artifactsPublisher - Archive artifact maven-compat/pom.xml under org/apache/maven/maven-compat/3.7.0-SNAPSHOT/maven-compat-3.7.0-SNAPSHOT.pom
[withMaven] artifactsPublisher - Archive artifact apache-maven/pom.xml under org/apache/maven/apache-maven/3.7.0-SNAPSHOT/apache-maven-3.7.0-SNAPSHOT.pom
[withMaven] artifactsPublisher - Archive artifact maven-wrapper/pom.xml under org/apache/maven/maven-wrapper/3.7.0-SNAPSHOT/maven-wrapper-3.7.0-SNAPSHOT.pom
[withMaven] artifactsPublisher - Archive artifact maven-wrapper/maven-wrapper.pom under org/apache/maven/apache-maven-wrapper/3.7.0-SNAPSHOT/apache-maven-wrapper-3.7.0-SNAPSHOT.pom
[Fast Archiver] No prior successful build to compare, so performing full copy of artifacts
[withMaven] openTasksPublisher - Scan Tasks for Maven artifact org.apache.maven:maven-model:jar:3.7.0-SNAPSHOT
in source directory maven-model/src/main/java
[withMaven] openTasksPublisher - Scan Tasks for Maven artifact org.apache.maven:maven-artifact:jar:3.7.0-SNAPSHOT
in source directory maven-artifact/src/main/java
[withMaven] openTasksPublisher - Scan Tasks for Maven artifact org.apache.maven:maven-plugin-api:jar:3.7.0-SNAPSHOT
in source directory maven-plugin-api/src/main/java
[withMaven] openTasksPublisher - Scan Tasks for Maven artifact org.apache.maven:maven-builder-support:jar:3.7.0-SNAPSHOT
in source directory maven-builder-support/src/main/java
[withMaven] openTasksPublisher - Scan Tasks for Maven artifact org.apache.maven:maven-model-builder:jar:3.7.0-SNAPSHOT
in source directory maven-model-builder/src/main/java
[withMaven] openTasksPublisher - Scan Tasks for Maven artifact org.apache.maven:maven-settings:jar:3.7.0-SNAPSHOT
in source directory maven-settings/src/main/java
[withMaven] openTasksPublisher - Scan Tasks for Maven artifact org.apache.maven:maven-settings-builder:jar:3.7.0-SNAPSHOT
in source directory maven-settings-builder/src/main/java
[withMaven] openTasksPublisher - Scan Tasks for Maven artifact org.apache.maven:maven-resolver-provider:jar:3.7.0-SNAPSHOT
in source directory maven-resolver-provider/src/main/java
[withMaven] openTasksPublisher - Scan Tasks for Maven artifact org.apache.maven:maven-core:jar:3.7.0-SNAPSHOT
in source directory maven-core/src/main/java
[withMaven] openTasksPublisher - Scan Tasks for Maven artifact org.apache.maven:maven-slf4j-wrapper:jar:3.7.0-SNAPSHOT
in source directory maven-slf4j-wrapper/src/main/java
[withMaven] openTasksPublisher - Scan Tasks for Maven artifact org.apache.maven:maven-slf4j-provider:jar:3.7.0-SNAPSHOT
in source directory maven-slf4j-provider/src/main/java
[withMaven] openTasksPublisher - Scan Tasks for Maven artifact org.apache.maven:maven-embedder:jar:3.7.0-SNAPSHOT
in source directory maven-embedder/src/main/java
[withMaven] openTasksPublisher - Scan Tasks for Maven artifact org.apache.maven:maven-compat:jar:3.7.0-SNAPSHOT
in source directory maven-compat/src/main/java
[withMaven] openTasksPublisher - Scan Tasks for Maven artifact org.apache.maven:maven-wrapper:jar:3.7.0-SNAPSHOT
in source directory maven-wrapper/src/main/java
[withMaven] openTasksPublisher - Scan Tasks for Maven artifact org.apache.maven:apache-maven-wrapper:pom:3.7.0-SNAPSHOT
in source directory maven-wrapper/src/main/java
[TASKS] Scanning folder '/home/jenkins/jenkins-slave/workspace/maven-box_maven_MNG-5937/build'
for files matching the pattern 'maven-model/src/main/java/**/*,maven-artifact/src/main/java/**/*,maven-plugin-api/src/main/java/**/*,maven-builder-support/src/main/java/**/*,maven-model-builder/src/main/java/**/*,maven-settings/src/main/java/**/*,maven-settings-builder/src/main/java/**/*,maven-resolver-provider/src/main/java/**/*,maven-core/src/main/java/**/*,maven-slf4j-wrapper/src/main/java/**/*,maven-slf4j-provider/src/main/java/**/*,maven-embedder/src/main/java/**/*,maven-compat/src/main/java/**/*,maven-wrapper/src/main/java/**/*,maven-wrapper/src/main/java/**/*'
- excludes: null
[TASKS] Found 718 files to scan for tasks
[TASKS] Found 159 open tasks.
Skipping warnings blame since pipelines do not have an SCM link.%n
[withMaven] Publishers: Pipeline Graph Publisher: 9 ms, Generated Artifacts Publisher: 8817
ms, Open Task Scanner Publisher: 22344 ms
[withMaven] artifactsPublisher - Archive artifact pom.xml under org/apache/maven/maven/3.7.0-SNAPSHOT/maven-3.7.0-SNAPSHOT.pom
[withMaven] artifactsPublisher - Archive artifact target/maven-3.7.0-SNAPSHOT-site.xml under
org/apache/maven/maven/3.7.0-SNAPSHOT/maven-3.7.0-SNAPSHOT-site.xml
[withMaven] artifactsPublisher - Archive artifact maven-model/pom.xml under org/apache/maven/maven-model/3.7.0-SNAPSHOT/maven-model-3.7.0-SNAPSHOT.pom
[withMaven] artifactsPublisher - Archive artifact maven-model/target/maven-model-3.7.0-SNAPSHOT.jar
under org/apache/maven/maven-model/3.7.0-SNAPSHOT/maven-model-3.7.0-SNAPSHOT.jar
[withMaven] artifactsPublisher - Archive artifact maven-artifact/pom.xml under org/apache/maven/maven-artifact/3.7.0-SNAPSHOT/maven-artifact-3.7.0-SNAPSHOT.pom
[withMaven] artifactsPublisher - Archive artifact maven-artifact/target/maven-artifact-3.7.0-SNAPSHOT.jar
under org/apache/maven/maven-artifact/3.7.0-SNAPSHOT/maven-artifact-3.7.0-SNAPSHOT.jar
[withMaven] artifactsPublisher - Archive artifact maven-plugin-api/pom.xml under org/apache/maven/maven-plugin-api/3.7.0-SNAPSHOT/maven-plugin-api-3.7.0-SNAPSHOT.pom
[withMaven] artifactsPublisher - Archive artifact maven-plugin-api/target/maven-plugin-api-3.7.0-SNAPSHOT.jar
under org/apache/maven/maven-plugin-api/3.7.0-SNAPSHOT/maven-plugin-api-3.7.0-SNAPSHOT.jar
[withMaven] artifactsPublisher - Archive artifact maven-builder-support/pom.xml under org/apache/maven/maven-builder-support/3.7.0-SNAPSHOT/maven-builder-support-3.7.0-SNAPSHOT.pom
[withMaven] artifactsPublisher - Archive artifact maven-builder-support/target/maven-builder-support-3.7.0-SNAPSHOT.jar
under org/apache/maven/maven-builder-support/3.7.0-SNAPSHOT/maven-builder-support-3.7.0-SNAPSHOT.jar
[withMaven] artifactsPublisher - Archive artifact maven-model-builder/pom.xml under org/apache/maven/maven-model-builder/3.7.0-SNAPSHOT/maven-model-builder-3.7.0-SNAPSHOT.pom
[withMaven] artifactsPublisher - Archive artifact maven-model-builder/target/maven-model-builder-3.7.0-SNAPSHOT.jar
under org/apache/maven/maven-model-builder/3.7.0-SNAPSHOT/maven-model-builder-3.7.0-SNAPSHOT.jar
[withMaven] artifactsPublisher - Archive artifact maven-settings/pom.xml under org/apache/maven/maven-settings/3.7.0-SNAPSHOT/maven-settings-3.7.0-SNAPSHOT.pom
[withMaven] artifactsPublisher - Archive artifact maven-settings/target/maven-settings-3.7.0-SNAPSHOT.jar
under org/apache/maven/maven-settings/3.7.0-SNAPSHOT/maven-settings-3.7.0-SNAPSHOT.jar
[withMaven] artifactsPublisher - Archive artifact maven-settings-builder/pom.xml under org/apache/maven/maven-settings-builder/3.7.0-SNAPSHOT/maven-settings-builder-3.7.0-SNAPSHOT.pom
[withMaven] artifactsPublisher - Archive artifact maven-settings-builder/target/maven-settings-builder-3.7.0-SNAPSHOT.jar
under org/apache/maven/maven-settings-builder/3.7.0-SNAPSHOT/maven-settings-builder-3.7.0-SNAPSHOT.jar
[withMaven] artifactsPublisher - Archive artifact maven-repository-metadata/pom.xml under
org/apache/maven/maven-repository-metadata/3.7.0-SNAPSHOT/maven-repository-metadata-3.7.0-SNAPSHOT.pom
[withMaven] artifactsPublisher - Archive artifact maven-repository-metadata/target/maven-repository-metadata-3.7.0-SNAPSHOT.jar
under org/apache/maven/maven-repository-metadata/3.7.0-SNAPSHOT/maven-repository-metadata-3.7.0-SNAPSHOT.jar
[withMaven] artifactsPublisher - Archive artifact maven-resolver-provider/pom.xml under org/apache/maven/maven-resolver-provider/3.7.0-SNAPSHOT/maven-resolver-provider-3.7.0-SNAPSHOT.pom
[withMaven] artifactsPublisher - Archive artifact maven-resolver-provider/target/maven-resolver-provider-3.7.0-SNAPSHOT.jar
under org/apache/maven/maven-resolver-provider/3.7.0-SNAPSHOT/maven-resolver-provider-3.7.0-SNAPSHOT.jar
[withMaven] artifactsPublisher - Archive artifact maven-core/pom.xml under org/apache/maven/maven-core/3.7.0-SNAPSHOT/maven-core-3.7.0-SNAPSHOT.pom
[withMaven] artifactsPublisher - Archive artifact maven-core/target/maven-core-3.7.0-SNAPSHOT.jar
under org/apache/maven/maven-core/3.7.0-SNAPSHOT/maven-core-3.7.0-SNAPSHOT.jar
[withMaven] artifactsPublisher - Archive artifact maven-slf4j-wrapper/pom.xml under org/apache/maven/maven-slf4j-wrapper/3.7.0-SNAPSHOT/maven-slf4j-wrapper-3.7.0-SNAPSHOT.pom
[withMaven] artifactsPublisher - Archive artifact maven-slf4j-wrapper/target/maven-slf4j-wrapper-3.7.0-SNAPSHOT.jar
under org/apache/maven/maven-slf4j-wrapper/3.7.0-SNAPSHOT/maven-slf4j-wrapper-3.7.0-SNAPSHOT.jar
[withMaven] artifactsPublisher - Archive artifact maven-slf4j-provider/pom.xml under org/apache/maven/maven-slf4j-provider/3.7.0-SNAPSHOT/maven-slf4j-provider-3.7.0-SNAPSHOT.pom
[withMaven] artifactsPublisher - Archive artifact maven-slf4j-provider/target/maven-slf4j-provider-3.7.0-SNAPSHOT.jar
under org/apache/maven/maven-slf4j-provider/3.7.0-SNAPSHOT/maven-slf4j-provider-3.7.0-SNAPSHOT.jar
[withMaven] artifactsPublisher - Archive artifact maven-embedder/pom.xml under org/apache/maven/maven-embedder/3.7.0-SNAPSHOT/maven-embedder-3.7.0-SNAPSHOT.pom
[withMaven] artifactsPublisher - Archive artifact maven-embedder/target/maven-embedder-3.7.0-SNAPSHOT.jar
under org/apache/maven/maven-embedder/3.7.0-SNAPSHOT/maven-embedder-3.7.0-SNAPSHOT.jar
[withMaven] artifactsPublisher - Archive artifact maven-compat/pom.xml under org/apache/maven/maven-compat/3.7.0-SNAPSHOT/maven-compat-3.7.0-SNAPSHOT.pom
[withMaven] artifactsPublisher - Archive artifact maven-compat/target/maven-compat-3.7.0-SNAPSHOT.jar
under org/apache/maven/maven-compat/3.7.0-SNAPSHOT/maven-compat-3.7.0-SNAPSHOT.jar
[withMaven] artifactsPublisher - Archive artifact apache-maven/pom.xml under org/apache/maven/apache-maven/3.7.0-SNAPSHOT/apache-maven-3.7.0-SNAPSHOT.pom
[withMaven] artifactsPublisher - Archive artifact apache-maven/target/apache-maven-3.7.0-SNAPSHOT-site.xml
under org/apache/maven/apache-maven/3.7.0-SNAPSHOT/apache-maven-3.7.0-SNAPSHOT-site.xml
[withMaven] artifactsPublisher - Archive artifact apache-maven/target/apache-maven-3.7.0-SNAPSHOT-bin.zip
under org/apache/maven/apache-maven/3.7.0-SNAPSHOT/apache-maven-3.7.0-SNAPSHOT-bin.zip
[withMaven] artifactsPublisher - Archive artifact apache-maven/target/apache-maven-3.7.0-SNAPSHOT-bin.tar.gz
under org/apache/maven/apache-maven/3.7.0-SNAPSHOT/apache-maven-3.7.0-SNAPSHOT-bin.tar.gz
[withMaven] artifactsPublisher - Archive artifact maven-wrapper/pom.xml under org/apache/maven/maven-wrapper/3.7.0-SNAPSHOT/maven-wrapper-3.7.0-SNAPSHOT.pom
[withMaven] artifactsPublisher - Archive artifact maven-wrapper/target/maven-wrapper.jar under
org/apache/maven/maven-wrapper/3.7.0-SNAPSHOT/maven-wrapper-3.7.0-SNAPSHOT.jar
[withMaven] artifactsPublisher - Archive artifact maven-wrapper/maven-wrapper.pom under org/apache/maven/apache-maven-wrapper/3.7.0-SNAPSHOT/apache-maven-wrapper-3.7.0-SNAPSHOT.pom
[withMaven] artifactsPublisher - Archive artifact maven-wrapper/target/apache-maven-wrapper-3.7.0-SNAPSHOT-script.tar.gz
under org/apache/maven/apache-maven-wrapper/3.7.0-SNAPSHOT/apache-maven-wrapper-3.7.0-SNAPSHOT-script.tar.gz
[withMaven] artifactsPublisher - Archive artifact maven-wrapper/target/apache-maven-wrapper-3.7.0-SNAPSHOT-script.zip
under org/apache/maven/apache-maven-wrapper/3.7.0-SNAPSHOT/apache-maven-wrapper-3.7.0-SNAPSHOT-script.zip
[withMaven] artifactsPublisher - Archive artifact maven-wrapper/target/apache-maven-wrapper-3.7.0-SNAPSHOT-bin.tar.gz
under org/apache/maven/apache-maven-wrapper/3.7.0-SNAPSHOT/apache-maven-wrapper-3.7.0-SNAPSHOT-bin.tar.gz
[withMaven] artifactsPublisher - Archive artifact maven-wrapper/target/apache-maven-wrapper-3.7.0-SNAPSHOT-bin.zip
under org/apache/maven/apache-maven-wrapper/3.7.0-SNAPSHOT/apache-maven-wrapper-3.7.0-SNAPSHOT-bin.zip
[withMaven] artifactsPublisher - Archive artifact maven-wrapper/target/apache-maven-wrapper-3.7.0-SNAPSHOT-source.tar.gz
under org/apache/maven/apache-maven-wrapper/3.7.0-SNAPSHOT/apache-maven-wrapper-3.7.0-SNAPSHOT-source.tar.gz
[withMaven] artifactsPublisher - Archive artifact maven-wrapper/target/apache-maven-wrapper-3.7.0-SNAPSHOT-source.zip
under org/apache/maven/apache-maven-wrapper/3.7.0-SNAPSHOT/apache-maven-wrapper-3.7.0-SNAPSHOT-source.zip
[Fast Archiver] No prior successful build to compare, so performing full copy of artifacts
[withMaven] junitPublisher - Archive test results for Maven artifact org.apache.maven:maven-model:jar:3.7.0-SNAPSHOT
generated by maven-surefire-plugin:test (default-test): maven-model/target/surefire-reports/*.xml
[withMaven] junitPublisher - Archive test results for Maven artifact org.apache.maven:maven-artifact:jar:3.7.0-SNAPSHOT
generated by maven-surefire-plugin:test (default-test): maven-artifact/target/surefire-reports/*.xml
[withMaven] junitPublisher - Archive test results for Maven artifact org.apache.maven:maven-plugin-api:jar:3.7.0-SNAPSHOT
generated by maven-surefire-plugin:test (default-test): maven-plugin-api/target/surefire-reports/*.xml
[withMaven] junitPublisher - Archive test results for Maven artifact org.apache.maven:maven-builder-support:jar:3.7.0-SNAPSHOT
generated by maven-surefire-plugin:test (default-test): maven-builder-support/target/surefire-reports/*.xml
[withMaven] junitPublisher - Archive test results for Maven artifact org.apache.maven:maven-model-builder:jar:3.7.0-SNAPSHOT
generated by maven-surefire-plugin:test (default-test): maven-model-builder/target/surefire-reports/*.xml
[withMaven] junitPublisher - Archive test results for Maven artifact org.apache.maven:maven-settings:jar:3.7.0-SNAPSHOT
generated by maven-surefire-plugin:test (default-test): maven-settings/target/surefire-reports/*.xml
[withMaven] junitPublisher - Archive test results for Maven artifact org.apache.maven:maven-settings-builder:jar:3.7.0-SNAPSHOT
generated by maven-surefire-plugin:test (default-test): maven-settings-builder/target/surefire-reports/*.xml
[withMaven] junitPublisher - Archive test results for Maven artifact org.apache.maven:maven-repository-metadata:jar:3.7.0-SNAPSHOT
generated by maven-surefire-plugin:test (default-test): maven-repository-metadata/target/surefire-reports/*.xml
[withMaven] junitPublisher - Archive test results for Maven artifact org.apache.maven:maven-resolver-provider:jar:3.7.0-SNAPSHOT
generated by maven-surefire-plugin:test (default-test): maven-resolver-provider/target/surefire-reports/*.xml
[withMaven] junitPublisher - Archive test results for Maven artifact org.apache.maven:maven-core:jar:3.7.0-SNAPSHOT
generated by maven-surefire-plugin:test (default-test): maven-core/target/surefire-reports/*.xml
[withMaven] junitPublisher - Archive test results for Maven artifact org.apache.maven:maven-slf4j-wrapper:jar:3.7.0-SNAPSHOT
generated by maven-surefire-plugin:test (default-test): maven-slf4j-wrapper/target/surefire-reports/*.xml
[withMaven] junitPublisher - Archive test results for Maven artifact org.apache.maven:maven-slf4j-provider:jar:3.7.0-SNAPSHOT
generated by maven-surefire-plugin:test (default-test): maven-slf4j-provider/target/surefire-reports/*.xml
[withMaven] junitPublisher - Archive test results for Maven artifact org.apache.maven:maven-embedder:jar:3.7.0-SNAPSHOT
generated by maven-surefire-plugin:test (default-test): maven-embedder/target/surefire-reports/*.xml
[withMaven] junitPublisher - Archive test results for Maven artifact org.apache.maven:maven-compat:jar:3.7.0-SNAPSHOT
generated by maven-surefire-plugin:test (default-test): maven-compat/target/surefire-reports/*.xml
[withMaven] junitPublisher - Archive test results for Maven artifact org.apache.maven:apache-maven:pom:3.7.0-SNAPSHOT
generated by maven-surefire-plugin:test (test): apache-maven/target/surefire-reports/*.xml
[withMaven] junitPublisher - Archive test results for Maven artifact org.apache.maven:maven-wrapper:jar:3.7.0-SNAPSHOT
generated by maven-surefire-plugin:test (default-test): maven-wrapper/target/surefire-reports/*.xml
Recording test results
[withMaven] junitPublisher - Archive test results for Maven artifact org.apache.maven:maven-artifact:jar:3.7.0-SNAPSHOT
generated by maven-failsafe-plugin:integration-test (default): maven-artifact/target/failsafe-reports/*.xml
Recording test results
[withMaven] openTasksPublisher - Scan Tasks for Maven artifact org.apache.maven:maven-model:jar:3.7.0-SNAPSHOT
in source directory maven-model/src/main/java
[withMaven] openTasksPublisher - Scan Tasks for Maven artifact org.apache.maven:maven-artifact:jar:3.7.0-SNAPSHOT
in source directory maven-artifact/src/main/java
[withMaven] openTasksPublisher - Scan Tasks for Maven artifact org.apache.maven:maven-plugin-api:jar:3.7.0-SNAPSHOT
in source directory maven-plugin-api/src/main/java
[withMaven] openTasksPublisher - Scan Tasks for Maven artifact org.apache.maven:maven-builder-support:jar:3.7.0-SNAPSHOT
in source directory maven-builder-support/src/main/java
[withMaven] openTasksPublisher - Scan Tasks for Maven artifact org.apache.maven:maven-model-builder:jar:3.7.0-SNAPSHOT
in source directory maven-model-builder/src/main/java
[withMaven] openTasksPublisher - Scan Tasks for Maven artifact org.apache.maven:maven-settings:jar:3.7.0-SNAPSHOT
in source directory maven-settings/src/main/java
[withMaven] openTasksPublisher - Scan Tasks for Maven artifact org.apache.maven:maven-settings-builder:jar:3.7.0-SNAPSHOT
in source directory maven-settings-builder/src/main/java
[withMaven] openTasksPublisher - Scan Tasks for Maven artifact org.apache.maven:maven-resolver-provider:jar:3.7.0-SNAPSHOT
in source directory maven-resolver-provider/src/main/java
[withMaven] openTasksPublisher - Scan Tasks for Maven artifact org.apache.maven:maven-core:jar:3.7.0-SNAPSHOT
in source directory maven-core/src/main/java
[withMaven] openTasksPublisher - Scan Tasks for Maven artifact org.apache.maven:maven-slf4j-wrapper:jar:3.7.0-SNAPSHOT
in source directory maven-slf4j-wrapper/src/main/java
[withMaven] openTasksPublisher - Scan Tasks for Maven artifact org.apache.maven:maven-slf4j-provider:jar:3.7.0-SNAPSHOT
in source directory maven-slf4j-provider/src/main/java
[withMaven] openTasksPublisher - Scan Tasks for Maven artifact org.apache.maven:maven-embedder:jar:3.7.0-SNAPSHOT
in source directory maven-embedder/src/main/java
[withMaven] openTasksPublisher - Scan Tasks for Maven artifact org.apache.maven:maven-compat:jar:3.7.0-SNAPSHOT
in source directory maven-compat/src/main/java
[withMaven] openTasksPublisher - Scan Tasks for Maven artifact org.apache.maven:maven-wrapper:jar:3.7.0-SNAPSHOT
in source directory maven-wrapper/src/main/java
[withMaven] openTasksPublisher - Scan Tasks for Maven artifact org.apache.maven:apache-maven-wrapper:pom:3.7.0-SNAPSHOT
in source directory maven-wrapper/src/main/java
[TASKS] Scanning folder '/home/jenkins/jenkins-slave/workspace/maven-box_maven_MNG-5937/build'
for files matching the pattern 'maven-model/src/main/java/**/*,maven-artifact/src/main/java/**/*,maven-plugin-api/src/main/java/**/*,maven-builder-support/src/main/java/**/*,maven-model-builder/src/main/java/**/*,maven-settings/src/main/java/**/*,maven-settings-builder/src/main/java/**/*,maven-resolver-provider/src/main/java/**/*,maven-core/src/main/java/**/*,maven-slf4j-wrapper/src/main/java/**/*,maven-slf4j-provider/src/main/java/**/*,maven-embedder/src/main/java/**/*,maven-compat/src/main/java/**/*,maven-wrapper/src/main/java/**/*,maven-wrapper/src/main/java/**/*'
- excludes: null
[TASKS] Found 718 files to scan for tasks
[TASKS] Found 159 open tasks.
Skipping warnings blame since pipelines do not have an SCM link.%n
[withMaven] Publishers: Pipeline Graph Publisher: 16 ms, Generated Artifacts Publisher: 39884
ms, Invoker Publisher: 1 ms, Junit Publisher: 90522 ms, Concordion Publisher: 1 ms, Dependencies
Fingerprint Publisher: 19212 ms, JGiven Publisher: 1 ms, Open Task Scanner Publisher: 5030
ms
[Pipeline] // withMaven
[Pipeline] dir
Running in /home/jenkins/jenkins-slave/workspace/maven-box_maven_MNG-5937/build/apache-maven/target
[Pipeline] {
[Pipeline] sh
+ mv apache-maven-3.7.0-SNAPSHOT-bin.zip apache-maven-dist.zip
[Pipeline] stash
Stashed 1 file(s)
[Pipeline] }
[Pipeline] // dir
[Pipeline] dir
Running in /home/jenkins/jenkins-slave/workspace/maven-box_maven_MNG-5937/build/maven-wrapper/target
[Pipeline] {
[Pipeline] stash
[Pipeline] }
[Pipeline] // dir
[Pipeline] }
[Pipeline] // stage
[Pipeline] }
[Pipeline] // dir
[Pipeline] }
[Pipeline] // node
[Pipeline] echo
[FAILURE-001] java.lang.IllegalArgumentException: Could not instantiate {includes=[apache-maven-wrapper-*.zip,
maven-wrapper.jar], name=wrappers} for org.jenkinsci.plugins.workflow.support.steps.stash.StashStep:
java.lang.ClassCastException: class org.jenkinsci.plugins.workflow.support.steps.stash.StashStep.setIncludes()
expects class java.lang.String but received class java.util.ArrayList
[Pipeline] stage
[Pipeline] { (Notifications)
[Pipeline] echo
Build result: FAILURE
[Pipeline] jiraIssueSelector
[Pipeline] jiraComment
[Pipeline] echo
The authors of changes [rfscholte].
[Pipeline] echo
Sending email ...
[Pipeline] emailext
Mime
  • Unnamed multipart/mixed (inline, None, 0 bytes)
View raw message