mesos-reviews mailing list archives

Site index · List index
Message view « Date » · « Thread »
Top « Date » · « Thread »
From Mesos Reviewbot Windows <revi...@mesos.apache.org>
Subject Re: Review Request 63479: Migrated `3rdparty/mesos-3rdparty` to `mesos/3rdparty`.
Date Wed, 01 Nov 2017 23:10:00 GMT

-----------------------------------------------------------
This is an automatically generated e-mail. To reply, visit:
https://reviews.apache.org/r/63479/#review189855
-----------------------------------------------------------



FAIL: Mesos stdout-tests failed to build.

Reviews applied: `['63479']`

Failed command: `cmake.exe --build . --target stout-tests --config Debug`

All the build artifacts available at: http://dcos-win.westus.cloudapp.azure.com/mesos-build/review/63479

Relevant logs:

- [stout-tests-build-cmake-stdout.log](http://dcos-win.westus.cloudapp.azure.com/mesos-build/review/63479/logs/stout-tests-build-cmake-stdout.log):

```
  CUSTOMBUILD : error : downloading 'https://github.com/mesos/3rdparty/raw/master/libapr-1.5.2.tar.gz'
failed [C:\DCOS\mesos\3rdparty\libapr-1.5.2.vcxproj]
  CUSTOMBUILD : The requested URL returned error : 404 Not Found [C:\DCOS\mesos\3rdparty\libapr-1.5.2.vcxproj]
  CUSTOMBUILD : error : downloading 'https://github.com/mesos/3rdparty/raw/master/libapr-1.5.2.tar.gz'
failed [C:\DCOS\mesos\3rdparty\libapr-1.5.2.vcxproj]
  CUSTOMBUILD : The requested URL returned error : 404 Not Found [C:\DCOS\mesos\3rdparty\libapr-1.5.2.vcxproj]
  CUSTOMBUILD : error : downloading 'https://github.com/mesos/3rdparty/raw/master/libapr-1.5.2.tar.gz'
failed [C:\DCOS\mesos\3rdparty\libapr-1.5.2.vcxproj]
  CUSTOMBUILD : The requested URL returned error : 404 Not Found [C:\DCOS\mesos\3rdparty\libapr-1.5.2.vcxproj]
  CUSTOMBUILD : error : downloading 'https://github.com/mesos/3rdparty/raw/master/libapr-1.5.2.tar.gz'
failed [C:\DCOS\mesos\3rdparty\libapr-1.5.2.vcxproj]
  CUSTOMBUILD : The requested URL returned error : 404 Not Found [C:\DCOS\mesos\3rdparty\libapr-1.5.2.vcxproj]


"C:\DCOS\mesos\3rdparty\stout\tests\stout-tests.vcxproj" (default target) (1) ->
"C:\DCOS\mesos\3rdparty\zlib-1.2.8.vcxproj" (default target) (11) ->
  CUSTOMBUILD : error : downloading 'https://github.com/mesos/3rdparty/raw/master/zlib-1.2.8.tar.gz'
failed [C:\DCOS\mesos\3rdparty\zlib-1.2.8.vcxproj]
  CUSTOMBUILD : The requested URL returned error : 404 Not Found [C:\DCOS\mesos\3rdparty\zlib-1.2.8.vcxproj]
  CUSTOMBUILD : error : downloading 'https://github.com/mesos/3rdparty/raw/master/zlib-1.2.8.tar.gz'
failed [C:\DCOS\mesos\3rdparty\zlib-1.2.8.vcxproj]
  CUSTOMBUILD : The requested URL returned error : 404 Not Found [C:\DCOS\mesos\3rdparty\zlib-1.2.8.vcxproj]
  CUSTOMBUILD : error : downloading 'https://github.com/mesos/3rdparty/raw/master/zlib-1.2.8.tar.gz'
failed [C:\DCOS\mesos\3rdparty\zlib-1.2.8.vcxproj]
  CUSTOMBUILD : The requested URL returned error : 404 Not Found [C:\DCOS\mesos\3rdparty\zlib-1.2.8.vcxproj]
  CUSTOMBUILD : error : downloading 'https://github.com/mesos/3rdparty/raw/master/zlib-1.2.8.tar.gz'
failed [C:\DCOS\mesos\3rdparty\zlib-1.2.8.vcxproj]
  CUSTOMBUILD : The requested URL returned error : 404 Not Found [C:\DCOS\mesos\3rdparty\zlib-1.2.8.vcxproj]
  CUSTOMBUILD : error : downloading 'https://github.com/mesos/3rdparty/raw/master/zlib-1.2.8.tar.gz'
failed [C:\DCOS\mesos\3rdparty\zlib-1.2.8.vcxproj]
  CUSTOMBUILD : The requested URL returned error : 404 Not Found [C:\DCOS\mesos\3rdparty\zlib-1.2.8.vcxproj]
  CUSTOMBUILD : error : downloading 'https://github.com/mesos/3rdparty/raw/master/zlib-1.2.8.tar.gz'
failed [C:\DCOS\mesos\3rdparty\zlib-1.2.8.vcxproj]
  CUSTOMBUILD : The requested URL returned error : 404 Not Found [C:\DCOS\mesos\3rdparty\zlib-1.2.8.vcxproj]

    26 Warning(s)
    48 Error(s)

Time Elapsed 00:11:59.66
```

- [stdout-tests-CMakeOutput.log](http://dcos-win.westus.cloudapp.azure.com/mesos-build/review/63479/logs/stdout-tests-CMakeOutput.log):

```
  Creating directory "C:\DCOS\mesos\CMakeFiles\CMakeTmp\Debug\".

  Creating directory "cmTC_445b6.dir\Debug\cmTC_445b6.tlog\".

InitializeBuildStatus:

  Creating "cmTC_445b6.dir\Debug\cmTC_445b6.tlog\unsuccessfulbuild" because "AlwaysCreate"
was specified.

ClCompile:

  C:\Program Files (x86)\Microsoft Visual Studio\2017\Community\VC\Tools\MSVC\14.10.25017\bin\HostX64\x64\CL.exe
/c /Zi /W3 /WX- /diagnostics:classic /Od /Ob0 /D WIN32 /D _WINDOWS /D COMPILER_SUPPORTS_CXX11
/D "CMAKE_INTDIR=\"Debug\"" /D _MBCS /Gm- /EHsc /RTC1 /MDd /GS /fp:precise /Zc:wchar_t /Zc:forScope
/Zc:inline /GR /Fo"cmTC_445b6.dir\Debug\" /Fd"cmTC_445b6.dir\Debug\vc141.pdb" /Gd /TP /errorReport:queue
C:\DCOS\mesos\CMakeFiles\CMakeTmp\src.cxx

  Microsoft (R) C/C++ Optimizing Compiler Version 19.10.25019 for x64

  Copyright (C) Microsoft Corporation.  All rights reserved.

  

  cl /c /Zi /W3 /WX- /diagnostics:classic /Od /Ob0 /D WIN32 /D _WINDOWS /D COMPILER_SUPPORTS_CXX11
/D "CMAKE_INTDIR=\"Debug\"" /D _MBCS /Gm- /EHsc /RTC1 /MDd /GS /fp:precise /Zc:wchar_t /Zc:forScope
/Zc:inline /GR /Fo"cmTC_445b6.dir\Debug\" /Fd"cmTC_445b6.dir\Debug\vc141.pdb" /Gd /TP /errorReport:queue
C:\DCOS\mesos\CMakeFiles\CMakeTmp\src.cxx

  src.cxx

  

Link:

  C:\Program Files (x86)\Microsoft Visual Studio\2017\Community\VC\Tools\MSVC\14.10.25017\bin\HostX64\x64\link.exe
/ERRORREPORT:QUEUE /OUT:"C:\DCOS\mesos\CMakeFiles\CMakeTmp\Debug\cmTC_445b6.exe" /INCREMENTAL
/NOLOGO kernel32.lib user32.lib gdi32.lib winspool.lib shell32.lib ole32.lib oleaut32.lib
uuid.lib comdlg32.lib advapi32.lib /MANIFEST /MANIFESTUAC:"level='asInvoker' uiAccess='false'"
/manifest:embed /DEBUG /PDB:"C:/DCOS/mesos/CMakeFiles/CMakeTmp/Debug/cmTC_445b6.pdb" /SUBSYSTEM:CONSOLE
/TLBID:1 /DYNAMICBASE /NXCOMPAT /IMPLIB:"C:/DCOS/mesos/CMakeFiles/CMakeTmp/Debug/cmTC_445b6.lib"
/MACHINE:X64  /machine:x64 cmTC_445b6.dir\Debug\src.obj

  cmTC_445b6.vcxproj -> C:\DCOS\mesos\CMakeFiles\CMakeTmp\Debug\cmTC_445b6.exe

  cmTC_445b6.vcxproj -> C:/DCOS/mesos/CMakeFiles/CMakeTmp/Debug/cmTC_445b6.pdb (Full PDB)

FinalizeBuildStatus:

  Deleting file "cmTC_445b6.dir\Debug\cmTC_445b6.tlog\unsuccessfulbuild".

  Touching "cmTC_445b6.dir\Debug\cmTC_445b6.tlog\cmTC_445b6.lastbuildstate".

Done Building Project "C:\DCOS\mesos\CMakeFiles\CMakeTmp\cmTC_445b6.vcxproj" (default targets).



Build succeeded.

    0 Warning(s)

    0 Error(s)



Time Elapsed 00:00:01.72


Source file was:
int main() { return 0; }
```

- [stdout-tests-CMakeError.log](http://dcos-win.westus.cloudapp.azure.com/mesos-build/review/63479/logs/stdout-tests-CMakeError.log):

```
PrepareForBuild:

  Creating directory "cmTC_a6cf8.dir\Debug\".

  Creating directory "C:\DCOS\mesos\CMakeFiles\CMakeTmp\Debug\".

  Creating directory "cmTC_a6cf8.dir\Debug\cmTC_a6cf8.tlog\".

InitializeBuildStatus:

  Creating "cmTC_a6cf8.dir\Debug\cmTC_a6cf8.tlog\unsuccessfulbuild" because "AlwaysCreate"
was specified.

ClCompile:

  C:\Program Files (x86)\Microsoft Visual Studio\2017\Community\VC\Tools\MSVC\14.10.25017\bin\HostX64\x64\CL.exe
/c /Zi /W3 /WX- /diagnostics:classic /MP /Od /Ob0 /D WIN32 /D _WINDOWS /D UNICODE /D _UNICODE
/D "CMAKE_INTDIR=\"Debug\"" /D _UNICODE /D UNICODE /Gm- /RTC1 /MTd /GS /fp:precise /Zc:wchar_t
/Zc:forScope /Zc:inline /Fo"cmTC_a6cf8.dir\Debug\" /Fd"cmTC_a6cf8.dir\Debug\vc141.pdb" /Gd
/TC /errorReport:queue C:\DCOS\mesos\CMakeFiles\CMakeTmp\CheckIncludeFile.c

  Microsoft (R) C/C++ Optimizing Compiler Version 19.10.25019 for x64

  Copyright (C) Microsoft Corporation.  All rights reserved.

  

  cl /c /Zi /W3 /WX- /diagnostics:classic /MP /Od /Ob0 /D WIN32 /D _WINDOWS /D UNICODE /D
_UNICODE /D "CMAKE_INTDIR=\"Debug\"" /D _UNICODE /D UNICODE /Gm- /RTC1 /MTd /GS /fp:precise
/Zc:wchar_t /Zc:forScope /Zc:inline /Fo"cmTC_a6cf8.dir\Debug\" /Fd"cmTC_a6cf8.dir\Debug\vc141.pdb"
/Gd /TC /errorReport:queue C:\DCOS\mesos\CMakeFiles\CMakeTmp\CheckIncludeFile.c

  CheckIncludeFile.c

  

C:\DCOS\mesos\CMakeFiles\CMakeTmp\CheckIncludeFile.c(1): fatal error C1083: Cannot open include
file: 'pthread.h': No such file or directory [C:\DCOS\mesos\CMakeFiles\CMakeTmp\cmTC_a6cf8.vcxproj]

Done Building Project "C:\DCOS\mesos\CMakeFiles\CMakeTmp\cmTC_a6cf8.vcxproj" (default targets)
-- FAILED.



Build FAILED.



"C:\DCOS\mesos\CMakeFiles\CMakeTmp\cmTC_a6cf8.vcxproj" (default target) (1) ->

(ClCompile target) -> 

  C:\DCOS\mesos\CMakeFiles\CMakeTmp\CheckIncludeFile.c(1): fatal error C1083: Cannot open
include file: 'pthread.h': No such file or directory [C:\DCOS\mesos\CMakeFiles\CMakeTmp\cmTC_a6cf8.vcxproj]



    0 Warning(s)

    1 Error(s)



Time Elapsed 00:00:01.12



```

- Mesos Reviewbot Windows


On Nov. 1, 2017, 9:52 p.m., Michael Park wrote:
> 
> -----------------------------------------------------------
> This is an automatically generated e-mail. To reply, visit:
> https://reviews.apache.org/r/63479/
> -----------------------------------------------------------
> 
> (Updated Nov. 1, 2017, 9:52 p.m.)
> 
> 
> Review request for mesos and Andrew Schwartzmeyer.
> 
> 
> Repository: mesos
> 
> 
> Description
> -------
> 
> We currently keep some of our 3rdparty bundled dependencies in
> an external repository in order to reduce the tarball churn in
> the Mesos repository which would bloat the git repository.
> 
> The intent is for `github.com/3rdparty/mesos-3rdparty` to be
> migrated to `github.com/mesos/3rdparty` along with this patch.
> 
> 
> Diffs
> -----
> 
>   cmake/CompilationConfigure.cmake 929e45bd810c99e036d433a8f0a0bc978c9841a2 
>   docs/cmake.md 1e1a27ef67d256eb892a5eb455928c2424bb3fed 
>   docs/configuration/cmake.md 68757d30400da06935b17650727f4e2b92a3997c 
> 
> 
> Diff: https://reviews.apache.org/r/63479/diff/1/
> 
> 
> Testing
> -------
> 
> N/A
> 
> 
> Thanks,
> 
> Michael Park
> 
>


Mime
  • Unnamed multipart/alternative (inline, None, 0 bytes)
View raw message