mesos-reviews mailing list archives

Site index · List index
Message view « Date » · « Thread »
Top « Date » · « Thread »
From Mesos Reviewbot Windows <revi...@mesos.apache.org>
Subject Re: Review Request 64726: Renamed operation protos for consistency.
Date Wed, 20 Dec 2017 19:49:39 GMT

-----------------------------------------------------------
This is an automatically generated e-mail. To reply, visit:
https://reviews.apache.org/r/64726/#review194271
-----------------------------------------------------------



FAIL: mesos-java failed to build.

Reviews applied: `['64726']`

Failed command: `cmake.exe --build . --target mesos-java`

All the build artifacts available at: http://dcos-win.westus.cloudapp.azure.com/mesos-build/review/64726

Relevant logs:

- [mesos-java-build-cmake-stdout.log](http://dcos-win.westus.cloudapp.azure.com/mesos-build/review/64726/logs/mesos-java-build-cmake-stdout.log):

```
  D:\DCOS\mesos\mesos\src\messages/messages.hpp(63): error C4430: missing type specifier -
int assumed. Note: C++ does not support default-int (compiling source file D:\DCOS\mesos\mesos\src\java\jni\org_apache_mesos_v1_scheduler_V0Mesos.cpp)
[D:\DCOS\mesos\src\java\mesos-java.vcxproj]
  D:\DCOS\mesos\mesos\src\messages/messages.hpp(63): error C2143: syntax error: missing ','
before '&' (compiling source file D:\DCOS\mesos\mesos\src\java\jni\org_apache_mesos_v1_scheduler_V0Mesos.cpp)
[D:\DCOS\mesos\src\java\mesos-java.vcxproj]
  D:\DCOS\mesos\mesos\src\messages/messages.hpp(73): error C2653: 'OfferOperationStatusUpdateRecord':
is not a class or namespace name (compiling source file D:\DCOS\mesos\mesos\src\java\jni\org_apache_mesos_v1_scheduler_V0Mesos.cpp)
[D:\DCOS\mesos\src\java\mesos-java.vcxproj]
  D:\DCOS\mesos\mesos\src\messages/messages.hpp(73): error C4430: missing type specifier -
int assumed. Note: C++ does not support default-int (compiling source file D:\DCOS\mesos\mesos\src\java\jni\org_apache_mesos_v1_scheduler_V0Mesos.cpp)
[D:\DCOS\mesos\src\java\mesos-java.vcxproj]
  D:\DCOS\mesos\mesos\src\messages/messages.hpp(73): error C2143: syntax error: missing ','
before '&' (compiling source file D:\DCOS\mesos\mesos\src\java\jni\org_apache_mesos_v1_scheduler_V0Mesos.cpp)
[D:\DCOS\mesos\src\java\mesos-java.vcxproj]
  D:\DCOS\mesos\mesos\src\common/protobuf_utils.hpp(153): error C4430: missing type specifier
- int assumed. Note: C++ does not support default-int (compiling source file D:\DCOS\mesos\mesos\src\java\jni\org_apache_mesos_v1_scheduler_V0Mesos.cpp)
[D:\DCOS\mesos\src\java\mesos-java.vcxproj]
  D:\DCOS\mesos\mesos\src\common/protobuf_utils.hpp(153): error C2143: syntax error: missing
',' before '&' (compiling source file D:\DCOS\mesos\mesos\src\java\jni\org_apache_mesos_v1_scheduler_V0Mesos.cpp)
[D:\DCOS\mesos\src\java\mesos-java.vcxproj]
  D:\DCOS\mesos\mesos\src\common/protobuf_utils.hpp(156): error C4430: missing type specifier
- int assumed. Note: C++ does not support default-int (compiling source file D:\DCOS\mesos\mesos\src\java\jni\org_apache_mesos_v1_scheduler_V0Mesos.cpp)
[D:\DCOS\mesos\src\java\mesos-java.vcxproj]
  D:\DCOS\mesos\mesos\src\common/protobuf_utils.hpp(156): error C2146: syntax error: missing
';' before identifier 'createOfferOperationStatus' (compiling source file D:\DCOS\mesos\mesos\src\java\jni\org_apache_mesos_v1_scheduler_V0Mesos.cpp)
[D:\DCOS\mesos\src\java\mesos-java.vcxproj]
  D:\DCOS\mesos\mesos\src\common/protobuf_utils.hpp(158): error C2065: 'OfferOperationID':
undeclared identifier (compiling source file D:\DCOS\mesos\mesos\src\java\jni\org_apache_mesos_v1_scheduler_V0Mesos.cpp)
[D:\DCOS\mesos\src\java\mesos-java.vcxproj]
  D:\DCOS\mesos\mesos\src\common/protobuf_utils.hpp(158): error C2923: 'Option': 'OfferOperationID'
is not a valid template type argument for parameter 'T' (compiling source file D:\DCOS\mesos\mesos\src\java\jni\org_apache_mesos_v1_scheduler_V0Mesos.cpp)
[D:\DCOS\mesos\src\java\mesos-java.vcxproj]
  D:\DCOS\mesos\mesos\src\common/protobuf_utils.hpp(164): error C4430: missing type specifier
- int assumed. Note: C++ does not support default-int (compiling source file D:\DCOS\mesos\mesos\src\java\jni\org_apache_mesos_v1_scheduler_V0Mesos.cpp)
[D:\DCOS\mesos\src\java\mesos-java.vcxproj]
  D:\DCOS\mesos\mesos\src\common/protobuf_utils.hpp(164): error C2146: syntax error: missing
';' before identifier 'createOfferOperation' (compiling source file D:\DCOS\mesos\mesos\src\java\jni\org_apache_mesos_v1_scheduler_V0Mesos.cpp)
[D:\DCOS\mesos\src\java\mesos-java.vcxproj]
  D:\DCOS\mesos\mesos\src\common/protobuf_utils.hpp(172): error C4430: missing type specifier
- int assumed. Note: C++ does not support default-int (compiling source file D:\DCOS\mesos\mesos\src\java\jni\org_apache_mesos_v1_scheduler_V0Mesos.cpp)
[D:\DCOS\mesos\src\java\mesos-java.vcxproj]
  D:\DCOS\mesos\mesos\src\common/protobuf_utils.hpp(172): error C2146: syntax error: missing
';' before identifier 'createOfferOperationStatusUpdate' (compiling source file D:\DCOS\mesos\mesos\src\java\jni\org_apache_mesos_v1_scheduler_V0Mesos.cpp)
[D:\DCOS\mesos\src\java\mesos-java.vcxproj]
  D:\DCOS\mesos\mesos\src\common/protobuf_utils.hpp(175): error C2923: 'Option': 'mesos::internal::protobuf::OfferOperationStatus'
is not a valid template type argument for parameter 'T' (compiling source file D:\DCOS\mesos\mesos\src\java\jni\org_apache_mesos_v1_scheduler_V0Mesos.cpp)
[D:\DCOS\mesos\src\java\mesos-java.vcxproj]
  D:\DCOS\mesos\mesos\src\java\jni\org_apache_mesos_v1_scheduler_V0Mesos.cpp(633): error C2039:
'ACKNOWLEDGE_OFFER_OPERATION_UPDATE': is not a member of 'mesos::v1::scheduler::Call' [D:\DCOS\mesos\src\java\mesos-java.vcxproj]
  D:\DCOS\mesos\mesos\src\java\jni\org_apache_mesos_v1_scheduler_V0Mesos.cpp(633): error C2065:
'ACKNOWLEDGE_OFFER_OPERATION_UPDATE': undeclared identifier [D:\DCOS\mesos\src\java\mesos-java.vcxproj]
  D:\DCOS\mesos\mesos\src\java\jni\org_apache_mesos_v1_scheduler_V0Mesos.cpp(633): error C2131:
expression did not evaluate to a constant [D:\DCOS\mesos\src\java\mesos-java.vcxproj]
  D:\DCOS\mesos\mesos\src\java\jni\org_apache_mesos_v1_scheduler_V0Mesos.cpp(651): error C2039:
'RECONCILE_OFFER_OPERATIONS': is not a member of 'mesos::v1::scheduler::Call' [D:\DCOS\mesos\src\java\mesos-java.vcxproj]
  D:\DCOS\mesos\mesos\src\java\jni\org_apache_mesos_v1_scheduler_V0Mesos.cpp(651): error C2065:
'RECONCILE_OFFER_OPERATIONS': undeclared identifier [D:\DCOS\mesos\src\java\mesos-java.vcxproj]
  D:\DCOS\mesos\mesos\src\java\jni\org_apache_mesos_v1_scheduler_V0Mesos.cpp(651): error C2131:
expression did not evaluate to a constant [D:\DCOS\mesos\src\java\mesos-java.vcxproj]
  D:\DCOS\mesos\mesos\src\java\jni\org_apache_mesos_v1_scheduler_V0Mesos.cpp(633): error C2051:
case expression not constant [D:\DCOS\mesos\src\java\mesos-java.vcxproj]
  D:\DCOS\mesos\mesos\src\java\jni\org_apache_mesos_v1_scheduler_V0Mesos.cpp(651): error C2051:
case expression not constant [D:\DCOS\mesos\src\java\mesos-java.vcxproj]

    241 Warning(s)
    156 Error(s)

Time Elapsed 00:18:25.00
```

- [mesos-java-build-CMakeOutput.log](http://dcos-win.westus.cloudapp.azure.com/mesos-build/review/64726/logs/mesos-java-build-CMakeOutput.log):

```
  Creating directory "cmTC_eaf15.dir\Debug\".

  Creating directory "D:\DCOS\mesos\CMakeFiles\CMakeTmp\Debug\".

  Creating directory "cmTC_eaf15.dir\Debug\cmTC_eaf15.tlog\".

InitializeBuildStatus:

  Creating "cmTC_eaf15.dir\Debug\cmTC_eaf15.tlog\unsuccessfulbuild" because "AlwaysCreate"
was specified.

ClCompile:

  C:\Program Files (x86)\Microsoft Visual Studio\2017\Community\VC\Tools\MSVC\14.12.25827\bin\HostX64\x64\CL.exe
/c /Zi /W3 /WX- /diagnostics:classic /Od /Ob0 /D WIN32 /D _WINDOWS /D COMPILER_SUPPORTS_CXX11
/D "CMAKE_INTDIR=\"Debug\"" /D _MBCS /Gm- /EHsc /RTC1 /MDd /GS /fp:precise /Zc:wchar_t /Zc:forScope
/Zc:inline /GR /Fo"cmTC_eaf15.dir\Debug\" /Fd"cmTC_eaf15.dir\Debug\vc141.pdb" /Gd /TP /errorReport:queue
D:\DCOS\mesos\CMakeFiles\CMakeTmp\src.cxx

  Microsoft (R) C/C++ Optimizing Compiler Version 19.12.25830.2 for x64

  Copyright (C) Microsoft Corporation.  All rights reserved.

  

  cl /c /Zi /W3 /WX- /diagnostics:classic /Od /Ob0 /D WIN32 /D _WINDOWS /D COMPILER_SUPPORTS_CXX11
/D "CMAKE_INTDIR=\"Debug\"" /D _MBCS /Gm- /EHsc /RTC1 /MDd /GS /fp:precise /Zc:wchar_t /Zc:forScope
/Zc:inline /GR /Fo"cmTC_eaf15.dir\Debug\" /Fd"cmTC_eaf15.dir\Debug\vc141.pdb" /Gd /TP /errorReport:queue
D:\DCOS\mesos\CMakeFiles\CMakeTmp\src.cxx

  src.cxx

  

Link:

  C:\Program Files (x86)\Microsoft Visual Studio\2017\Community\VC\Tools\MSVC\14.12.25827\bin\HostX64\x64\link.exe
/ERRORREPORT:QUEUE /OUT:"D:\DCOS\mesos\CMakeFiles\CMakeTmp\Debug\cmTC_eaf15.exe" /INCREMENTAL
/NOLOGO kernel32.lib user32.lib gdi32.lib winspool.lib shell32.lib ole32.lib oleaut32.lib
uuid.lib comdlg32.lib advapi32.lib /MANIFEST /MANIFESTUAC:"level='asInvoker' uiAccess='false'"
/manifest:embed /DEBUG /PDB:"D:/DCOS/mesos/CMakeFiles/CMakeTmp/Debug/cmTC_eaf15.pdb" /SUBSYSTEM:CONSOLE
/TLBID:1 /DYNAMICBASE /NXCOMPAT /IMPLIB:"D:/DCOS/mesos/CMakeFiles/CMakeTmp/Debug/cmTC_eaf15.lib"
/MACHINE:X64  /machine:x64 cmTC_eaf15.dir\Debug\src.obj

  cmTC_eaf15.vcxproj -> D:\DCOS\mesos\CMakeFiles\CMakeTmp\Debug\cmTC_eaf15.exe

FinalizeBuildStatus:

  Deleting file "cmTC_eaf15.dir\Debug\cmTC_eaf15.tlog\unsuccessfulbuild".

  Touching "cmTC_eaf15.dir\Debug\cmTC_eaf15.tlog\cmTC_eaf15.lastbuildstate".

Done Building Project "D:\DCOS\mesos\CMakeFiles\CMakeTmp\cmTC_eaf15.vcxproj" (default targets).



Build succeeded.

    0 Warning(s)

    0 Error(s)



Time Elapsed 00:00:01.04


Source file was:
int main() { return 0; }
```

- [mesos-java-build-CMakeError.log](http://dcos-win.westus.cloudapp.azure.com/mesos-build/review/64726/logs/mesos-java-build-CMakeError.log):

```
PrepareForBuild:

  Creating directory "cmTC_68339.dir\Debug\".

  Creating directory "D:\DCOS\mesos\CMakeFiles\CMakeTmp\Debug\".

  Creating directory "cmTC_68339.dir\Debug\cmTC_68339.tlog\".

InitializeBuildStatus:

  Creating "cmTC_68339.dir\Debug\cmTC_68339.tlog\unsuccessfulbuild" because "AlwaysCreate"
was specified.

ClCompile:

  C:\Program Files (x86)\Microsoft Visual Studio\2017\Community\VC\Tools\MSVC\14.12.25827\bin\HostX64\x64\CL.exe
/c /Zi /W3 /WX- /diagnostics:classic /MP /Od /Ob0 /D WIN32 /D _WINDOWS /D UNICODE /D _UNICODE
/D "CMAKE_INTDIR=\"Debug\"" /D _UNICODE /D UNICODE /Gm- /RTC1 /MTd /GS /fp:precise /Zc:wchar_t
/Zc:forScope /Zc:inline /Fo"cmTC_68339.dir\Debug\" /Fd"cmTC_68339.dir\Debug\vc141.pdb" /Gd
/TC /errorReport:queue D:\DCOS\mesos\CMakeFiles\CMakeTmp\CheckIncludeFile.c

  Microsoft (R) C/C++ Optimizing Compiler Version 19.12.25830.2 for x64

  Copyright (C) Microsoft Corporation.  All rights reserved.

  

  cl /c /Zi /W3 /WX- /diagnostics:classic /MP /Od /Ob0 /D WIN32 /D _WINDOWS /D UNICODE /D
_UNICODE /D "CMAKE_INTDIR=\"Debug\"" /D _UNICODE /D UNICODE /Gm- /RTC1 /MTd /GS /fp:precise
/Zc:wchar_t /Zc:forScope /Zc:inline /Fo"cmTC_68339.dir\Debug\" /Fd"cmTC_68339.dir\Debug\vc141.pdb"
/Gd /TC /errorReport:queue D:\DCOS\mesos\CMakeFiles\CMakeTmp\CheckIncludeFile.c

  CheckIncludeFile.c

  

D:\DCOS\mesos\CMakeFiles\CMakeTmp\CheckIncludeFile.c(1): fatal error C1083: Cannot open include
file: 'pthread.h': No such file or directory [D:\DCOS\mesos\CMakeFiles\CMakeTmp\cmTC_68339.vcxproj]

Done Building Project "D:\DCOS\mesos\CMakeFiles\CMakeTmp\cmTC_68339.vcxproj" (default targets)
-- FAILED.



Build FAILED.



"D:\DCOS\mesos\CMakeFiles\CMakeTmp\cmTC_68339.vcxproj" (default target) (1) ->

(ClCompile target) -> 

  D:\DCOS\mesos\CMakeFiles\CMakeTmp\CheckIncludeFile.c(1): fatal error C1083: Cannot open
include file: 'pthread.h': No such file or directory [D:\DCOS\mesos\CMakeFiles\CMakeTmp\cmTC_68339.vcxproj]



    0 Warning(s)

    1 Error(s)



Time Elapsed 00:00:00.61



```

- Mesos Reviewbot Windows


On Dec. 20, 2017, 7:21 p.m., Gaston Kleiman wrote:
> 
> -----------------------------------------------------------
> This is an automatically generated e-mail. To reply, visit:
> https://reviews.apache.org/r/64726/
> -----------------------------------------------------------
> 
> (Updated Dec. 20, 2017, 7:21 p.m.)
> 
> 
> Review request for mesos, Chun-Hung Hsiao, Greg Mann, Jie Yu, and Vinod Kone.
> 
> 
> Repository: mesos
> 
> 
> Description
> -------
> 
> Renamed operation protos for consistency.
> 
> 
> Diffs
> -----
> 
>   include/mesos/mesos.proto bf2ec8f4630fb32a36a1a0d49de23e0ddc0c6c84 
>   include/mesos/resource_provider/resource_provider.proto 4534049bce3948f20a00cd704f09173077c8cdf8

>   include/mesos/scheduler/scheduler.proto a7907e2c0a8e0f23690179b9e334377c4acc9068 
>   include/mesos/v1/mesos.proto 9e240c0756ee9747f1ef226db963dfc6ab5c699a 
>   include/mesos/v1/resource_provider/resource_provider.proto beb9f1734b8d916150ecc6ed1c5b86f0672cd941

>   include/mesos/v1/scheduler/scheduler.proto e115bca04646133cfa3bbd6e7ba190b69f807f2b

>   src/messages/messages.proto baefbe97b57d28d70d8952604d12cdc543eaced4 
>   src/resource_provider/state.proto e3362a958851cefc175ee9ba0563da2b8bf8bb08 
> 
> 
> Diff: https://reviews.apache.org/r/64726/diff/4/
> 
> 
> Testing
> -------
> 
> 
> Thanks,
> 
> Gaston Kleiman
> 
>


Mime
  • Unnamed multipart/alternative (inline, None, 0 bytes)
View raw message