mesos-reviews mailing list archives

Site index · List index
Message view « Date » · « Thread »
Top « Date » · « Thread »
From Mesos Reviewbot Windows <revi...@mesos.apache.org>
Subject Re: Review Request 65836: WIP: Random source in mesos.
Date Wed, 28 Feb 2018 15:01:34 GMT

-----------------------------------------------------------
This is an automatically generated e-mail. To reply, visit:
https://reviews.apache.org/r/65836/#review198389
-----------------------------------------------------------



FAIL: Some of the unit tests failed. Please check the relevant logs.

Reviews applied: `['65834', '65835', '65836']`

Failed command: `Start-MesosCITesting`

All the build artifacts available at: http://dcos-win.westus.cloudapp.azure.com/mesos-build/review/65836

Relevant logs:

- [mesos-tests-stdout.log](http://dcos-win.westus.cloudapp.azure.com/mesos-build/review/65836/logs/mesos-tests-stdout.log):

```
[       OK ] Endpoint/SlaveEndpointTest.NoAuthorizer/2 (136 ms)
[----------] 9 tests from Endpoint/SlaveEndpointTest (1280 ms total)

[----------] 2 tests from ContainerizerType/DefaultContainerDNSFlagTest
[ RUN      ] ContainerizerType/DefaultContainerDNSFlagTest.ValidateFlag/0
[       OK ] ContainerizerType/DefaultContainerDNSFlagTest.ValidateFlag/0 (53 ms)
[ RUN      ] ContainerizerType/DefaultContainerDNSFlagTest.ValidateFlag/1
[       OK ] ContainerizerType/DefaultContainerDNSFlagTest.ValidateFlag/1 (46 ms)
[----------] 2 tests from ContainerizerType/DefaultContainerDNSFlagTest (101 ms total)

[----------] 1 test from IsolationFlag/CpuIsolatorTest
[ RUN      ] IsolationFlag/CpuIsolatorTest.ROOT_UserCpuUsage/0
[       OK ] IsolationFlag/CpuIsolatorTest.ROOT_UserCpuUsage/0 (2456 ms)
[----------] 1 test from IsolationFlag/CpuIsolatorTest (2486 ms total)

[----------] 1 test from IsolationFlag/MemoryIsolatorTest
[ RUN      ] IsolationFlag/MemoryIsolatorTest.ROOT_MemUsage/0
[       OK ] IsolationFlag/MemoryIsolatorTest.ROOT_MemUsage/0 (2587 ms)
[----------] 1 test from IsolationFlag/MemoryIsolatorTest (2618 ms total)

[----------] Global test environment tear-down
[==========] 915 tests from 90 test cases ran. (495952 ms total)
[  PASSED  ] 914 tests.
[  FAILED  ] 1 test, listed below:
[  FAILED  ] CommandExecutorCheckTest.CommandCheckTimeout

 1 FAILED TEST
  YOU HAVE 211 DISABLED TESTS

```

- [mesos-tests-stderr.log](http://dcos-win.westus.cloudapp.azure.com/mesos-build/review/65836/logs/mesos-tests-stderr.log):

```
I0228 15:01:19.916844 10156 master.cpp:10258] Updating the state of task de8ea35e-d93e-4364-b5fd-5cc477c26c35
of framework f36cdc6f-32a8-4df9-b422-92c0b309b053-0000 (latest state: TASK_KILLED, status
update state: TASK_KILLED)
I0228 15:01:19.916844  5552 slave.cpp:3879] Shutting down framework f36cdc6f-32a8-4df9-b422-92c0b309b053-0000
I0228 15:01:19.917840  5552 slave.cpp:6586] Shutting down executor 'de8ea35e-d93e-4364-b5fd-5cc477c26c35'
of framework f36cdc6f-32a8-4df9-b422-92c0b309b053-0000 at executor(1)@10.3.1.5:58210
I0228 15:01:19.919838  5552 slave.cpp:922] Agent terminating
W0228 15:01:19.919838  5552 slave.cpp:3875] Ignoring shutdown framework f36cdc6f-32a8-4df9-b422-92c0b309b053-0000
because it is terminating
I0228 15:01:19.920837 10156 master.cpp:10357] Removing task de8ea35e-d93e-4364-b5fd-5cc477c26c35
with resources cpus(allocated: *):4; mem(allocated: *):2048; disk(allocated: *):1024; ports(allocated:
*):[31000-32000] of framework f36cdc6f-32a8-4df9-b422-92c0b309b053-0000 on agent f36cdc6f-32a8-4df9-b422-92c0b309b053-S0
at slave(398)@10.3.1.5:58189 (build-srv-04.zq4gsI0228 15:01:19.205835  8060 exec.cpp:162]
Version: 1.6.0
I0228 15:01:19.234833  4996 exec.cpp:236] Executor registered on agent f36cdc6f-32a8-4df9-b422-92c0b309b053-S0
I0228 15:01:19.238837  9160 executor.cpp:176] Received SUBSCRIBED event
I0228 15:01:19.243836  9160 executor.cpp:180] Subscribed executor on build-srv-04.zq4gs31qjdiunm1ryi1452nvnh.dx.internal.cloudapp.net
I0228 15:01:19.244840  9160 executor.cpp:176] Received LAUNCH event
I0228 15:01:19.249845  9160 executor.cpp:648] Starting task de8ea35e-d93e-4364-b5fd-5cc477c26c35
I0228 15:01:19.337836  9160 executor.cpp:483] Running 'D:\DCOS\mesos\src\mesos-containerizer.exe
launch <POSSIBLY-SENSITIVE-DATA>'
I0228 15:01:19.883836  9160 executor.cpp:661] Forked command at 7392
I0228 15:01:19.920837  5948 exec.cpp:445] Executor asked to shutdown
I0228 15:01:19.921836  9160 executor.cpp:176] Received SHUTDOWN event
I0228 15:01:19.921836  9160 executor.cpp:758] Shutting down
I0228 15:01:19.921836  9160 executor.cpp:868] Sending SIGTERM to process tree at pid 731qjdiunm1ryi1452nvnh.dx.internal.cloudapp.net)
I0228 15:01:19.922837  4452 containerizer.cpp:2338] Destroying container 4044b451-15f2-4985-af2c-aecce0b851b9
in RUNNING state
I0228 15:01:19.922837  4452 containerizer.cpp:2952] Transitioning the state of container 4044b451-15f2-4985-af2c-aecce0b851b9
from RUNNING to DESTROYING
I0228 15:01:19.923840  4452 launcher.cpp:156] Asked to destroy container 4044b451-15f2-4985-af2c-aecce0b851b9
I0228 15:01:19.924841 10156 master.cpp:1306] Agent f36cdc6f-32a8-4df9-b422-92c0b309b053-S0
at slave(398)@10.3.1.5:58189 (build-srv-04.zq4gs31qjdiunm1ryi1452nvnh.dx.internal.cloudapp.net)
disconnected
I0228 15:01:19.924841 10156 master.cpp:3276] Disconnecting agent f36cdc6f-32a8-4df9-b422-92c0b309b053-S0
at slave(398)@10.3.1.5:58189 (build-srv-04.zq4gs31qjdiunm1ryi1452nvnh.dx.internal.cloudapp.net)
I0228 15:01:19.924841 10156 master.cpp:3295] Deactivating agent f36cdc6f-32a8-4df9-b422-92c0b309b053-S0
at slave(398)@10.3.1.5:58189 (build-srv-04.zq4gs31qjdiunm1ryi1452nvnh.dx.internal.cloudapp.net)
I0228 15:01:19.925839  4080 hierarchical.cpp:344] Removed framework f36cdc6f-32a8-4df9-b422-92c0b309b053-0000
I0228 15:01:19.926836  4120 hierarchical.cpp:766] Agent f36cdc6f-32a8-4df9-b422-92c0b309b053-S0
deactivated
I0228 15:01:20.010064  9644 containerizer.cpp:2791] Container 4044b451-15f2-4985-af2c-aecce0b851b9
has exited
I0228 15:01:20.048038  7440 master.cpp:1149] Master terminating
I0228 15:01:20.050037  4120 hierarchical.cpp:609] Removed agent f36cdc6f-32a8-4df9-b422-92c0b309b053-S0
I0228 15:01:20.679186  2464 process.cpp:929] Stopped the socket accept loop
```

- Mesos Reviewbot Windows


On Feb. 28, 2018, 1:56 p.m., Benno Evers wrote:
> 
> -----------------------------------------------------------
> This is an automatically generated e-mail. To reply, visit:
> https://reviews.apache.org/r/65836/
> -----------------------------------------------------------
> 
> (Updated Feb. 28, 2018, 1:56 p.m.)
> 
> 
> Review request for mesos.
> 
> 
> Repository: mesos
> 
> 
> Description
> -------
> 
> WIP: Random source in mesos.
> 
> 
> Diffs
> -----
> 
>   src/common/random.hpp PRE-CREATION 
> 
> 
> Diff: https://reviews.apache.org/r/65836/diff/1/
> 
> 
> Testing
> -------
> 
> 
> Thanks,
> 
> Benno Evers
> 
>


Mime
  • Unnamed multipart/alternative (inline, None, 0 bytes)
View raw message