mesos-reviews mailing list archives

Site index · List index
Message view « Date » · « Thread »
Top « Date » · « Thread »
From Mesos Reviewbot Windows <revi...@mesos.apache.org>
Subject Re: Review Request 65661: Updated comment and variables to decouple quota limit and guarantee.
Date Wed, 28 Feb 2018 21:10:24 GMT

-----------------------------------------------------------
This is an automatically generated e-mail. To reply, visit:
https://reviews.apache.org/r/65661/#review198407
-----------------------------------------------------------



FAIL: Some of the unit tests failed. Please check the relevant logs.

Reviews applied: `['65661']`

Failed command: `Start-MesosCITesting`

All the build artifacts available at: http://dcos-win.westus.cloudapp.azure.com/mesos-build/review/65661

Relevant logs:

- [mesos-tests-stdout.log](http://dcos-win.westus.cloudapp.azure.com/mesos-build/review/65661/logs/mesos-tests-stdout.log):

```
[ RUN      ] ContainerizerType/DefaultContainerDNSFlagTest.ValidateFlag/0
[       OK ] ContainerizerType/DefaultContainerDNSFlagTest.ValidateFlag/0 (39 ms)
[ RUN      ] ContainerizerType/DefaultContainerDNSFlagTest.ValidateFlag/1
[       OK ] ContainerizerType/DefaultContainerDNSFlagTest.ValidateFlag/1 (46 ms)
[----------] 2 tests from ContainerizerType/DefaultContainerDNSFlagTest (87 ms total)

[----------] 1 test from IsolationFlag/CpuIsolatorTest
[ RUN      ] IsolationFlag/CpuIsolatorTest.ROOT_UserCpuUsage/0
[       OK ] IsolationFlag/CpuIsolatorTest.ROOT_UserCpuUsage/0 (2453 ms)
[----------] 1 test from IsolationFlag/CpuIsolatorTest (2477 ms total)

[----------] 1 test from IsolationFlag/MemoryIsolatorTest
[ RUN      ] IsolationFlag/MemoryIsolatorTest.ROOT_MemUsage/0
[       OK ] IsolationFlag/MemoryIsolatorTest.ROOT_MemUsage/0 (2462 ms)
[----------] 1 test from IsolationFlag/MemoryIsolatorTest (2486 ms total)

[----------] Global test environment tear-down
D:\DCOS\mesos\mesos\src\tests\environment.cpp(950): error: Failed
Tests completed with child processes remaining:
-+- 7616 00000092B2EFDFFC
 --- 1212 00000092B2EFDFFC
[==========] 915 tests from 90 test cases ran. (483191 ms total)
[  PASSED  ] 914 tests.
[  FAILED  ] 1 test, listed below:
[  FAILED  ] CommandExecutorCheckTest.CommandCheckTimeout

 1 FAILED TEST
  YOU HAVE 211 DISABLED TESTS

```

- [mesos-tests-stderr.log](http://dcos-win.westus.cloudapp.azure.com/mesos-build/review/65661/logs/mesos-tests-stderr.log):

```
I0228 21:10:10.175643  1392 slave.cpp:3879] Shutting down framework 063cb035-d536-49c9-aeb8-c1d9e597d682-0000
I0228 21:10:10.175643  4032 master.cpp:10258] Updating the state of task d04903f2-ef59-452d-a383-005e158b4c62
of framework 063cb035-d536-49c9-aeb8-c1d9e597d682-0000 (I0228 21:10:09.460642  9668 exec.cpp:162]
Version: 1.6.0
I0228 21:10:09.495640  6748 exec.cpp:236] Executor registered on agent 063cb035-d536-49c9-aeb8-c1d9e597d682-S0
I0228 21:10:09.499639  9808 executor.cpp:176] Received SUBSCRIBED event
I0228 21:10:09.504665  9808 executor.cpp:180] Subscribed executor on build-srv-04.zq4gs31qjdiunm1ryi1452nvnh.dx.internal.cloudapp.net
I0228 21:10:09.504665  9808 executor.cpp:176] Received LAUNCH event
I0228 21:10:09.509665  9808 executor.cpp:648] Starting task d04903f2-ef59-452d-a383-005e158b4c62
I0228 21:10:09.591665  9808 executor.cpp:483] Running 'D:\DCOS\mesos\src\mesos-containerizer.exe
launch <POSSIBLY-SENSITIVE-DATA>'
I0228 21:10:10.136643  9808 executor.cpp:661] Forked command at 888
I0228 21:10:10.178644  9820 exec.cpp:445] Executor asked to shutdown
I0228 21:10:10.179644  9808 executor.cpp:176] Received SHUTDOWN event
I0228 21:10:10.179644  9808 executor.cpp:758] Shutting down
I0228 21:10:10.179644  9808 executor.cpp:868] Sending SIGTERM to process tree at pid 88latest
state: TASK_KILLED, status update state: TASK_KILLED)
I0228 21:10:10.175643  1392 slave.cpp:6586] Shutting down executor 'd04903f2-ef59-452d-a383-005e158b4c62'
of framework 063cb035-d536-49c9-aeb8-c1d9e597d682-0000 at executor(1)@10.3.1.5:50637
I0228 21:10:10.177644  1392 slave.cpp:922] Agent terminating
W0228 21:10:10.177644  1392 slave.cpp:3875] Ignoring shutdown framework 063cb035-d536-49c9-aeb8-c1d9e597d682-0000
because it is terminating
I0228 21:10:10.180647  4032 master.cpp:10357] Removing task d04903f2-ef59-452d-a383-005e158b4c62
with resources cpus(allocated: *):4; mem(allocated: *):2048; disk(allocated: *):1024; ports(allocated:
*):[31000-32000] of framework 063cb035-d536-49c9-aeb8-c1d9e597d682-0000 on agent 063cb035-d536-49c9-aeb8-c1d9e597d682-S0
at slave(398)@10.3.1.5:50616 (build-srv-04.zq4gs31qjdiunm1ryi1452nvnh.dx.internal.cloudapp.net)
I0228 21:10:10.180647  9468 containerizer.cpp:2338] Destroying container ea80a9a4-db8e-4057-a2e4-489d5915cf5a
in RUNNING state
I0228 21:10:10.180647  9468 containerizer.cpp:2952] Transitioning the state of container ea80a9a4-db8e-4057-a2e4-489d5915cf5a
from RUNNING to DESTROYING
I0228 21:10:10.182643  9468 launcher.cpp:156] Asked to destroy container ea80a9a4-db8e-4057-a2e4-489d5915cf5a
I0228 21:10:10.183642  4032 master.cpp:1306] Agent 063cb035-d536-49c9-aeb8-c1d9e597d682-S0
at slave(398)@10.3.1.5:50616 (build-srv-04.zq4gs31qjdiunm1ryi1452nvnh.dx.internal.cloudapp.net)
disconnected
I0228 21:10:10.183642  4032 master.cpp:3276] Disconnecting agent 063cb035-d536-49c9-aeb8-c1d9e597d682-S0
at slave(398)@10.3.1.5:50616 (build-srv-04.zq4gs31qjdiunm1ryi1452nvnh.dx.internal.cloudapp.net)
I0228 21:10:10.183642 10108 hierarchical.cpp:344] Removed framework 063cb035-d536-49c9-aeb8-c1d9e597d682-0000
I0228 21:10:10.183642  4032 master.cpp:3295] Deactivating agent 063cb035-d536-49c9-aeb8-c1d9e597d682-S0
at slave(398)@10.3.1.5:50616 (build-srv-04.zq4gs31qjdiunm1ryi1452nvnh.dx.internal.cloudapp.net)
I0228 21:10:10.183642  5712 hierarchical.cpp:766] Agent 063cb035-d536-49c9-aeb8-c1d9e597d682-S0
deactivated
I0228 21:10:10.186641  9468 containerizer.cpp:2791] Container ea80a9a4-db8e-4057-a2e4-489d5915cf5a
has exited
I0228 21:10:10.218668  3444 master.cpp:1149] Master terminating
I0228 21:10:10.220643  9468 hierarchical.cpp:609] Removed agent 063cb035-d536-49c9-aeb8-c1d9e597d682-S0
I0228 21:10:10.893365  6812 process.cpp:929] Stopped the socket accept loop
```

- Mesos Reviewbot Windows


On Feb. 15, 2018, 10:42 p.m., Meng Zhu wrote:
> 
> -----------------------------------------------------------
> This is an automatically generated e-mail. To reply, visit:
> https://reviews.apache.org/r/65661/
> -----------------------------------------------------------
> 
> (Updated Feb. 15, 2018, 10:42 p.m.)
> 
> 
> Review request for mesos, Benjamin Mahler, Kapil Arya, Joseph Wu, Michael Park, and Till
Toenshoff.
> 
> 
> Bugs: MESOS-8456
>     https://issues.apache.org/jira/browse/MESOS-8456
> 
> 
> Repository: mesos
> 
> 
> Description
> -------
> 
> We currently do not differentiate between quota guarantee and limit
> i.e. quota currently is set for both guarantee and limit. As a
> first step to introduce quota limit, comments and related variable
> names are updated to reflect the difference between quota guarantee
> and limit.
> 
> Also fixed a few typos and removed some outdated comments.
> 
> 
> Diffs
> -----
> 
>   src/master/allocator/mesos/hierarchical.hpp 37d2df58d374f118697fb5848c36f78b3e65128d

>   src/master/allocator/mesos/hierarchical.cpp 58aa83ffdb194bbb9bb518a6b77e23fa49d340f4

> 
> 
> Diff: https://reviews.apache.org/r/65661/diff/3/
> 
> 
> Testing
> -------
> 
> make check
> 
> 
> Thanks,
> 
> Meng Zhu
> 
>


Mime
  • Unnamed multipart/alternative (inline, None, 0 bytes)
View raw message