mesos-reviews mailing list archives

Site index · List index
Message view « Date » · « Thread »
Top « Date » · « Thread »
From Mesos Reviewbot Windows <revi...@mesos.apache.org>
Subject Re: Review Request 65847: Fixed allocator test `QuotaAbsentFramework`.
Date Wed, 28 Feb 2018 22:10:53 GMT

-----------------------------------------------------------
This is an automatically generated e-mail. To reply, visit:
https://reviews.apache.org/r/65847/#review198412
-----------------------------------------------------------



FAIL: Some of the unit tests failed. Please check the relevant logs.

Reviews applied: `['65661', '65819', '65820', '65821', '65844', '65845', '65847']`

Failed command: `Start-MesosCITesting`

All the build artifacts available at: http://dcos-win.westus.cloudapp.azure.com/mesos-build/review/65847

Relevant logs:

- [mesos-tests-stdout.log](http://dcos-win.westus.cloudapp.azure.com/mesos-build/review/65847/logs/mesos-tests-stdout.log):

```
[       OK ] Endpoint/SlaveEndpointTest.NoAuthorizer/2 (133 ms)
[----------] 9 tests from Endpoint/SlaveEndpointTest (1215 ms total)

[----------] 2 tests from ContainerizerType/DefaultContainerDNSFlagTest
[ RUN      ] ContainerizerType/DefaultContainerDNSFlagTest.ValidateFlag/0
[       OK ] ContainerizerType/DefaultContainerDNSFlagTest.ValidateFlag/0 (38 ms)
[ RUN      ] ContainerizerType/DefaultContainerDNSFlagTest.ValidateFlag/1
[       OK ] ContainerizerType/DefaultContainerDNSFlagTest.ValidateFlag/1 (42 ms)
[----------] 2 tests from ContainerizerType/DefaultContainerDNSFlagTest (82 ms total)

[----------] 1 test from IsolationFlag/CpuIsolatorTest
[ RUN      ] IsolationFlag/CpuIsolatorTest.ROOT_UserCpuUsage/0
[       OK ] IsolationFlag/CpuIsolatorTest.ROOT_UserCpuUsage/0 (2495 ms)
[----------] 1 test from IsolationFlag/CpuIsolatorTest (2525 ms total)

[----------] 1 test from IsolationFlag/MemoryIsolatorTest
[ RUN      ] IsolationFlag/MemoryIsolatorTest.ROOT_MemUsage/0
[       OK ] IsolationFlag/MemoryIsolatorTest.ROOT_MemUsage/0 (2559 ms)
[----------] 1 test from IsolationFlag/MemoryIsolatorTest (2584 ms total)

[----------] Global test environment tear-down
[==========] 915 tests from 90 test cases ran. (498283 ms total)
[  PASSED  ] 914 tests.
[  FAILED  ] 1 test, listed below:
[  FAILED  ] CommandExecutorCheckTest.CommandCheckTimeout

 1 FAILED TEST
  YOU HAVE 211 DISABLED TESTS

```

- [mesos-tests-stderr.log](http://dcos-win.westus.cloudapp.azure.com/mesos-build/review/65847/logs/mesos-tests-stderr.log):

```
I0228 22:10:39.230201  9160 slave.cpp:3879] Shutting down framework 4cb7c9f6-982b-44eb-bf6a-cdbf9bd88bbb-0000
I0228 22:10:39.230201 10216 master.cpp:10258] Updating the state of task 385eeb95-6621-493f-86e2-e1305ac9e884
of framework 4cb7c9f6-982b-44eb-bf6a-cdbf9bd88bbb-0000 (latest state: TASK_KILLED, status
update state: TASK_KILLED)
I0228 22:10:39.231204  9160 slave.cpp:6586] Shutting down executor '385eeb95-6621-493f-86e2-e1305ac9e884'
of framework 4cb7c9f6-982b-44eb-bf6a-cdbf9bd88bbb-0000 at executor(1)@10.3.1.5:52835
I0228 22:10:39.232201  9160 slave.cpp:922] Agent terminating
W0228 22:10:39.233201  9160 slave.cpp:3875] Ignoring shutdown framework 4cb7c9f6-982b-44eb-bf6a-cdbf9bd88bbb-0000
because it is terminating
I0228 22:10:39.234201 10216 master.cpp:10357] Removing task 385eeb95-6621-493f-86e2-e1305ac9e884
with resources ports(allocated: *):[31000-32000]; disk(allocated: *):1024; cpus(allocated:
*):4; mem(allocated: *):2048 of framework 4cb7c9f6-982b-44eb-bf6a-cdbf9bd88bbb-0000 on agent
4cb7c9f6-982b-44eb-bf6a-cdbf9bd88bbb-S0 at slave(398)@10.3.1.5:52814 (build-srv-04.zq4gs31qjI0228
22:10:38.525193  5524 exec.cpp:162] Version: 1.6.0
I0228 22:10:38.553197  7144 exec.cpp:236] Executor registered on agent 4cb7c9f6-982b-44eb-bf6a-cdbf9bd88bbb-S0
I0228 22:10:38.558202  7452 executor.cpp:176] Received SUBSCRIBED event
I0228 22:10:38.563199  7452 executor.cpp:180] Subscribed executor on build-srv-04.zq4gs31qjdiunm1ryi1452nvnh.dx.internal.cloudapp.net
I0228 22:10:38.564200  7452 executor.cpp:176] Received LAUNCH event
I0228 22:10:38.569198  7452 executor.cpp:648] Starting task 385eeb95-6621-493f-86e2-e1305ac9e884
I0228 22:10:38.652200  7452 executor.cpp:483] Running 'D:\DCOS\mesos\src\mesos-containerizer.exe
launch <POSSIBLY-SENSITIVE-DATA>'
I0228 22:10:39.198199  7452 executor.cpp:661] Forked command at 1656
I0228 22:10:39.233201  1292 exec.cpp:445] Executor asked to shutdown
I0228 22:10:39.234201  7452 executor.cpp:176] Received SHUTDOWN event
I0228 22:10:39.235203  7452 executor.cpp:758] Shutting down
I0228 22:10:39.235203  7452 executor.cpp:868] Sending SIGTERM to process tree at pid 1diunm1ryi1452nvnh.dx.internal.cloudapp.net)
I0228 22:10:39.236205  9160 containerizer.cpp:2338] Destroying container e8ed2a08-2f14-45fb-b6c7-a6065d1f636a
in RUNNING state
I0228 22:10:39.236205  9160 containerizer.cpp:2952] Transitioning the state of container e8ed2a08-2f14-45fb-b6c7-a6065d1f636a
from RUNNING to DESTROYING
I0228 22:10:39.237200 10216 master.cpp:1306] Agent 4cb7c9f6-982b-44eb-bf6a-cdbf9bd88bbb-S0
at slave(398)@10.3.1.5:52814 (build-srv-04.zq4gs31qjdiunm1ryi1452nvnh.dx.internal.cloudapp.net)
disconnected
I0228 22:10:39.237200 10216 master.cpp:3276] Disconnecting agent 4cb7c9f6-982b-44eb-bf6a-cdbf9bd88bbb-S0
at slave(398)@10.3.1.5:52814 (build-srv-04.zq4gs31qjdiunm1ryi1452nvnh.dx.internal.cloudapp.net)
I0228 22:10:39.237200  9160 launcher.cpp:156] Asked to destroy container e8ed2a08-2f14-45fb-b6c7-a6065d1f636a
I0228 22:10:39.238199 10216 master.cpp:3295] Deactivating agent 4cb7c9f6-982b-44eb-bf6a-cdbf9bd88bbb-S0
at slave(398)@10.3.1.5:52814 (build-srv-04.zq4gs31qjdiunm1ryi1452nvnh.dx.internal.cloudapp.net)
I0228 22:10:39.238199  6592 hierarchical.cpp:344] Removed framework 4cb7c9f6-982b-44eb-bf6a-cdbf9bd88bbb-0000
I0228 22:10:39.239202  8468 hierarchical.cpp:766] Agent 4cb7c9f6-982b-44eb-bf6a-cdbf9bd88bbb-S0
deactivated
I0228 22:10:39.254202  3164 containerizer.cpp:2791] Container e8ed2a08-2f14-45fb-b6c7-a6065d1f636a
has exited
I0228 22:10:39.286200  4960 master.cpp:1149] Master terminating
I0228 22:10:39.289203  9160 hierarchical.cpp:609] Removed agent 4cb7c9f6-982b-44eb-bf6a-cdbf9bd88bbb-S0
I0228 22:10:39.878571  6140 process.cpp:929] Stopped the socket accept loop
```

- Mesos Reviewbot Windows


On Feb. 28, 2018, 9 p.m., Meng Zhu wrote:
> 
> -----------------------------------------------------------
> This is an automatically generated e-mail. To reply, visit:
> https://reviews.apache.org/r/65847/
> -----------------------------------------------------------
> 
> (Updated Feb. 28, 2018, 9 p.m.)
> 
> 
> Review request for mesos, Benjamin Mahler and Michael Park.
> 
> 
> Bugs: MESOS-8456
>     https://issues.apache.org/jira/browse/MESOS-8456
> 
> 
> Repository: mesos
> 
> 
> Description
> -------
> 
> `QuotaAbsentFramework` assumes the coarse grained nature
> of second stage resource allocation. This is no longer
> true given #65821. This patch fixes the test by asserting
> the allocation in terms of quantity.
> 
> 
> Diffs
> -----
> 
>   src/tests/hierarchical_allocator_tests.cpp c97b2ba0884a7ded867c2d80e4749de54c89b5e4

> 
> 
> Diff: https://reviews.apache.org/r/65847/diff/1/
> 
> 
> Testing
> -------
> 
> make check
> 
> 
> Thanks,
> 
> Meng Zhu
> 
>


Mime
  • Unnamed multipart/alternative (inline, None, 0 bytes)
View raw message