mesos-reviews mailing list archives

Site index · List index
Message view « Date » · « Thread »
Top « Date » · « Thread »
From Mesos Reviewbot Windows <revi...@mesos.apache.org>
Subject Re: Review Request 66260: Added test for max duration support in command executor.
Date Fri, 23 Mar 2018 22:31:52 GMT

-----------------------------------------------------------
This is an automatically generated e-mail. To reply, visit:
https://reviews.apache.org/r/66260/#review199916
-----------------------------------------------------------



FAIL: Some of the unit tests failed. Please check the relevant logs.

Reviews applied: `['66258', '66259', '66260']`

Failed command: `Start-MesosCITesting`

All the build artifacts available at: http://dcos-win.westus.cloudapp.azure.com/mesos-build/review/66260

Relevant logs:

- [mesos-tests-stdout.log](http://dcos-win.westus.cloudapp.azure.com/mesos-build/review/66260/logs/mesos-tests-stdout.log):

```
[       OK ] Endpoint/SlaveEndpointTest.NoAuthorizer/2 (119 ms)
[----------] 9 tests from Endpoint/SlaveEndpointTest (1112 ms total)

[----------] 2 tests from ContainerizerType/DefaultContainerDNSFlagTest
[ RUN      ] ContainerizerType/DefaultContainerDNSFlagTest.ValidateFlag/0
[       OK ] ContainerizerType/DefaultContainerDNSFlagTest.ValidateFlag/0 (33 ms)
[ RUN      ] ContainerizerType/DefaultContainerDNSFlagTest.ValidateFlag/1
[       OK ] ContainerizerType/DefaultContainerDNSFlagTest.ValidateFlag/1 (37 ms)
[----------] 2 tests from ContainerizerType/DefaultContainerDNSFlagTest (72 ms total)

[----------] 1 test from IsolationFlag/CpuIsolatorTest
[ RUN      ] IsolationFlag/CpuIsolatorTest.ROOT_UserCpuUsage/0
[       OK ] IsolationFlag/CpuIsolatorTest.ROOT_UserCpuUsage/0 (854 ms)
[----------] 1 test from IsolationFlag/CpuIsolatorTest (879 ms total)

[----------] 1 test from IsolationFlag/MemoryIsolatorTest
[ RUN      ] IsolationFlag/MemoryIsolatorTest.ROOT_MemUsage/0
[       OK ] IsolationFlag/MemoryIsolatorTest.ROOT_MemUsage/0 (730 ms)
[----------] 1 test from IsolationFlag/MemoryIsolatorTest (756 ms total)

[----------] Global test environment tear-down
[==========] 951 tests from 94 test cases ran. (453157 ms total)
[  PASSED  ] 950 tests.
[  FAILED  ] 1 test, listed below:
[  FAILED  ] CommandExecutorCheckTest.CommandCheckTimeout

 1 FAILED TEST
  YOU HAVE 215 DISABLED TESTS

```

- [mesos-tests-stderr.log](http://dcos-win.westus.cloudapp.azure.com/mesos-build/review/66260/logs/mesos-tests-stderr.log):

```
I0323 22:31:39.317957  7136 slave.cpp:3873] Shutting down framework 31df7ef4-0d63-49b1-acbd-8819c7106a6f-0000
I0323 22:31:39.317957  7164 master.cpp:10446] Updating the state of task 1d099e46-1c75-4a25-8baf-29054289a09b
of framework 31df7ef4I0323 22:31:39.140944  1756 exec.cpp:162] Version: 1.6.0
I0323 22:31:39.166954  6068 exec.cpp:236] Executor registered on agent 31df7ef4-0d63-49b1-acbd-8819c7106a6f-S0
I0323 22:31:39.170991  6440 executor.cpp:176] Received SUBSCRIBED event
I0323 22:31:39.175979  6440 executor.cpp:180] Subscribed executor on winbldsrv-01.zq4gs31qjdiunm1ryi1452nvnh.dx.internal.cloudapp.net
I0323 22:31:39.176986  6440 executor.cpp:176] Received LAUNCH event
I0323 22:31:39.180982  6440 executor.cpp:656] Starting task 1d099e46-1c75-4a25-8baf-29054289a09b
I0323 22:31:39.260988  6440 executor.cpp:483] Running 'D:\DCOS\mesos\src\mesos-containerizer.exe
launch <POSSIBLY-SENSITIVE-DATA>'
I0323 22:31:39.292974  6440 executor.cpp:669] Forked command at 6896
I0323 22:31:39.319953  9572 exec.cpp:445] Executor asked to shutdown
I0323 22:31:39.322062  6792 executor.cpp:176] Received SHUTDOWN event
I0323 22:31:39.322062  6792 executor.cpp:773] Shutting down
I0323 22:31:39.322062  6792 executor.cpp:884] Sending SIGTERM to process tree at pid 6-0d63-49b1-acbd-8819c7106a6f-0000
(latest state: TASK_KILLED, status update state: TASK_KILLED)
I0323 22:31:39.317957  7136 slave.cpp:6566] Shutting down executor '1d099e46-1c75-4a25-8baf-29054289a09b'
of framework 31df7ef4-0d63-49b1-acbd-8819c7106a6f-0000 at executor(1)@10.3.1.8:56910
I0323 22:31:39.319953  7136 slave.cpp:919] Agent terminating
W0323 22:31:39.319953  7136 slave.cpp:3869] Ignoring shutdown framework 31df7ef4-0d63-49b1-acbd-8819c7106a6f-0000
because it is terminating
I0323 22:31:39.322062  7164 master.cpp:10545] Removing task 1d099e46-1c75-4a25-8baf-29054289a09b
with resources cpus(allocated: *):4; mem(allocated: *):2048; disk(allocated: *):1024; ports(allocated:
*):[31000-32000] of framework 31df7ef4-0d63-49b1-acbd-8819c7106a6f-0000 on agent 31df7ef4-0d63-49b1-acbd-8819c7106a6f-S0
at slave(420)@10.3.1.8:56889 (winbldsrv-01.zq4gs31qjdiunm1ryi1452nvnh.dx.internal.cloudapp.net)
I0323 22:31:39.323974  7136 containerizer.cpp:2338] Destroying container 2210c917-87d9-4c26-b080-602e84c35bbf
in RUNNING state
I0323 22:31:39.323974  7164 master.cpp:1295] Agent 31df7ef4-0d63-49b1-acbd-8819c7106a6f-S0
at slave(420)@10.3.1.8:56889 (winbldsrv-01.zq4gs31qjdiunm1ryi1452nvnh.dx.internal.cloudapp.net)
disconnected
I0323 22:31:39.324966  7164 master.cpp:3283] Disconnecting agent 31df7ef4-0d63-49b1-acbd-8819c7106a6f-S0
at slave(420)@10.3.1.8:56889 (winbldsrv-01.zq4gs31qjdiunm1ryi1452nvnh.dx.internal.cloudapp.net)
I0323 22:31:39.324966  7136 containerizer.cpp:2952] Transitioning the state of container 2210c917-87d9-4c26-b080-602e84c35bbf
from RUNNING to DESTROYING
I0323 22:31:39.324966  7164 master.cpp:3302] Deactivating agent 31df7ef4-0d63-49b1-acbd-8819c7106a6f-S0
at slave(420)@10.3.1.8:56889 (winbldsrv-01.zq4gs31qjdiunm1ryi1452nvnh.dx.internal.cloudapp.net)
I0323 22:31:39.325992  7136 launcher.cpp:156] Asked to destroy container 2210c917-87d9-4c26-b080-602e84c35bbf
I0323 22:31:39.325992 10036 hierarchical.cpp:344] Removed framework 31df7ef4-0d63-49b1-acbd-8819c7106a6f-0000
I0323 22:31:39.325992 10036 hierarchical.cpp:766] Agent 31df7ef4-0d63-49b1-acbd-8819c7106a6f-S0
deactivated
I0323 22:31:39.341245  5240 containerizer.cpp:2791] Container 2210c917-87d9-4c26-b080-602e84c35bbf
has exited
I0323 22:31:39.374238  7492 master.cpp:1137] Master terminating
I0323 22:31:39.376235 10048 hierarchical.cpp:609] Removed agent 31df7ef4-0d63-49b1-acbd-8819c7106a6f-S0
I0323 22:31:39.739245 10232 process.cpp:929] Stopped the socket accept loop
```

- Mesos Reviewbot Windows


On March 23, 2018, 8:52 p.m., Zhitao Li wrote:
> 
> -----------------------------------------------------------
> This is an automatically generated e-mail. To reply, visit:
> https://reviews.apache.org/r/66260/
> -----------------------------------------------------------
> 
> (Updated March 23, 2018, 8:52 p.m.)
> 
> 
> Review request for mesos, Jason Lai and James Peach.
> 
> 
> Bugs: MESOS-8725
>     https://issues.apache.org/jira/browse/MESOS-8725
> 
> 
> Repository: mesos
> 
> 
> Description
> -------
> 
> Added test for max duration support in command executor.
> 
> 
> Diffs
> -----
> 
>   src/tests/command_executor_tests.cpp 3c5687f918deb8cdda8a97abb0fbd8d9b089926a 
> 
> 
> Diff: https://reviews.apache.org/r/66260/diff/1/
> 
> 
> Testing
> -------
> 
> 
> Thanks,
> 
> Zhitao Li
> 
>


Mime
  • Unnamed multipart/alternative (inline, None, 0 bytes)
View raw message