mesos-reviews mailing list archives

Site index · List index
Message view « Date » · « Thread »
Top « Date » · « Thread »
From Mesos Reviewbot Windows <revi...@mesos.apache.org>
Subject Re: Review Request 66284: Added test for max duration support in docker executor.
Date Mon, 26 Mar 2018 19:26:34 GMT

-----------------------------------------------------------
This is an automatically generated e-mail. To reply, visit:
https://reviews.apache.org/r/66284/#review199989
-----------------------------------------------------------



FAIL: Some of the unit tests failed. Please check the relevant logs.

Reviews applied: `['66258', '66259', '66260', '66283', '66284']`

Failed command: `Start-MesosCITesting`

All the build artifacts available at: http://dcos-win.westus.cloudapp.azure.com/mesos-build/review/66284

Relevant logs:

- [mesos-tests-stdout.log](http://dcos-win.westus.cloudapp.azure.com/mesos-build/review/66284/logs/mesos-tests-stdout.log):

```
[       OK ] Endpoint/SlaveEndpointTest.NoAuthorizer/2 (117 ms)
[----------] 9 tests from Endpoint/SlaveEndpointTest (1094 ms total)

[----------] 2 tests from ContainerizerType/DefaultContainerDNSFlagTest
[ RUN      ] ContainerizerType/DefaultContainerDNSFlagTest.ValidateFlag/0
[       OK ] ContainerizerType/DefaultContainerDNSFlagTest.ValidateFlag/0 (34 ms)
[ RUN      ] ContainerizerType/DefaultContainerDNSFlagTest.ValidateFlag/1
[       OK ] ContainerizerType/DefaultContainerDNSFlagTest.ValidateFlag/1 (39 ms)
[----------] 2 tests from ContainerizerType/DefaultContainerDNSFlagTest (75 ms total)

[----------] 1 test from IsolationFlag/CpuIsolatorTest
[ RUN      ] IsolationFlag/CpuIsolatorTest.ROOT_UserCpuUsage/0
[       OK ] IsolationFlag/CpuIsolatorTest.ROOT_UserCpuUsage/0 (793 ms)
[----------] 1 test from IsolationFlag/CpuIsolatorTest (820 ms total)

[----------] 1 test from IsolationFlag/MemoryIsolatorTest
[ RUN      ] IsolationFlag/MemoryIsolatorTest.ROOT_MemUsage/0
[       OK ] IsolationFlag/MemoryIsolatorTest.ROOT_MemUsage/0 (824 ms)
[----------] 1 test from IsolationFlag/MemoryIsolatorTest (849 ms total)

[----------] Global test environment tear-down
[==========] 951 tests from 94 test cases ran. (463403 ms total)
[  PASSED  ] 950 tests.
[  FAILED  ] 1 test, listed below:
[  FAILED  ] CommandExecutorCheckTest.CommandCheckTimeout

 1 FAILED TEST
  YOU HAVE 214 DISABLED TESTS

```

- [mesos-tests-stderr.log](http://dcos-win.westus.cloudapp.azure.com/mesos-build/review/66284/logs/mesos-tests-stderr.log):

```
I0326 19:26:20.660912  9736 slave.cpp:3873] Shutting down framework b46389da-42a1-44c9-b8cc-9fcf72e9f16f-0000
I0326 19:26:20.660912 11556 master.cpp:10446] Updating the state of task 9282acbf-bc8e-4906-84ac-1f333e60a280
of framework b46389da-42a1-44c9-b8cc-9fcf72e9f16f-0000 (latest state: TASK_KILLED, status
update state: TASK_KILLED)
I0326 1I0326 19:26:20.458793  8092 exec.cpp:162] Version: 1.6.0
I0326 19:26:20.487803  6964 exec.cpp:236] Executor registered on agent b46389da-42a1-44c9-b8cc-9fcf72e9f16f-S0
I0326 19:26:20.491801 12184 executor.cpp:176] Received SUBSCRIBED event
I0326 19:26:20.495800 12184 executor.cpp:180] Subscribed executor on winbldsrv-01.zq4gs31qjdiunm1ryi1452nvnh.dx.internal.cloudapp.net
I0326 19:26:20.496800 12184 executor.cpp:176] Received LAUNCH event
I0326 19:26:20.501801 12184 executor.cpp:656] Starting task 9282acbf-bc8e-4906-84ac-1f333e60a280
I0326 19:26:20.590804 12184 executor.cpp:483] Running 'D:\DCOS\mesos\src\mesos-containerizer.exe
launch <POSSIBLY-SENSITIVE-DATA>'
I0326 19:26:20.626802 12184 executor.cpp:669] Forked command at 6736
I0326 19:26:20.662806 13332 exec.cpp:445] Executor asked to shutdown
I0326 19:26:20.663801  7840 executor.cpp:176] Received SHUTDOWN event
I0326 19:26:20.663801  7840 executor.cpp:773] Shutting down
I0326 19:26:20.663801  7840 executor.cpp:884] Sending SIGTERM to process tree at pid 69:26:20.660912
 9736 slave.cpp:6566] Shutting down executor '9282acbf-bc8e-4906-84ac-1f333e60a280' of framework
b46389da-42a1-44c9-b8cc-9fcf72e9f16f-0000 at executor(1)@10.3.1.8:62455
I0326 19:26:20.661806  9736 slave.cpp:919] Agent terminating
W0326 19:26:20.662806  9736 slave.cpp:3869] Ignoring shutdown framework b46389da-42a1-44c9-b8cc-9fcf72e9f16f-0000
because it is terminating
I0326 19:26:20.663801 11556 master.cpp:10545] Removing task 9282acbf-bc8e-4906-84ac-1f333e60a280
with resources cpus(allocated: *):4; mem(allocated: *):2048; disk(allocated: *):1024; ports(allocated:
*):[31000-32000] of framework b46389da-42a1-44c9-b8cc-9fcf72e9f16f-0000 on agent b46389da-42a1-44c9-b8cc-9fcf72e9f16f-S0
at slave(420)@10.3.1.8:62434 (winbldsrv-01.zq4gs31qjdiunm1ryi1452nvnh.dx.internal.cloudapp.net)
I0326 19:26:20.666810  2196 containerizer.cpp:2338] Destroying container d5bd841a-49f1-4b86-bc7f-b2657cd3f03d
in RUNNING state
I0326 19:26:20.666810  2196 containerizer.cpp:2952] Transitioning the state of container d5bd841a-49f1-4b86-bc7f-b2657cd3f03d
from RUNNING to DESTROYING
I0326 19:26:20.666810 11556 master.cpp:1295] Agent b46389da-42a1-44c9-b8cc-9fcf72e9f16f-S0
at slave(420)@10.3.1.8:62434 (winbldsrv-01.zq4gs31qjdiunm1ryi1452nvnh.dx.internal.cloudapp.net)
disconnected
I0326 19:26:20.667803 11556 master.cpp:3283] Disconnecting agent b46389da-42a1-44c9-b8cc-9fcf72e9f16f-S0
at slave(420)@10.3.1.8:62434 (winbldsrv-01.zq4gs31qjdiunm1ryi1452nvnh.dx.internal.cloudapp.net)
I0326 19:26:20.667803 12968 hierarchical.cpp:344] Removed framework b46389da-42a1-44c9-b8cc-9fcf72e9f16f-0000
I0326 19:26:20.667803 11556 master.cpp:3302] Deactivating agent b46389da-42a1-44c9-b8cc-9fcf72e9f16f-S0
at slave(420)@10.3.1.8:62434 (winbldsrv-01.zq4gs31qjdiunm1ryi1452nvnh.dx.internal.cloudapp.net)
I0326 19:26:20.668807  9392 hierarchical.cpp:766] Agent b46389da-42a1-44c9-b8cc-9fcf72e9f16f-S0
deactivated
I0326 19:26:20.668807  2196 launcher.cpp:156] Asked to destroy container d5bd841a-49f1-4b86-bc7f-b2657cd3f03d
I0326 19:26:20.708976  4268 containerizer.cpp:2791] Container d5bd841a-49f1-4b86-bc7f-b2657cd3f03d
has exited
I0326 19:26:20.744971  5816 master.cpp:1137] Master terminating
I0326 19:26:20.746981  9392 hierarchical.cpp:609] Removed agent b46389da-42a1-44c9-b8cc-9fcf72e9f16f-S0
I0326 19:26:21.178982 12784 process.cpp:929] Stopped the socket accept loop
```

- Mesos Reviewbot Windows


On March 26, 2018, 6:05 p.m., Zhitao Li wrote:
> 
> -----------------------------------------------------------
> This is an automatically generated e-mail. To reply, visit:
> https://reviews.apache.org/r/66284/
> -----------------------------------------------------------
> 
> (Updated March 26, 2018, 6:05 p.m.)
> 
> 
> Review request for mesos, Jason Lai and James Peach.
> 
> 
> Bugs: MESOS-8725
>     https://issues.apache.org/jira/browse/MESOS-8725
> 
> 
> Repository: mesos
> 
> 
> Description
> -------
> 
> Added test for max duration support in docker executor.
> 
> 
> Diffs
> -----
> 
>   src/tests/containerizer/docker_containerizer_tests.cpp c198ecbac50ef4eb7ea243bebc17b65db7ce5cb7

> 
> 
> Diff: https://reviews.apache.org/r/66284/diff/1/
> 
> 
> Testing
> -------
> 
> 
> Thanks,
> 
> Zhitao Li
> 
>


Mime
  • Unnamed multipart/alternative (inline, None, 0 bytes)
View raw message