mesos-reviews mailing list archives

Site index · List index
Message view « Date » · « Thread »
Top « Date » · « Thread »
From Mesos Reviewbot Windows <revi...@mesos.apache.org>
Subject Re: Review Request 66289: Added fields to GET_STATE necessary for streaming Web UI.
Date Tue, 27 Mar 2018 01:04:20 GMT

-----------------------------------------------------------
This is an automatically generated e-mail. To reply, visit:
https://reviews.apache.org/r/66289/#review200008
-----------------------------------------------------------



FAIL: Some of the unit tests failed. Please check the relevant logs.

Reviews applied: `['66289']`

Failed command: `Start-MesosCITesting`

All the build artifacts available at: http://dcos-win.westus.cloudapp.azure.com/mesos-build/review/66289

Relevant logs:

- [mesos-tests-stdout.log](http://dcos-win.westus.cloudapp.azure.com/mesos-build/review/66289/logs/mesos-tests-stdout.log):

```
[       OK ] Endpoint/SlaveEndpointTest.NoAuthorizer/2 (117 ms)
[----------] 9 tests from Endpoint/SlaveEndpointTest (1036 ms total)

[----------] 2 tests from ContainerizerType/DefaultContainerDNSFlagTest
[ RUN      ] ContainerizerType/DefaultContainerDNSFlagTest.ValidateFlag/0
[       OK ] ContainerizerType/DefaultContainerDNSFlagTest.ValidateFlag/0 (34 ms)
[ RUN      ] ContainerizerType/DefaultContainerDNSFlagTest.ValidateFlag/1
[       OK ] ContainerizerType/DefaultContainerDNSFlagTest.ValidateFlag/1 (38 ms)
[----------] 2 tests from ContainerizerType/DefaultContainerDNSFlagTest (75 ms total)

[----------] 1 test from IsolationFlag/CpuIsolatorTest
[ RUN      ] IsolationFlag/CpuIsolatorTest.ROOT_UserCpuUsage/0
[       OK ] IsolationFlag/CpuIsolatorTest.ROOT_UserCpuUsage/0 (761 ms)
[----------] 1 test from IsolationFlag/CpuIsolatorTest (786 ms total)

[----------] 1 test from IsolationFlag/MemoryIsolatorTest
[ RUN      ] IsolationFlag/MemoryIsolatorTest.ROOT_MemUsage/0
[       OK ] IsolationFlag/MemoryIsolatorTest.ROOT_MemUsage/0 (718 ms)
[----------] 1 test from IsolationFlag/MemoryIsolatorTest (745 ms total)

[----------] Global test environment tear-down
[==========] 949 tests from 94 test cases ran. (453722 ms total)
[  PASSED  ] 948 tests.
[  FAILED  ] 1 test, listed below:
[  FAILED  ] CommandExecutorCheckTest.CommandCheckTimeout

 1 FAILED TEST
  YOU HAVE 214 DISABLED TESTS

```

- [mesos-tests-stderr.log](http://dcos-win.westus.cloudapp.azure.com/mesos-build/review/66289/logs/mesos-tests-stderr.log):

```
I0327 01:04:07.623862  5676 master.cpp:10446] Updating the state of task 789877c6-9438-42e3-8e44-97aa4098e512
of framework 61cd0b26-dfbc-4577-a176-061fb99d4d26-0000 (latest state: TASK_KILLED, status
update state: TASK_KILLED)
I0327 01:04:07.623862 12848 slave.cpp:3873] I0327 01:04:07.464335 11584 exec.cpp:162] Version:
1.6.0
I0327 01:04:07.491863 12912 exec.cpp:236] Executor registered on agent 61cd0b26-dfbc-4577-a176-061fb99d4d26-S0
I0327 01:04:07.495851 10844 executor.cpp:176] Received SUBSCRIBED event
I0327 01:04:07.500859 10844 executor.cpp:180] Subscribed executor on winbldsrv-01.zq4gs31qjdiunm1ryi1452nvnh.dx.internal.cloudapp.net
I0327 01:04:07.501858 10844 executor.cpp:176] Received LAUNCH event
I0327 01:04:07.505858 10844 executor.cpp:648] Starting task 789877c6-9438-42e3-8e44-97aa4098e512
I0327 01:04:07.585861 10844 executor.cpp:483] Running 'D:\DCOS\mesos\src\mesos-containerizer.exe
launch <POSSIBLY-SENSITIVE-DATA>'
I0327 01:04:07.597859 10844 executor.cpp:661] Forked command at 6536
I0327 01:04:07.625846 10460 exec.cpp:445] Executor asked to shutdown
I0327 01:04:07.626849 12284 executor.cpp:176] Received SHUTDOWN event
I0327 01:04:07.626849 12284 executor.cpp:758] Shutting down
I0327 01:04:07.626849 12284 executor.cpp:868] Sending SIGTERM to process tree at pid 6Shutting
down framework 61cd0b26-dfbc-4577-a176-061fb99d4d26-0000
I0327 01:04:07.624850 12848 slave.cpp:6566] Shutting down executor '789877c6-9438-42e3-8e44-97aa4098e512'
of framework 61cd0b26-dfbc-4577-a176-061fb99d4d26-0000 at executor(1)@10.3.1.8:51130
I0327 01:04:07.625846 12848 slave.cpp:919] Agent terminating
W0327 01:04:07.625846 12848 slave.cpp:3869] Ignoring shutdown framework 61cd0b26-dfbc-4577-a176-061fb99d4d26-0000
because it is terminating
I0327 01:04:07.626849  5676 master.cpp:10545] Removing task 789877c6-9438-42e3-8e44-97aa4098e512
with resources cpus(allocated: *):4; mem(allocated: *):2048; disk(allocated: *):1024; ports(allocated:
*):[31000-32000] of framework 61cd0b26-dfbc-4577-a176-061fb99d4d26-0000 on agent 61cd0b26-dfbc-4577-a176-061fb99d4d26-S0
at slave(418)@10.3.1.8:51109 (winbldsrv-01.zq4gs31qjdiunm1ryi1452nvnh.dx.internal.cloudapp.net)
I0327 01:04:07.629848 15060 containerizer.cpp:2338] Destroying container 44001f2c-0761-49d6-a2d0-05cafdb3bd0d
in RUNNING state
I0327 01:04:07.629848  5676 master.cpp:1295] Agent 61cd0b26-dfbc-4577-a176-061fb99d4d26-S0
at slave(418)@10.3.1.8:51109 (winbldsrv-01.zq4gs31qjdiunm1ryi1452nvnh.dx.internal.cloudapp.net)
disconnected
I0327 01:04:07.629848 15060 containerizer.cpp:2952] Transitioning the state of container 44001f2c-0761-49d6-a2d0-05cafdb3bd0d
from RUNNING to DESTROYING
I0327 01:04:07.629848 10496 hierarchical.cpp:344] Removed framework 61cd0b26-dfbc-4577-a176-061fb99d4d26-0000
I0327 01:04:07.629848  5676 master.cpp:3283] Disconnecting agent 61cd0b26-dfbc-4577-a176-061fb99d4d26-S0
at slave(418)@10.3.1.8:51109 (winbldsrv-01.zq4gs31qjdiunm1ryi1452nvnh.dx.internal.cloudapp.net)
I0327 01:04:07.630844  5676 master.cpp:3302] Deactivating agent 61cd0b26-dfbc-4577-a176-061fb99d4d26-S0
at slave(418)@10.3.1.8:51109 (winbldsrv-01.zq4gs31qjdiunm1ryi1452nvnh.dx.internal.cloudapp.net)
I0327 01:04:07.630844 15420 hierarchical.cpp:766] Agent 61cd0b26-dfbc-4577-a176-061fb99d4d26-S0
deactivated
I0327 01:04:07.630844 15060 launcher.cpp:156] Asked to destroy container 44001f2c-0761-49d6-a2d0-05cafdb3bd0d
I0327 01:04:07.684846 13992 containerizer.cpp:2791] Container 44001f2c-0761-49d6-a2d0-05cafdb3bd0d
has exited
I0327 01:04:07.720865 16248 master.cpp:1137] Master terminating
I0327 01:04:07.722867  4524 hierarchical.cpp:609] Removed agent 61cd0b26-dfbc-4577-a176-061fb99d4d26-S0
I0327 01:04:08.118876  6276 process.cpp:929] Stopped the socket accept loop
```

- Mesos Reviewbot Windows


On March 27, 2018, 12:10 a.m., Armand Grillet wrote:
> 
> -----------------------------------------------------------
> This is an automatically generated e-mail. To reply, visit:
> https://reviews.apache.org/r/66289/
> -----------------------------------------------------------
> 
> (Updated March 27, 2018, 12:10 a.m.)
> 
> 
> Review request for mesos, Benjamin Mahler and Till Toenshoff.
> 
> 
> Repository: mesos
> 
> 
> Description
> -------
> 
> Added fields to GET_STATE necessary for streaming Web UI.
> 
> 
> Diffs
> -----
> 
>   docs/operator-http-api.md 10dcac83fa70da5760a5c231665d7498cc168622 
>   include/mesos/master/master.proto aa63904a33290a3beda162bbc9f44b56ab04a1e7 
>   include/mesos/v1/master/master.proto ddb28f96b2a3a439bb9a829995a9a3015f65ba43 
>   src/master/http.cpp 34c9023906eca94965acc994f20e888c1f47b962 
> 
> 
> Diff: https://reviews.apache.org/r/66289/diff/1/
> 
> 
> Testing
> -------
> 
> This is an updated version of https://github.com/benh/mesos/commit/c3ce5edb35e10e682f7d791719ad077f78b1dc95.
> 
> I have applied a `make check` + run a master locally and done a `curl -d '{"type":"GET_STATE"}'
-H "Content-Type: application/json" -X POST http://localhost:5061/api/v1` to check the JSON
returned:
> ```
> {
>     "type": "GET_STATE",
>     "get_state": {
>         "get_tasks": {},
>         "get_executors": {},
>         "get_frameworks": {},
>         "get_agents": {},
>         "version": "1.6.0",
>         "build_time": {
>             "nanoseconds": 1522071419000000000
>         },
>         "build_user": "agrillet",
>         "start_time": {
>             "nanoseconds": 1522078049371355904
>         },
>         "leader": {
>             "id": "1ce9804a-efd6-422a-8669-ce82e4183173",
>             "ip": 3492307904,
>             "port": 5061,
>             "pid": "master@192.99.40.208:5061",
>             "hostname": "gru1.hw.ca1.mesosphere.com",
>             "version": "1.6.0",
>             "address": {
>                 "hostname": "gru1.hw.ca1.mesosphere.com",
>                 "ip": "192.99.40.208",
>                 "port": 5061
>             },
>             "capabilities": [
>                 {
>                     "type": "AGENT_UPDATE"
>                 }
>             ]
>         },
>         "elected_time": {
>             "nanoseconds": 1522078049390997760
>         }
>     }
> }
> ```
> 
> 
> Thanks,
> 
> Armand Grillet
> 
>


Mime
  • Unnamed multipart/alternative (inline, None, 0 bytes)
View raw message