mesos-reviews mailing list archives

Site index · List index
Message view « Date » · « Thread »
Top « Date » · « Thread »
From Mesos Reviewbot Windows <revi...@mesos.apache.org>
Subject Re: Review Request 66314: Fix 3rdparty build commands for FreeBSD.
Date Tue, 27 Mar 2018 21:51:47 GMT

-----------------------------------------------------------
This is an automatically generated e-mail. To reply, visit:
https://reviews.apache.org/r/66314/#review200073
-----------------------------------------------------------



FAIL: Some of the unit tests failed. Please check the relevant logs.

Reviews applied: `['66314']`

Failed command: `Start-MesosCITesting`

All the build artifacts available at: http://dcos-win.westus.cloudapp.azure.com/mesos-build/review/66314

Relevant logs:

- [mesos-tests-stdout.log](http://dcos-win.westus.cloudapp.azure.com/mesos-build/review/66314/logs/mesos-tests-stdout.log):

```
[       OK ] Endpoint/SlaveEndpointTest.NoAuthorizer/2 (101 ms)
[----------] 9 tests from Endpoint/SlaveEndpointTest (994 ms total)

[----------] 2 tests from ContainerizerType/DefaultContainerDNSFlagTest
[ RUN      ] ContainerizerType/DefaultContainerDNSFlagTest.ValidateFlag/0
[       OK ] ContainerizerType/DefaultContainerDNSFlagTest.ValidateFlag/0 (32 ms)
[ RUN      ] ContainerizerType/DefaultContainerDNSFlagTest.ValidateFlag/1
[       OK ] ContainerizerType/DefaultContainerDNSFlagTest.ValidateFlag/1 (36 ms)
[----------] 2 tests from ContainerizerType/DefaultContainerDNSFlagTest (70 ms total)

[----------] 1 test from IsolationFlag/CpuIsolatorTest
[ RUN      ] IsolationFlag/CpuIsolatorTest.ROOT_UserCpuUsage/0
[       OK ] IsolationFlag/CpuIsolatorTest.ROOT_UserCpuUsage/0 (813 ms)
[----------] 1 test from IsolationFlag/CpuIsolatorTest (841 ms total)

[----------] 1 test from IsolationFlag/MemoryIsolatorTest
[ RUN      ] IsolationFlag/MemoryIsolatorTest.ROOT_MemUsage/0
[       OK ] IsolationFlag/MemoryIsolatorTest.ROOT_MemUsage/0 (725 ms)
[----------] 1 test from IsolationFlag/MemoryIsolatorTest (752 ms total)

[----------] Global test environment tear-down
[==========] 949 tests from 94 test cases ran. (417969 ms total)
[  PASSED  ] 948 tests.
[  FAILED  ] 1 test, listed below:
[  FAILED  ] CommandExecutorCheckTest.CommandCheckTimeout

 1 FAILED TEST
  YOU HAVE 214 DISABLED TESTS

```

- [mesos-tests-stderr.log](http://dcos-win.westus.cloudapp.azure.com/mesos-build/review/66314/logs/mesos-tests-stderr.log):

```
I0327 21:51:35.280153 11208 master.cpp:10446] Updating the state of task 730f23b7-015e-4282-9c84-44c1626d6675
of framework 368c5872-5c09-420e-8442-a9c9bd2b6ae5-0000 (latest state: TASK_KILLED, status
update state: TASK_KILLED)
I0327 21:51:35.281184 14524 slave.cpp:3873] Shutting down framework 368c5872-5c09-420e-8442-a9c9bd2b6ae5-0000
I0327 21:51:35.281184 14524 slave.cpp:6566] Shutting down executor '730f23b7-015e-4282-9c84-44c1626d6675'
of framework 368c5872-5c09-420e-8442-a9c9bd2b6ae5-0000 at executor(1)@10.3.1.8:63953
I0327 21:51:35.282189    32 slave.cpp:919] Agent terminating
W0327 21:51:35.282189    32 slave.cpp:3869] Ignoring shutdown framework 368c5872-5c09-420e-8442-a9c9bd2b6ae5-0000
because it is teI0327 21:51:35.103152 13644 exec.cpp:162] Version: 1.6.0
I0327 21:51:35.135192 15492 exec.cpp:236] Executor registered on agent 368c5872-5c09-420e-8442-a9c9bd2b6ae5-S0
I0327 21:51:35.139149  6088 executor.cpp:176] Received SUBSCRIBED event
I0327 21:51:35.144176  6088 executor.cpp:180] Subscribed executor on winbldsrv-01.zq4gs31qjdiunm1ryi1452nvnh.dx.internal.cloudapp.net
I0327 21:51:35.144176  6088 executor.cpp:176] Received LAUNCH event
I0327 21:51:35.150198  6088 executor.cpp:648] Starting task 730f23b7-015e-4282-9c84-44c1626d6675
I0327 21:51:35.239214  6088 executor.cpp:483] Running 'D:\DCOS\mesos\src\mesos-containerizer.exe
launch <POSSIBLY-SENSITIVE-DATA>'
I0327 21:51:35.252205  6088 executor.cpp:661] Forked command at 5816
I0327 21:51:35.283177 10168 exec.cpp:445] Executor asked to shutdown
I0327 21:51:35.283177 15792 executor.cpp:176] Received SHUTDOWN event
I0327 21:51:35.283177 15792 executor.cpp:758] Shutting down
I0327 21:51:35.283177 15792 executor.cpp:868] Sending SIGTERM to process tree at pid 5rminating
I0327 21:51:35.283177 11208 master.cpp:10545] Removing task 730f23b7-015e-4282-9c84-44c1626d6675
with resources cpus(allocated: *):4; mem(allocated: *):2048; disk(allocated: *):1024; ports(allocated:
*):[31000-32000] of framework 368c5872-5c09-420e-8442-a9c9bd2b6ae5-0000 on agent 368c5872-5c09-420e-8442-a9c9bd2b6ae5-S0
at slave(418)@10.3.1.8:63932 (winbldsrv-01.zq4gs31qjdiunm1ryi1452nvnh.dx.internal.cloudapp.net)
I0327 21:51:35.286193 11208 master.cpp:1295] Agent 368c5872-5c09-420e-8442-a9c9bd2b6ae5-S0
at slave(418)@10.3.1.8:63932 (winbldsrv-01.zq4gs31qjdiunm1ryi1452nvnh.dx.internal.cloudapp.net)
disconnected
I0327 21:51:35.286193 11208 master.cpp:3283] Disconnecting agent 368c5872-5c09-420e-8442-a9c9bd2b6ae5-S0
at slave(418)@10.3.1.8:63932 (winbldsrv-01.zq4gs31qjdiunm1ryi1452nvnh.dx.internal.cloudapp.net)
I0327 21:51:35.286193 11208 master.cpp:3302] Deactivating agent 368c5872-5c09-420e-8442-a9c9bd2b6ae5-S0
at slave(418)@10.3.1.8:63932 (winbldsrv-01.zq4gs31qjdiunm1ryi1452nvnh.dx.internal.cloudapp.net)
I0327 21:51:35.286193 13976 containerizer.cpp:2338] Destroying container 209e1ffa-cbb8-4805-9d9b-38ef4d7c6ed4
in RUNNING state
I0327 21:51:35.287154 13976 containerizer.cpp:2952] Transitioning the state of container 209e1ffa-cbb8-4805-9d9b-38ef4d7c6ed4
from RUNNING to DESTROYING
I0327 21:51:35.287154 12840 hierarchical.cpp:344] Removed framework 368c5872-5c09-420e-8442-a9c9bd2b6ae5-0000
I0327 21:51:35.287154 13976 launcher.cpp:156] Asked to destroy container 209e1ffa-cbb8-4805-9d9b-38ef4d7c6ed4
I0327 21:51:35.288199 12840 hierarchical.cpp:766] Agent 368c5872-5c09-420e-8442-a9c9bd2b6ae5-S0
deactivated
I0327 21:51:35.313205 14388 containerizer.cpp:2791] Container 209e1ffa-cbb8-4805-9d9b-38ef4d7c6ed4
has exited
I0327 21:51:35.347199    32 master.cpp:1137] Master terminating
I0327 21:51:35.350208 12840 hierarchical.cpp:609] Removed agent 368c5872-5c09-420e-8442-a9c9bd2b6ae5-S0
I0327 21:51:35.845218  4404 process.cpp:929] Stopped the socket accept loop
```

- Mesos Reviewbot Windows


On March 27, 2018, 7:10 p.m., David Forsythe wrote:
> 
> -----------------------------------------------------------
> This is an automatically generated e-mail. To reply, visit:
> https://reviews.apache.org/r/66314/
> -----------------------------------------------------------
> 
> (Updated March 27, 2018, 7:10 p.m.)
> 
> 
> Review request for mesos and Benjamin Bannier.
> 
> 
> Bugs: MESOS-4176
>     https://issues.apache.org/jira/browse/MESOS-4176
> 
> 
> Repository: mesos
> 
> 
> Description
> -------
> 
> Fix 3rdparty build commands for FreeBSD.
> 
> 
> Diffs
> -----
> 
>   3rdparty/CMakeLists.txt 2b63b58f7d6a88c9986b746283dcfa79b7bcb270 
>   cmake/CompilationConfigure.cmake 64cc56ee4208afe05df0f28af5890157e4c7d82c 
> 
> 
> Diff: https://reviews.apache.org/r/66314/diff/1/
> 
> 
> Testing
> -------
> 
> cmake --build on FreeBSD
> 
> 
> Thanks,
> 
> David Forsythe
> 
>


Mime
  • Unnamed multipart/alternative (inline, None, 0 bytes)
View raw message