mesos-reviews mailing list archives

Site index · List index
Message view « Date » · « Thread »
Top « Date » · « Thread »
From Mesos Reviewbot Windows <revi...@mesos.apache.org>
Subject Re: Review Request 66311: Implement recovery of resource provider manager.
Date Wed, 28 Mar 2018 15:46:50 GMT

-----------------------------------------------------------
This is an automatically generated e-mail. To reply, visit:
https://reviews.apache.org/r/66311/#review200118
-----------------------------------------------------------



FAIL: Some of the unit tests failed. Please check the relevant logs.

Reviews applied: `['66308', '66309', '66310', '66311']`

Failed command: `Start-MesosCITesting`

All the build artifacts available at: http://dcos-win.westus.cloudapp.azure.com/mesos-build/review/66311

Relevant logs:

- [mesos-tests-stdout.log](http://dcos-win.westus.cloudapp.azure.com/mesos-build/review/66311/logs/mesos-tests-stdout.log):

```
[       OK ] Endpoint/SlaveEndpointTest.NoAuthorizer/2 (111 ms)
[----------] 9 tests from Endpoint/SlaveEndpointTest (988 ms total)

[----------] 2 tests from ContainerizerType/DefaultContainerDNSFlagTest
[ RUN      ] ContainerizerType/DefaultContainerDNSFlagTest.ValidateFlag/0
[       OK ] ContainerizerType/DefaultContainerDNSFlagTest.ValidateFlag/0 (38 ms)
[ RUN      ] ContainerizerType/DefaultContainerDNSFlagTest.ValidateFlag/1
[       OK ] ContainerizerType/DefaultContainerDNSFlagTest.ValidateFlag/1 (42 ms)
[----------] 2 tests from ContainerizerType/DefaultContainerDNSFlagTest (81 ms total)

[----------] 1 test from IsolationFlag/CpuIsolatorTest
[ RUN      ] IsolationFlag/CpuIsolatorTest.ROOT_UserCpuUsage/0
[       OK ] IsolationFlag/CpuIsolatorTest.ROOT_UserCpuUsage/0 (778 ms)
[----------] 1 test from IsolationFlag/CpuIsolatorTest (799 ms total)

[----------] 1 test from IsolationFlag/MemoryIsolatorTest
[ RUN      ] IsolationFlag/MemoryIsolatorTest.ROOT_MemUsage/0
[       OK ] IsolationFlag/MemoryIsolatorTest.ROOT_MemUsage/0 (732 ms)
[----------] 1 test from IsolationFlag/MemoryIsolatorTest (753 ms total)

[----------] Global test environment tear-down
[==========] 949 tests from 94 test cases ran. (423168 ms total)
[  PASSED  ] 948 tests.
[  FAILED  ] 1 test, listed below:
[  FAILED  ] CommandExecutorCheckTest.CommandCheckTimeout

 1 FAILED TEST
  YOU HAVE 214 DISABLED TESTS

```

- [mesos-tests-stderr.log](http://dcos-win.westus.cloudapp.azure.com/mesos-build/review/66311/logs/mesos-tests-stderr.log):

```
I0328 15:46:36.892980  5608 exec.cpp:236] Executor registered on agent 48f40b10-7e34-4fe9-8156-dc7b1068fc89-S0
I0328 15:46:36.896950  5360 executor.cpp:176] Received SUBSCRIBED event
I0328 15:46:36.901968  5360 executor.cpp:180] Subscribed executor on winbldsrv-02.zq4gs31qjdiunm1ryi1452nvnh.dx.internal.cloudapp.net
I0328 15:46:36.902966  5360 executor.cpp:176] Received LAUNCH event
I0328 15:46:36.907972  5360 executor.cpp:648] Starting task 11371b21-8bcb-41fb-853e-415218194b75
I0328 15:46:36.996968  5360 executor.cpp:483] Running 'D:\DCOS\mesos\src\mesos-containerizer.exe
launch <POSSIBLY-SENSITIVE-DATA>'
I0328 15:46:37.024973  5360 executor.cpp:661] Forked command at 7704
I0328 15:46:37.056937  1004 exec.cpp:445] Executor asked to shutdown
I0328 15:46:37.057945  5448 executor.cpp:176] Received SHUTDOWN event
I0328 15:46:37.057945  5448 executor.cpp:758] Shutting down
I0328 15:46:37.057945  5448 executor.cpp:868] Sending SIGTERM to process tree at pid 7e34-4fe9-8156-dc7b1068fc89-0000
I0328 15:46:37.054944  8400 master.cpp:10446] Updating the state of task 11371b21-8bcb-41fb-853e-415218194b75
of framework 48f40b10-7e34-4fe9-8156-dc7b1068fc89-0000 (latest state: TASK_KILLED, status
update state: TASK_KILLED)
I0328 15:46:37.054944  8264 slave.cpp:3871] Shutting down framework 48f40b10-7e34-4fe9-8156-dc7b1068fc89-0000
I0328 15:46:37.055943  8264 slave.cpp:6579] Shutting down executor '11371b21-8bcb-41fb-853e-415218194b75'
of framework 48f40b10-7e34-4fe9-8156-dc7b1068fc89-0000 at executor(1)@10.3.1.5:54190
I0328 15:46:37.055943  8264 slave.cpp:915] Agent terminating
W0328 15:46:37.056937  8264 slave.cpp:3867] Ignoring shutdown framework 48f40b10-7e34-4fe9-8156-dc7b1068fc89-0000
because it is terminating
I0328 15:46:37.057945  8400 master.cpp:10545] Removing task 11371b21-8bcb-41fb-853e-415218194b75
with resources cpus(allocated: *):4; mem(allocated: *):2048; disk(allocated: *):1024; ports(allocated:
*):[31000-32000] of framework 48f40b10-7e34-4fe9-8156-dc7b1068fc89-0000 on agent 48f40b10-7e34-4fe9-8156-dc7b1068fc89-S0
at slave(417)@10.3.1.5:54169 (winbldsrv-02.zq4gs31qjdiunm1ryi1452nvnh.dx.internal.cloudapp.net)
I0328 15:46:37.060938  4904 containerizer.cpp:2338] Destroying container 6cb221ac-b026-4983-b310-d1ecc7936091
in RUNNING state
I0328 15:46:37.060938  4904 containerizer.cpp:2952] Transitioning the state of container 6cb221ac-b026-4983-b310-d1ecc7936091
from RUNNING to DESTROYING
I0328 15:46:37.060938  8400 master.cpp:1295] Agent 48f40b10-7e34-4fe9-8156-dc7b1068fc89-S0
at slave(417)@10.3.1.5:54169 (winbldsrv-02.zq4gs31qjdiunm1ryi1452nvnh.dx.internal.cloudapp.net)
disconnected
I0328 15:46:37.061939  8400 master.cpp:3283] Disconnecting agent 48f40b10-7e34-4fe9-8156-dc7b1068fc89-S0
at slave(417)@10.3.1.5:54169 (winbldsrv-02.zq4gs31qjdiunm1ryi1452nvnh.dx.internal.cloudapp.net)
I0328 15:46:37.061939  8400 master.cpp:3302] Deactivating agent 48f40b10-7e34-4fe9-8156-dc7b1068fc89-S0
at slave(417)@10.3.1.5:54169 (winbldsrv-02.zq4gs31qjdiunm1ryi1452nvnh.dx.internal.cloudapp.net)
I0328 15:46:37.061939  4904 launcher.cpp:156] Asked to destroy container 6cb221ac-b026-4983-b310-d1ecc7936091
I0328 15:46:37.061939  3760 hierarchical.cpp:344] Removed framework 48f40b10-7e34-4fe9-8156-dc7b1068fc89-0000
I0328 15:46:37.062955  3760 hierarchical.cpp:766] Agent 48f40b10-7e34-4fe9-8156-dc7b1068fc89-S0
deactivated
I0328 15:46:37.076975  7160 containerizer.cpp:2791] Container 6cb221ac-b026-4983-b310-d1ecc7936091
has exited
I0328 15:46:37.109949  7844 master.cpp:1137] Master terminating
I0328 15:46:37.111943  6400 hierarchical.cpp:609] Removed agent 48f40b10-7e34-4fe9-8156-dc7b1068fc89-S0
I0328 15:46:37.493954  6704 process.cpp:929] Stopped the socket accept loop
```

- Mesos Reviewbot Windows


On March 27, 2018, 8:34 a.m., Benjamin Bannier wrote:
> 
> -----------------------------------------------------------
> This is an automatically generated e-mail. To reply, visit:
> https://reviews.apache.org/r/66311/
> -----------------------------------------------------------
> 
> (Updated March 27, 2018, 8:34 a.m.)
> 
> 
> Review request for mesos, Jie Yu and Jan Schlicht.
> 
> 
> Bugs: MESOS-8735
>     https://issues.apache.org/jira/browse/MESOS-8735
> 
> 
> Repository: mesos
> 
> 
> Description
> -------
> 
> This patch adjusts the control flow of the resource provider manager
> so that we can in the future make use of persisted resource provider
> information.
> 
> 
> Diffs
> -----
> 
>   src/resource_provider/manager.cpp 2d3ffcdd01671f81729fe538348f2ca4e555eb4f 
>   src/resource_provider/registrar.hpp 39f45b0a2a7c35bfe72a9305f5248409e4a3ef45 
>   src/resource_provider/registrar.cpp 9eb49f1327a0b598c5464a29a09ee286d7018f09 
>   src/tests/resource_provider_manager_tests.cpp d947bd037190e6b7ea7b2277b5fbe47816878de4

> 
> 
> Diff: https://reviews.apache.org/r/66311/diff/1/
> 
> 
> Testing
> -------
> 
> `make check`
> 
> 
> Thanks,
> 
> Benjamin Bannier
> 
>


Mime
  • Unnamed multipart/alternative (inline, None, 0 bytes)
View raw message