mesos-reviews mailing list archives

Site index · List index
Message view « Date » · « Thread »
Top « Date » · « Thread »
From Mesos Reviewbot Windows <revi...@mesos.apache.org>
Subject Re: Review Request 66358: Updated CHANGELOG.
Date Thu, 29 Mar 2018 15:23:04 GMT

-----------------------------------------------------------
This is an automatically generated e-mail. To reply, visit:
https://reviews.apache.org/r/66358/#review200198
-----------------------------------------------------------



FAIL: Some of the unit tests failed. Please check the relevant logs.

Reviews applied: `['66358']`

Failed command: `Start-MesosCITesting`

All the build artifacts available at: http://dcos-win.westus.cloudapp.azure.com/mesos-build/review/66358

Relevant logs:

- [mesos-tests-stdout.log](http://dcos-win.westus.cloudapp.azure.com/mesos-build/review/66358/logs/mesos-tests-stdout.log):

```
[       OK ] Endpoint/SlaveEndpointTest.NoAuthorizer/2 (117 ms)
[----------] 9 tests from Endpoint/SlaveEndpointTest (1237 ms total)

[----------] 2 tests from ContainerizerType/DefaultContainerDNSFlagTest
[ RUN      ] ContainerizerType/DefaultContainerDNSFlagTest.ValidateFlag/0
[       OK ] ContainerizerType/DefaultContainerDNSFlagTest.ValidateFlag/0 (46 ms)
[ RUN      ] ContainerizerType/DefaultContainerDNSFlagTest.ValidateFlag/1
[       OK ] ContainerizerType/DefaultContainerDNSFlagTest.ValidateFlag/1 (52 ms)
[----------] 2 tests from ContainerizerType/DefaultContainerDNSFlagTest (100 ms total)

[----------] 1 test from IsolationFlag/CpuIsolatorTest
[ RUN      ] IsolationFlag/CpuIsolatorTest.ROOT_UserCpuUsage/0
[       OK ] IsolationFlag/CpuIsolatorTest.ROOT_UserCpuUsage/0 (847 ms)
[----------] 1 test from IsolationFlag/CpuIsolatorTest (876 ms total)

[----------] 1 test from IsolationFlag/MemoryIsolatorTest
[ RUN      ] IsolationFlag/MemoryIsolatorTest.ROOT_MemUsage/0
[       OK ] IsolationFlag/MemoryIsolatorTest.ROOT_MemUsage/0 (831 ms)
[----------] 1 test from IsolationFlag/MemoryIsolatorTest (861 ms total)

[----------] Global test environment tear-down
[==========] 949 tests from 94 test cases ran. (446614 ms total)
[  PASSED  ] 948 tests.
[  FAILED  ] 1 test, listed below:
[  FAILED  ] CommandExecutorCheckTest.CommandCheckTimeout

 1 FAILED TEST
  YOU HAVE 214 DISABLED TESTS

```

- [mesos-tests-stderr.log](http://dcos-win.westus.cloudapp.azure.com/mesos-build/review/66358/logs/mesos-tests-stderr.log):

```
I0329 15:22:50.714217  6984 master.cpp:10446] Updating the state of task 6a719e20-cfc1-4904-9699-37600281c9db
of framework 375207dd-2fe6-4d8f-af5e-ee4f6453ea58-0000 (latest state: TASK_KILLED, status
update state: TASK_KILLED)
I0329 15:22:50.714217  6776 slave.cpp:3877] Shutting down framework 375207dd-2fe6-4d8f-af5e-ee4f6453ea58-0000
I0329 15:22:50.71I0329 15:22:50.533233  8480 exec.cpp:162] Version: 1.6.0
I0329 15:22:50.558179  1328 exec.cpp:236] Executor registered on agent 375207dd-2fe6-4d8f-af5e-ee4f6453ea58-S0
I0329 15:22:50.562227  9988 executor.cpp:176] Received SUBSCRIBED event
I0329 15:22:50.566237  9988 executor.cpp:180] Subscribed executor on winbldsrv-01.zq4gs31qjdiunm1ryi1452nvnh.dx.internal.cloudapp.net
I0329 15:22:50.567234  9988 executor.cpp:176] Received LAUNCH event
I0329 15:22:50.572232  9988 executor.cpp:648] Starting task 6a719e20-cfc1-4904-9699-37600281c9db
I0329 15:22:50.660235  9988 executor.cpp:483] Running 'D:\DCOS\mesos\src\mesos-containerizer.exe
launch <POSSIBLY-SENSITIVE-DATA>'
I0329 15:22:50.688199  9988 executor.cpp:661] Forked command at 4688
I0329 15:22:50.717202  9784 exec.cpp:445] Executor asked to shutdown
I0329 15:22:50.717202  8820 executor.cpp:176] Received SHUTDOWN event
I0329 15:22:50.717202  8820 executor.cpp:758] Shutting down
I0329 15:22:50.717202  8820 executor.cpp:868] Sending SIGTERM to process tree at pid 45204
 6776 slave.cpp:6570] Shutting down executor '6a719e20-cfc1-4904-9699-37600281c9db' of framework
375207dd-2fe6-4d8f-af5e-ee4f6453ea58-0000 at executor(1)@10.3.1.8:61667
I0329 15:22:50.716219  6776 slave.cpp:923] Agent terminating
W0329 15:22:50.716219  6776 slave.cpp:3873] Ignoring shutdown framework 375207dd-2fe6-4d8f-af5e-ee4f6453ea58-0000
because it is terminating
I0329 15:22:50.717202  6984 master.cpp:10545] Removing task 6a719e20-cfc1-4904-9699-37600281c9db
with resources cpus(allocated: *):4; mem(allocated: *):2048; disk(allocated: *):1024; ports(allocated:
*):[31000-32000] of framework 375207dd-2fe6-4d8f-af5e-ee4f6453ea58-0000 on agent 375207dd-2fe6-4d8f-af5e-ee4f6453ea58-S0
at slave(418)@10.3.1.8:61646 (winbldsrv-01.zq4gs31qjdiunm1ryi1452nvnh.dx.internal.cloudapp.net)
I0329 15:22:50.719187  6984 master.cpp:1295] Agent 375207dd-2fe6-4d8f-af5e-ee4f6453ea58-S0
at slave(418)@10.3.1.8:61646 (winbldsrv-01.zq4gs31qjdiunm1ryi1452nvnh.dx.internal.cloudapp.net)
disconnected
I0329 15:22:50.719187  6984 master.cpp:3283] Disconnecting agent 375207dd-2fe6-4d8f-af5e-ee4f6453ea58-S0
at slave(418)@10.3.1.8:61646 (winbldsrv-01.zq4gs31qjdiunm1ryi1452nvnh.dx.internal.cloudapp.net)
I0329 15:22:50.720201  6984 master.cpp:3302] Deactivating agent 375207dd-2fe6-4d8f-af5e-ee4f6453ea58-S0
at slave(418)@10.3.1.8:61646 (winbldsrv-01.zq4gs31qjdiunm1ryi1452nvnh.dx.internal.cloudapp.net)
I0329 15:22:50.720201  7308 containerizer.cpp:2338] Destroying container d661def8-b5f1-4c7b-be09-0437508c98d4
in RUNNING state
I0329 15:22:50.720201  7308 containerizer.cpp:2952] Transitioning the state of container d661def8-b5f1-4c7b-be09-0437508c98d4
from RUNNING to DESTROYING
I0329 15:22:50.721190  2140 hierarchical.cpp:344] Removed framework 375207dd-2fe6-4d8f-af5e-ee4f6453ea58-0000
I0329 15:22:50.721190  2140 hierarchical.cpp:766] Agent 375207dd-2fe6-4d8f-af5e-ee4f6453ea58-S0
deactivated
I0329 15:22:50.721190  7308 launcher.cpp:156] Asked to destroy container d661def8-b5f1-4c7b-be09-0437508c98d4
I0329 15:22:50.832038  4736 containerizer.cpp:2791] Container d661def8-b5f1-4c7b-be09-0437508c98d4
has exited
I0329 15:22:50.870041  8008 master.cpp:1137] Master terminating
I0329 15:22:50.872046  2140 hierarchical.cpp:609] Removed agent 375207dd-2fe6-4d8f-af5e-ee4f6453ea58-S0
I0329 15:22:51.252048  4956 process.cpp:929] Stopped the socket accept loop
```

- Mesos Reviewbot Windows


On March 29, 2018, 2:24 p.m., Benno Evers wrote:
> 
> -----------------------------------------------------------
> This is an automatically generated e-mail. To reply, visit:
> https://reviews.apache.org/r/66358/
> -----------------------------------------------------------
> 
> (Updated March 29, 2018, 2:24 p.m.)
> 
> 
> Review request for mesos and Till Toenshoff.
> 
> 
> Repository: mesos
> 
> 
> Description
> -------
> 
> Updated CHANGELOG.
> 
> 
> Diffs
> -----
> 
>   CHANGELOG d5ec58fa0916b1d637f70b5c709c98fd79a9e8c0 
> 
> 
> Diff: https://reviews.apache.org/r/66358/diff/2/
> 
> 
> Testing
> -------
> 
> 
> Thanks,
> 
> Benno Evers
> 
>


Mime
  • Unnamed multipart/alternative (inline, None, 0 bytes)
View raw message