mesos-reviews mailing list archives

Site index · List index
Message view « Date » · « Thread »
Top « Date » · « Thread »
From Mesos Reviewbot Windows <revi...@mesos.apache.org>
Subject Re: Review Request 66385: Link execinfo in Glog build on FreeBSD.
Date Sat, 31 Mar 2018 19:44:05 GMT

-----------------------------------------------------------
This is an automatically generated e-mail. To reply, visit:
https://reviews.apache.org/r/66385/#review200263
-----------------------------------------------------------



FAIL: Some of the unit tests failed. Please check the relevant logs.

Reviews applied: `['66384', '66385']`

Failed command: `Start-MesosCITesting`

All the build artifacts available at: http://dcos-win.westus.cloudapp.azure.com/mesos-build/review/66385

Relevant logs:

- [mesos-tests-stdout.log](http://dcos-win.westus.cloudapp.azure.com/mesos-build/review/66385/logs/mesos-tests-stdout.log):

```
[       OK ] Endpoint/SlaveEndpointTest.NoAuthorizer/2 (114 ms)
[----------] 9 tests from Endpoint/SlaveEndpointTest (1137 ms total)

[----------] 2 tests from ContainerizerType/DefaultContainerDNSFlagTest
[ RUN      ] ContainerizerType/DefaultContainerDNSFlagTest.ValidateFlag/0
[       OK ] ContainerizerType/DefaultContainerDNSFlagTest.ValidateFlag/0 (32 ms)
[ RUN      ] ContainerizerType/DefaultContainerDNSFlagTest.ValidateFlag/1
[       OK ] ContainerizerType/DefaultContainerDNSFlagTest.ValidateFlag/1 (37 ms)
[----------] 2 tests from ContainerizerType/DefaultContainerDNSFlagTest (72 ms total)

[----------] 1 test from IsolationFlag/CpuIsolatorTest
[ RUN      ] IsolationFlag/CpuIsolatorTest.ROOT_UserCpuUsage/0
[       OK ] IsolationFlag/CpuIsolatorTest.ROOT_UserCpuUsage/0 (753 ms)
[----------] 1 test from IsolationFlag/CpuIsolatorTest (786 ms total)

[----------] 1 test from IsolationFlag/MemoryIsolatorTest
[ RUN      ] IsolationFlag/MemoryIsolatorTest.ROOT_MemUsage/0
[       OK ] IsolationFlag/MemoryIsolatorTest.ROOT_MemUsage/0 (822 ms)
[----------] 1 test from IsolationFlag/MemoryIsolatorTest (856 ms total)

[----------] Global test environment tear-down
[==========] 949 tests from 94 test cases ran. (453994 ms total)
[  PASSED  ] 948 tests.
[  FAILED  ] 1 test, listed below:
[  FAILED  ] CommandExecutorCheckTest.CommandCheckTimeout

 1 FAILED TEST
  YOU HAVE 214 DISABLED TESTS

```

- [mesos-tests-stderr.log](http://dcos-win.westus.cloudapp.azure.com/mesos-build/review/66385/logs/mesos-tests-stderr.log):

```
I0331 19:43:51.444284 10360 master.cpp:10446] Updating the state of task bb142001-dded-485b-82c1-c94f8c8b8f26
of framework f429fbb8-3176-4a98-b542-238305917764-0000 (latest state: TASK_KILLED, status
update state: TASK_KILLED)
I0331 19:43:51.444284  8964 slave.cpp:3877] Shutting down framework f429fbb8-3176-4a98-b542-238305917764-0000
I0331 19:43:51.444284  8964 slave.cpp:6570] Shutting down executor 'bb142001-dded-485b-82c1-c94f8c8b8f26'
of framework f429fbb8-3176-4a98-b542-238305917764-0000 at executor(1)@10.3.1.8:61621
I0331 19:43:51.445298  8964 slave.cpp:923] Agent terminating
W0331 19:43:51.445298  8964 slave.cpp:3873] Ignoring shutdown framework f429fI0331 19:43:51.266284
 8376 exec.cpp:162] Version: 1.6.0
I0331 19:43:51.293282  6216 exec.cpp:236] Executor registered on agent f429fbb8-3176-4a98-b542-238305917764-S0
I0331 19:43:51.297277  3912 executor.cpp:176] Received SUBSCRIBED event
I0331 19:43:51.302285  3912 executor.cpp:180] Subscribed executor on winbldsrv-01.zq4gs31qjdiunm1ryi1452nvnh.dx.internal.cloudapp.net
I0331 19:43:51.302285  3912 executor.cpp:176] Received LAUNCH event
I0331 19:43:51.307291  3912 executor.cpp:648] Starting task bb142001-dded-485b-82c1-c94f8c8b8f26
I0331 19:43:51.387290  3912 executor.cpp:483] Running 'D:\DCOS\mesos\src\mesos-containerizer.exe
launch <POSSIBLY-SENSITIVE-DATA>'
I0331 19:43:51.417279  3912 executor.cpp:661] Forked command at 4932
I0331 19:43:51.446282  8792 exec.cpp:445] Executor asked to shutdown
I0331 19:43:51.446282  8724 executor.cpp:176] Received SHUTDOWN event
I0331 19:43:51.447284  8724 executor.cpp:758] Shutting down
I0331 19:43:51.447284  8724 executor.cpp:868] Sending SIGTERM to process tree at pid 4bb8-3176-4a98-b542-238305917764-0000
because it is terminating
I0331 19:43:51.447284 10360 master.cpp:10545] Removing task bb142001-dded-485b-82c1-c94f8c8b8f26
with resources cpus(allocated: *):4; mem(allocated: *):2048; disk(allocated: *):1024; ports(allocated:
*):[31000-32000] of framework f429fbb8-3176-4a98-b542-238305917764-0000 on agent f429fbb8-3176-4a98-b542-238305917764-S0
at slave(418)@10.3.1.8:61600 (winbldsrv-01.zq4gs31qjdiunm1ryi1452nvnh.dx.internal.cloudapp.net)
I0331 19:43:51.450295  6440 containerizer.cpp:2338] Destroying container ece7b045-ac5c-465c-b250-71a6793c9ba0
in RUNNING state
I0331 19:43:51.450295  6440 containerizer.cpp:2952] Transitioning the state of container ece7b045-ac5c-465c-b250-71a6793c9ba0
from RUNNING to DESTROYING
I0331 19:43:51.450295 10360 master.cpp:1295] Agent f429fbb8-3176-4a98-b542-238305917764-S0
at slave(418)@10.3.1.8:61600 (winbldsrv-01.zq4gs31qjdiunm1ryi1452nvnh.dx.internal.cloudapp.net)
disconnected
I0331 19:43:51.450295 10360 master.cpp:3283] Disconnecting agent f429fbb8-3176-4a98-b542-238305917764-S0
at slave(418)@10.3.1.8:61600 (winbldsrv-01.zq4gs31qjdiunm1ryi1452nvnh.dx.internal.cloudapp.net)
I0331 19:43:51.450295 10840 hierarchical.cpp:344] Removed framework f429fbb8-3176-4a98-b542-238305917764-0000
I0331 19:43:51.451293  6440 launcher.cpp:156] Asked to destroy container ece7b045-ac5c-465c-b250-71a6793c9ba0
I0331 19:43:51.451293 10360 master.cpp:3302] Deactivating agent f429fbb8-3176-4a98-b542-238305917764-S0
at slave(418)@10.3.1.8:61600 (winbldsrv-01.zq4gs31qjdiunm1ryi1452nvnh.dx.internal.cloudapp.net)
I0331 19:43:51.451293  5808 hierarchical.cpp:766] Agent f429fbb8-3176-4a98-b542-238305917764-S0
deactivated
I0331 19:43:51.545197  8032 containerizer.cpp:2791] Container ece7b045-ac5c-465c-b250-71a6793c9ba0
has exited
I0331 19:43:51.579197  7304 master.cpp:1137] Master terminating
I0331 19:43:51.581197 10360 hierarchical.cpp:609] Removed agent f429fbb8-3176-4a98-b542-238305917764-S0
I0331 19:43:51.997859 10064 process.cpp:929] Stopped the socket accept loop
```

- Mesos Reviewbot Windows


On March 31, 2018, 11:48 a.m., David Forsythe wrote:
> 
> -----------------------------------------------------------
> This is an automatically generated e-mail. To reply, visit:
> https://reviews.apache.org/r/66385/
> -----------------------------------------------------------
> 
> (Updated March 31, 2018, 11:48 a.m.)
> 
> 
> Review request for mesos.
> 
> 
> Bugs: MESOS-4176 and MESOS-6849
>     https://issues.apache.org/jira/browse/MESOS-4176
>     https://issues.apache.org/jira/browse/MESOS-6849
> 
> 
> Repository: mesos
> 
> 
> Description
> -------
> 
> Link execinfo in Glog build on FreeBSD.
> 
> 
> Diffs
> -----
> 
>   3rdparty/CMakeLists.txt 2b63b58f7d6a88c9986b746283dcfa79b7bcb270 
>   cmake/CompilationConfigure.cmake 64cc56ee4208afe05df0f28af5890157e4c7d82c 
> 
> 
> Diff: https://reviews.apache.org/r/66385/diff/1/
> 
> 
> Testing
> -------
> 
> 
> Thanks,
> 
> David Forsythe
> 
>


Mime
  • Unnamed multipart/alternative (inline, None, 0 bytes)
View raw message