mesos-reviews mailing list archives

Site index · List index
Message view « Date » · « Thread »
Top « Date » · « Thread »
From Mesos Reviewbot Windows <revi...@mesos.apache.org>
Subject Re: Review Request 67795: Moved `CheckInfo` validation to common code.
Date Sun, 01 Jul 2018 12:04:00 GMT

-----------------------------------------------------------
This is an automatically generated e-mail. To reply, visit:
https://reviews.apache.org/r/67795/#review205612
-----------------------------------------------------------



FAIL: Some of the unit tests failed. Please check the relevant logs.

Reviews applied: `['67794', '67795']`

Failed command: `Start-MesosCITesting`

All the build artifacts available at: http://dcos-win.westus.cloudapp.azure.com/mesos-build/review/67795

Relevant logs:

- [mesos-tests-stdout.log](http://dcos-win.westus.cloudapp.azure.com/mesos-build/review/67795/logs/mesos-tests-stdout.log):

```
[----------] 9 tests from Endpoint/SlaveEndpointTest (1066 ms total)

[----------] 2 tests from ContainerizerType/DefaultContainerDNSFlagTest
[ RUN      ] ContainerizerType/DefaultContainerDNSFlagTest.ValidateFlag/0
[       OK ] ContainerizerType/DefaultContainerDNSFlagTest.ValidateFlag/0 (44 ms)
[ RUN      ] ContainerizerType/DefaultContainerDNSFlagTest.ValidateFlag/1
[       OK ] ContainerizerType/DefaultContainerDNSFlagTest.ValidateFlag/1 (49 ms)
[----------] 2 tests from ContainerizerType/DefaultContainerDNSFlagTest (94 ms total)

[----------] 1 test from IsolationFlag/CpuIsolatorTest
[ RUN      ] IsolationFlag/CpuIsolatorTest.ROOT_UserCpuUsage/0
[       OK ] IsolationFlag/CpuIsolatorTest.ROOT_UserCpuUsage/0 (1362 ms)
[----------] 1 test from IsolationFlag/CpuIsolatorTest (1388 ms total)

[----------] 1 test from IsolationFlag/MemoryIsolatorTest
[ RUN      ] IsolationFlag/MemoryIsolatorTest.ROOT_MemUsage/0
[       OK ] IsolationFlag/MemoryIsolatorTest.ROOT_MemUsage/0 (1376 ms)
[----------] 1 test from IsolationFlag/MemoryIsolatorTest (1397 ms total)

[----------] Global test environment tear-down
[==========] 994 tests from 98 test cases ran. (643490 ms total)
[  PASSED  ] 992 tests.
[  FAILED  ] 2 tests, listed below:
[  FAILED  ] DockerTest.ROOT_DOCKER_interface
[  FAILED  ] DockerTest.ROOT_DOCKER_kill

 2 FAILED TESTS
  YOU HAVE 220 DISABLED TESTS

```

- [mesos-tests-stderr.log](http://dcos-win.westus.cloudapp.azure.com/mesos-build/review/67795/logs/mesos-tests-stderr.log):

```
I0701 12:03:40.219732 23276 master.cpp:11032] Updating the state of task 2b07228a-6a46-48ac-a123-462f8414ff57
of framework 1df5d0d0-7dfc-461d-9b63-ac9ca96ee1fa-0000 (latest state: TASK_KILLED, status
update state: TASK_KILLED)
I0701 12:03:39.915448 22104 exec.cpp:162] Version: 1.7.0
I0701 12:03:39.940460 18804 exec.cpp:236] Executor registered on agent 1df5d0d0-7dfc-461d-9b63-ac9ca96ee1fa-S0
I0701 12:03:39.945462 16900 executor.cpp:182] Received SUBSCRIBED event
I0701 12:03:39.950459 16900 executor.cpp:186] Subscribed executor on windows-02.enofukwu14ruplxn0gs3yzmsgf.xx.internal.cloudapp.net
I0701 12:03:39.950459 16900 executor.cpp:182] Received LAUNCH event
I0701 12:03:39.955457 16900 executor.cpp:679] Starting task 2b07228a-6a46-48ac-a123-462f8414ff57
I0701 12:03:40.039460 16900 executor.cpp:499] Running 'D:\DCOS\mesos\src\mesos-containerizer.exe
launch <POSSIBLY-SENSITIVE-DATA>'
I0701 12:03:40.188452 16900 executor.cpp:693] Forked command at 21344
I0701 12:03:40.223449 15564 exec.cpp:445] Executor asked to shutdown
I0701 12:03:40.224449 16900 executor.cpp:182] Received SHUTDOWN event
I0701 12:03:40.224449 16900 executor.cpp:796] Shutting down
I0701 12:03:40.224449 16900 executor.cpp:909] Sending SIGTERM to process tree at pid 21I0701
12:03:40.219732 23068 slave.cpp:3939] Shutting down framework 1df5d0d0-7dfc-461d-9b63-ac9ca96ee1fa-0000
I0701 12:03:40.220459 23068 slave.cpp:6660] Shutting down executor '2b07228a-6a46-48ac-a123-462f8414ff57'
of framework 1df5d0d0-7dfc-461d-9b63-ac9ca96ee1fa-0000 at executor(1)@192.10.1.6:56577
I0701 12:03:40.223449 23276 master.cpp:11131] Removing task 2b07228a-6a46-48ac-a123-462f8414ff57
with resources cpus(allocated: *):4; mem(allocated: *):2048; disk(allocated: *):1024; ports(allocated:
*):[31000-32000] of framework 1df5d0d0-7dfc-461d-9b63-ac9ca96ee1fa-0000 on agent 1df5d0d0-7dfc-461d-9b63-ac9ca96ee1fa-S0
at slave(449)@192.10.1.6:56556 (windows-02.enofukwu14ruplxn0gs3yzmsgf.xx.internal.cloudapp.net)
I0701 12:03:40.223449 23068 slave.cpp:931] Agent terminating
W0701 12:03:40.223449 23068 slave.cpp:3935] Ignoring shutdown framework 1df5d0d0-7dfc-461d-9b63-ac9ca96ee1fa-0000
because it is terminating
I0701 12:03:40.226466 23484 master.cpp:1330] Agent 1df5d0d0-7dfc-461d-9b63-ac9ca96ee1fa-S0
at slave(449)@192.10.1.6:56556 (windows-02.enofukwu14ruplxn0gs3yzmsgf.xx.internal.cloudapp.net)
disconnected
I0701 12:03:40.227452 23484 master.cpp:3340] Disconnecting agent 1df5d0d0-7dfc-461d-9b63-ac9ca96ee1fa-S0
at slave(449)@192.10.1.6:56556 (windows-02.enofukwu14ruplxn0gs3yzmsgf.xx.internal.cloudapp.net)
I0701 12:03:40.227452 23484 master.cpp:3359] Deactivating agent 1df5d0d0-7dfc-461d-9b63-ac9ca96ee1fa-S0
at slave(449)@192.10.1.6:56556 (windows-02.enofukwu14ruplxn0gs3yzmsgf.xx.internal.cloudapp.net)
I0701 12:03:40.227452 17172 hierarchical.cpp:346] Removed framework 1df5d0d0-7dfc-461d-9b63-ac9ca96ee1fa-0000
I0701 12:03:40.227452 17172 hierarchical.cpp:769] Agent 1df5d0d0-7dfc-461d-9b63-ac9ca96ee1fa-S0
deactivated
I0701 12:03:40.228452 23484 containerizer.cpp:2407] Destroying container 376f4674-4bb7-437a-8908-f2d276726b0d
in RUNNING state
I0701 12:03:40.228452 23484 containerizer.cpp:3021] Transitioning the state of container 376f4674-4bb7-437a-8908-f2d276726b0d
from RUNNING to DESTROYING
I0701 12:03:40.229449 23484 launcher.cpp:155] Asked to destroy container 376f4674-4bb7-437a-8908-f2d276726b0d
I0701 12:03:40.248459 23068 containerizer.cpp:2860] Container 376f4674-4bb7-437a-8908-f2d276726b0d
has exited
I0701 12:03:40.276445 21060 master.cpp:1172] Master terminating
I0701 12:03:40.278443 17172 hierarchical.cpp:612] Removed agent 1df5d0d0-7dfc-461d-9b63-ac9ca96ee1fa-S0
I0701 12:03:40.603448 22716 process.cpp:940] Stopped the socket accept loop
```

- Mesos Reviewbot Windows


On July 1, 2018, 10:09 a.m., James Peach wrote:
> 
> -----------------------------------------------------------
> This is an automatically generated e-mail. To reply, visit:
> https://reviews.apache.org/r/67795/
> -----------------------------------------------------------
> 
> (Updated July 1, 2018, 10:09 a.m.)
> 
> 
> Review request for mesos, Alexander Rukletsov and Gastón Kleiman.
> 
> 
> Bugs: MESOS-9043
>     https://issues.apache.org/jira/browse/MESOS-9043
> 
> 
> Repository: mesos
> 
> 
> Description
> -------
> 
> The master validation uses `validation::checkStatus` and
> `validation::checkStatusInfo`, so move them to the common
> validation library so that the master doesn't have a
> dependency on the checker library.
> 
> 
> Diffs
> -----
> 
>   src/checks/checker.hpp 07507a5265613255e778a869094b68a228237f21 
>   src/checks/checker.cpp 6d01349f5a6b7df90c20c2014ad850f312e98593 
>   src/common/validation.hpp 3f60d7ac084b5341e4f33737bff931e3c3daf404 
>   src/common/validation.cpp 74450df1ff0eb2a892f082c60416307ecfcd9e34 
>   src/master/validation.cpp 798fc7975cf0f0b8b029a33137faa1737d47df66 
>   src/slave/validation.cpp 7b4c15a13402665c566236b86326ea324c2e4349 
>   src/tests/check_tests.cpp 73ea5a9e26e58f33d24a1594bbdab7ccceb0ce0f 
> 
> 
> Diff: https://reviews.apache.org/r/67795/diff/1/
> 
> 
> Testing
> -------
> 
> make check (Fedora 28)
> 
> 
> Thanks,
> 
> James Peach
> 
>


Mime
  • Unnamed multipart/alternative (inline, None, 0 bytes)
View raw message