mesos-reviews mailing list archives

Site index · List index
Message view « Date » · « Thread »
Top « Date » · « Thread »
From Mesos Reviewbot Windows <revi...@mesos.apache.org>
Subject Re: Review Request 68104: Implemented authorization for agent `GET_RESOURCE_PROROVIDER` calls.
Date Mon, 30 Jul 2018 10:01:30 GMT

-----------------------------------------------------------
This is an automatically generated e-mail. To reply, visit:
https://reviews.apache.org/r/68104/#review206590
-----------------------------------------------------------



FAIL: Some of the unit tests failed. Please check the relevant logs.

Reviews applied: `['68103', '68104']`

Failed command: `Start-MesosCITesting`

All the build artifacts available at: http://dcos-win.westus.cloudapp.azure.com/artifacts/mesos-reviewbot-testing/2000/mesos-review-68104

Relevant logs:

- [mesos-tests-stdout.log](http://dcos-win.westus.cloudapp.azure.com/artifacts/mesos-reviewbot-testing/2000/mesos-review-68104/logs/mesos-tests-stdout.log):

```
[----------] 9 tests from Endpoint/SlaveEndpointTest (946 ms total)

[----------] 2 tests from ContainerizerType/DefaultContainerDNSFlagTest
[ RUN      ] ContainerizerType/DefaultContainerDNSFlagTest.ValidateFlag/0
[       OK ] ContainerizerType/DefaultContainerDNSFlagTest.ValidateFlag/0 (32 ms)
[ RUN      ] ContainerizerType/DefaultContainerDNSFlagTest.ValidateFlag/1
[       OK ] ContainerizerType/DefaultContainerDNSFlagTest.ValidateFlag/1 (36 ms)
[----------] 2 tests from ContainerizerType/DefaultContainerDNSFlagTest (70 ms total)

[----------] 1 test from IsolationFlag/CpuIsolatorTest
[ RUN      ] IsolationFlag/CpuIsolatorTest.ROOT_UserCpuUsage/0
[       OK ] IsolationFlag/CpuIsolatorTest.ROOT_UserCpuUsage/0 (680 ms)
[----------] 1 test from IsolationFlag/CpuIsolatorTest (702 ms total)

[----------] 1 test from IsolationFlag/MemoryIsolatorTest
[ RUN      ] IsolationFlag/MemoryIsolatorTest.ROOT_MemUsage/0
[       OK ] IsolationFlag/MemoryIsolatorTest.ROOT_MemUsage/0 (682 ms)
[----------] 1 test from IsolationFlag/MemoryIsolatorTest (703 ms total)

[----------] Global test environment tear-down
[==========] 1013 tests from 98 test cases ran. (511084 ms total)
[  PASSED  ] 1011 tests.
[  FAILED  ] 2 tests, listed below:
[  FAILED  ] ContentType/AgentAPITest.GetResourceProviders/0, where GetParam() = application/x-protobuf
[  FAILED  ] ContentType/AgentAPITest.GetResourceProviders/1, where GetParam() = application/json

 2 FAILED TESTS
  YOU HAVE 222 DISABLED TESTS

```

- [mesos-tests-stderr.log](http://dcos-win.westus.cloudapp.azure.com/artifacts/mesos-reviewbot-testing/2000/mesos-review-68104/logs/mesos-tests-stderr.log):

```
I0730 10:01:14.117033 41656 master.cpp:10917] Updating the state of task 97e2133f-50e7-45af-8e46-3750b3129849
of framework fcb1d046-be24-4dd5-9005-2d1e2953f587-0000 (latest state: TASK_KILLED, status
update state: TASK_KILLED)
I0730 10:01:14.117033 46456 slave.cpp:3939] Shutting down framework fcb1d046-be24-4dd5-9005-2d1e2953f587-0000
I0730 10:01:14.117033 46456 slave.cpp:6658] Shutting down executor '97e2133f-50e7-45af-8e46-3750b3129849'
of framework fcb1d046-be24-4dd5-9005-2d1e2953f587-0000 at executor(1)@192.10.1.6:51061
I0730 10:01:14.119036 41656 master.cpp:11016] Removing task 97e2133f-50e7-45af-8e46-3750b3129849
with resources cpus(allocated: *):4; mem(allocated: *):2048; disk(allocated: *):1024; ports(allocated:
*):[31000-32000] of fraI0730 10:01:13.954027 45360 exec.cpp:162] Version: 1.7.0
I0730 10:01:13.980051 38316 exec.cpp:236] Executor registered on agent fcb1d046-be24-4dd5-9005-2d1e2953f587-S0
I0730 10:01:13.984037 44996 executor.cpp:182] Received SUBSCRIBED event
I0730 10:01:13.988037 44996 executor.cpp:186] Subscribed executor on windows-02.enofukwu14ruplxn0gs3yzmsgf.xx.internal.cloudapp.net
I0730 10:01:13.989035 44996 executor.cpp:182] Received LAUNCH event
I0730 10:01:13.993038 44996 executor.cpp:679] Starting task 97e2133f-50e7-45af-8e46-3750b3129849
I0730 10:01:14.072033 44996 executor.cpp:499] Running 'D:\DCOS\mesos\src\mesos-containerizer.exe
launch <POSSIBLY-SENSITIVE-DATA>'
I0730 10:01:14.081030 44996 executor.cpp:693] Forked command at 48112
I0730 10:01:14.120071 43776 exec.cpp:445] Executor asked to shutdown
I0730 10:01:14.121038 44996 executor.cpp:182] Received SHUTDOWN event
I0730 10:01:14.121038 44996 executor.cpp:796] Shutting down
I0730 10:01:14.121038 44996 executor.cpp:909] Sending SIGTERM to process tree at pid 48mework
fcb1d046-be24-4dd5-9005-2d1e2953f587-0000 on agent fcb1d046-be24-4dd5-9005-2d1e2953f587-S0
at slave(462)@192.10.1.6:49351 (windows-02.enofukwu14ruplxn0gs3yzmsgf.xx.internal.cloudapp.net)
I0730 10:01:14.120071 46456 slave.cpp:931] Agent terminating
W0730 10:01:14.120071 46456 slave.cpp:3935] Ignoring shutdown framework fcb1d046-be24-4dd5-9005-2d1e2953f587-0000
because it is terminating
I0730 10:01:14.123036 47368 master.cpp:1330] Agent fcb1d046-be24-4dd5-9005-2d1e2953f587-S0
at slave(462)@192.10.1.6:49351 (windows-02.enofukwu14ruplxn0gs3yzmsgf.xx.internal.cloudapp.net)
disconnected
I0730 10:01:14.123036 47368 master.cpp:3340] Disconnecting agent fcb1d046-be24-4dd5-9005-2d1e2953f587-S0
at slave(462)@192.10.1.6:49351 (windows-02.enofukwu14ruplxn0gs3yzmsgf.xx.internal.cloudapp.net)
I0730 10:01:14.123036 47368 master.cpp:3359] Deactivating agent fcb1d046-be24-4dd5-9005-2d1e2953f587-S0
at slave(462)@192.10.1.6:49351 (windows-02.enofukwu14ruplxn0gs3yzmsgf.xx.internal.cloudapp.net)
I0730 10:01:14.125042 40236 hierarchical.cpp:345] Removed framework fcb1d046-be24-4dd5-9005-2d1e2953f587-0000
I0730 10:01:14.125042 46456 containerizer.cpp:2407] Destroying container 3845084a-4f92-47df-a1ad-e9d906b8b913
in RUNNING state
I0730 10:01:14.125042 46456 containerizer.cpp:3021] Transitioning the state of container 3845084a-4f92-47df-a1ad-e9d906b8b913
from RUNNING to DESTROYING
I0730 10:01:14.125042 40236 hierarchical.cpp:768] Agent fcb1d046-be24-4dd5-9005-2d1e2953f587-S0
deactivated
I0730 10:01:14.126036 46456 launcher.cpp:155] Asked to destroy container 3845084a-4f92-47df-a1ad-e9d906b8b913
I0730 10:01:14.191028 48780 containerizer.cpp:2860] Container 3845084a-4f92-47df-a1ad-e9d906b8b913
has exited
I0730 10:01:14.218040 47944 master.cpp:1172] Master terminating
I0730 10:01:14.220032 37728 hierarchical.cpp:611] Removed agent fcb1d046-be24-4dd5-9005-2d1e2953f587-S0
I0730 10:01:14.822047 40112 process.cpp:926] Stopped the socket accept loop
```

- Mesos Reviewbot Windows


On July 30, 2018, 8:57 a.m., Benjamin Bannier wrote:
> 
> -----------------------------------------------------------
> This is an automatically generated e-mail. To reply, visit:
> https://reviews.apache.org/r/68104/
> -----------------------------------------------------------
> 
> (Updated July 30, 2018, 8:57 a.m.)
> 
> 
> Review request for mesos, Chun-Hung Hsiao and Jan Schlicht.
> 
> 
> Bugs: MESOS-8314
>     https://issues.apache.org/jira/browse/MESOS-8314
> 
> 
> Repository: mesos
> 
> 
> Description
> -------
> 
> Implemented authorization for agent `GET_RESOURCE_PROROVIDER` calls.
> 
> 
> Diffs
> -----
> 
>   src/slave/http.cpp ab5864d9fd2fde478ed7da2ca7ed8abedc72c7c5 
>   src/tests/api_tests.cpp 182622a62d350ebefc891a385de3f2d35a7c0243 
> 
> 
> Diff: https://reviews.apache.org/r/68104/diff/1/
> 
> 
> Testing
> -------
> 
> `make check`
> 
> 
> Thanks,
> 
> Benjamin Bannier
> 
>


Mime
  • Unnamed multipart/alternative (inline, None, 0 bytes)
View raw message