mesos-reviews mailing list archives

Site index · List index
Message view « Date » · « Thread »
Top « Date » · « Thread »
From Mesos Reviewbot Windows <revi...@mesos.apache.org>
Subject Re: Review Request 68104: Implemented authorization for agent `GET_RESOURCE_PROVIDER` calls.
Date Tue, 31 Jul 2018 11:22:06 GMT

-----------------------------------------------------------
This is an automatically generated e-mail. To reply, visit:
https://reviews.apache.org/r/68104/#review206651
-----------------------------------------------------------



FAIL: Some of the unit tests failed. Please check the relevant logs.

Reviews applied: `['68103', '68104']`

Failed command: `Start-MesosCITesting`

All the build artifacts available at: http://dcos-win.westus.cloudapp.azure.com/artifacts/mesos-reviewbot-testing/2010/mesos-review-68104

Relevant logs:

- [mesos-tests-stdout.log](http://dcos-win.westus.cloudapp.azure.com/artifacts/mesos-reviewbot-testing/2010/mesos-review-68104/logs/mesos-tests-stdout.log):

```
[----------] 9 tests from Endpoint/SlaveEndpointTest (929 ms total)

[----------] 2 tests from ContainerizerType/DefaultContainerDNSFlagTest
[ RUN      ] ContainerizerType/DefaultContainerDNSFlagTest.ValidateFlag/0
[       OK ] ContainerizerType/DefaultContainerDNSFlagTest.ValidateFlag/0 (32 ms)
[ RUN      ] ContainerizerType/DefaultContainerDNSFlagTest.ValidateFlag/1
[       OK ] ContainerizerType/DefaultContainerDNSFlagTest.ValidateFlag/1 (37 ms)
[----------] 2 tests from ContainerizerType/DefaultContainerDNSFlagTest (72 ms total)

[----------] 1 test from IsolationFlag/CpuIsolatorTest
[ RUN      ] IsolationFlag/CpuIsolatorTest.ROOT_UserCpuUsage/0
[       OK ] IsolationFlag/CpuIsolatorTest.ROOT_UserCpuUsage/0 (625 ms)
[----------] 1 test from IsolationFlag/CpuIsolatorTest (648 ms total)

[----------] 1 test from IsolationFlag/MemoryIsolatorTest
[ RUN      ] IsolationFlag/MemoryIsolatorTest.ROOT_MemUsage/0
[       OK ] IsolationFlag/MemoryIsolatorTest.ROOT_MemUsage/0 (680 ms)
[----------] 1 test from IsolationFlag/MemoryIsolatorTest (706 ms total)

[----------] Global test environment tear-down
[==========] 1013 tests from 98 test cases ran. (511266 ms total)
[  PASSED  ] 1011 tests.
[  FAILED  ] 2 tests, listed below:
[  FAILED  ] ContentType/AgentAPITest.GetResourceProviders/0, where GetParam() = application/x-protobuf
[  FAILED  ] ContentType/AgentAPITest.GetResourceProviders/1, where GetParam() = application/json

 2 FAILED TESTS
  YOU HAVE 222 DISABLED TESTS

```

- [mesos-tests-stderr.log](http://dcos-win.westus.cloudapp.azure.com/artifacts/mesos-reviewbot-testing/2010/mesos-review-68104/logs/mesos-tests-stderr.log):

```
I0731 11:21:49.415030 50408 master.cpp:10917] Updating the state of task 007f0173-d0d3-4f8a-a6ae-5c6b17b727a8
of framework 1b290b3b-4469-448d-8fca-f9840778b748-0000 (latest state: TASK_KILLED, status
update state: TASK_KILLED)
I0731 11:21:49.415030 44552 slave.cpp:3939] Shutting down framework 1b290b3b-4469-448d-8fca-f9840778b748-0000
I0731 11:21:49.415693 44552 slave.cpp:6658] Shutting down executor '007f0173-d0d3-4f8a-a6ae-5c6b17b727a8'
of framework 1b290b3b-4469-448d-8fca-f9840778b748-0000 at executor(1)@192.10.1.6:49239
I0731 11:21:49.417690 44552 slave.cpp:931] Agent terminating
W0731 11:21:49.417690 44552 slave.cpp:3935] Ignoring shutdown framework 1b290b3b-4469-448d-8fca-f9840778b748-0000
because it is terminating
I0731 11:21:49.417690 50408 master.cpp:11016] Removing task 007f0173-d0d3-4f8a-a6ae-5c6b17b727a8
with resources cpus(allocated: *):4; mem(allocated: *):2048; disk(allocated: *):1024; ports(allocated:
*):[31000-32000] of framework 1b290b3b-4469-448d-8fca-f9840778b748-0000 on agent 1I0731 11:21:49.247696
48276 exec.cpp:162] Version: 1.7.0
I0731 11:21:49.273716 50344 exec.cpp:236] Executor registered on agent 1b290b3b-4469-448d-8fca-f9840778b748-S0
I0731 11:21:49.276705 50884 executor.cpp:182] Received SUBSCRIBED event
I0731 11:21:49.281693 50884 executor.cpp:186] Subscribed executor on windows-02.enofukwu14ruplxn0gs3yzmsgf.xx.internal.cloudapp.net
I0731 11:21:49.281693 50884 executor.cpp:182] Received LAUNCH event
I0731 11:21:49.286708 50884 executor.cpp:679] Starting task 007f0173-d0d3-4f8a-a6ae-5c6b17b727a8
I0731 11:21:49.368700 50884 executor.cpp:499] Running 'D:\DCOS\mesos\src\mesos-containerizer.exe
launch <POSSIBLY-SENSITIVE-DATA>'
I0731 11:21:49.376683 50884 executor.cpp:693] Forked command at 46460
I0731 11:21:49.417690 50276 exec.cpp:445] Executor asked to shutdown
I0731 11:21:49.418694 50884 executor.cpp:182] Received SHUTDOWN event
I0731 11:21:49.418694 50884 executor.cpp:796] Shutting down
I0731 11:21:49.418694 50884 executor.cpp:909] Sending SIGTERM to process tree at pid 46b290b3b-4469-448d-8fca-f9840778b748-S0
at slave(462)@192.10.1.6:63931 (windows-02.enofukwu14ruplxn0gs3yzmsgf.xx.internal.cloudapp.net)
I0731 11:21:49.421685 50408 master.cpp:1330] Agent 1b290b3b-4469-448d-8fca-f9840778b748-S0
at slave(462)@192.10.1.6:63931 (windows-02.enofukwu14ruplxn0gs3yzmsgf.xx.internal.cloudapp.net)
disconnected
I0731 11:21:49.421685 50408 master.cpp:3340] Disconnecting agent 1b290b3b-4469-448d-8fca-f9840778b748-S0
at slave(462)@192.10.1.6:63931 (windows-02.enofukwu14ruplxn0gs3yzmsgf.xx.internal.cloudapp.net)
I0731 11:21:49.421685 49432 hierarchical.cpp:345] Removed framework 1b290b3b-4469-448d-8fca-f9840778b748-0000
I0731 11:21:49.422698 50408 master.cpp:3359] Deactivating agent 1b290b3b-4469-448d-8fca-f9840778b748-S0
at slave(462)@192.10.1.6:63931 (windows-02.enofukwu14ruplxn0gs3yzmsgf.xx.internal.cloudapp.net)
I0731 11:21:49.422698 50736 hierarchical.cpp:768] Agent 1b290b3b-4469-448d-8fca-f9840778b748-S0
deactivated
I0731 11:21:49.422698 41336 containerizer.cpp:2407] Destroying container a2ffed56-3a36-49a9-9098-cfc506149ded
in RUNNING state
I0731 11:21:49.423691 41336 containerizer.cpp:3021] Transitioning the state of container a2ffed56-3a36-49a9-9098-cfc506149ded
from RUNNING to DESTROYING
I0731 11:21:49.423691 41336 launcher.cpp:155] Asked to destroy container a2ffed56-3a36-49a9-9098-cfc506149ded
I0731 11:21:49.455708 50736 containerizer.cpp:2860] Container a2ffed56-3a36-49a9-9098-cfc506149ded
has exited
I0731 11:21:49.484689 47144 master.cpp:1172] Master terminating
I0731 11:21:49.486686 47164 hierarchical.cpp:611] Removed agent 1b290b3b-4469-448d-8fca-f9840778b748-S0
I0731 11:21:50.233690 51216 process.cpp:926] Stopped the socket accept loop
```

- Mesos Reviewbot Windows


On July 31, 2018, 10:19 a.m., Benjamin Bannier wrote:
> 
> -----------------------------------------------------------
> This is an automatically generated e-mail. To reply, visit:
> https://reviews.apache.org/r/68104/
> -----------------------------------------------------------
> 
> (Updated July 31, 2018, 10:19 a.m.)
> 
> 
> Review request for mesos, Chun-Hung Hsiao and Jan Schlicht.
> 
> 
> Bugs: MESOS-8314
>     https://issues.apache.org/jira/browse/MESOS-8314
> 
> 
> Repository: mesos
> 
> 
> Description
> -------
> 
> Implemented authorization for agent `GET_RESOURCE_PROVIDER` calls.
> 
> 
> Diffs
> -----
> 
>   src/slave/http.cpp ab5864d9fd2fde478ed7da2ca7ed8abedc72c7c5 
>   src/tests/api_tests.cpp 182622a62d350ebefc891a385de3f2d35a7c0243 
> 
> 
> Diff: https://reviews.apache.org/r/68104/diff/2/
> 
> 
> Testing
> -------
> 
> `make check`
> 
> 
> Thanks,
> 
> Benjamin Bannier
> 
>


Mime
  • Unnamed multipart/alternative (inline, None, 0 bytes)
View raw message